{"text_format":"1","workbook":"xlsx","n_sheets":19,"sheets":["Pres & Prop Rev","Rate Design","Exh 1","Exh 2","Exh 3","LIRAP","ERM Offset","Sch 98 REC Revenue","ROR","Bill Determ","Bill Impact","WA Sch 25","Lighting summary","St Lts","Area Lts","Capital Recovery Factor Calc","Block Data","Rev Runs 12MEJUNE2013","LED Rates"],"not_rendered":{"charts":0,"images":0,"macros":1,"external_links":0,"defined_names":44,"comments":8,"pivot_tables":0},"unopened":[],"bounds":{"document_bytes":16777216,"sheet_cells":100000,"rows_first":2000,"rows_last":500,"rows_between":2000,"halvings":0,"cell_chars":16384,"cell_head_chars":4096},"cells_cut":0,"cells_raw":0,"read":"whole","date_system":"1900"}

{"sheet":"Pres & Prop Rev","index":0,"n_rows":300,"n_cols":16,"rows_kept":300,"cut":false,"hidden":false,"merged":[[5,15,10,17],[94,1,95,7]]}
[]
[null,{"$f":"IF(Base1_Billing2=2,\"BILLED\",\"\")","v":""}]
[]
["WORK PAPER",null," ","RESIDENTIAL","GENERAL SVC. ","LG. GEN. SVC.","EX LG GEN SVC","PUMPING","ST & AREA LTG"]
["REFERENCE",null,"TOTAL","SCHEDULE 1","SCH. 11,12","SCH. 21,22","SCHEDULE 25","SCH. 30, 31, 32","SCH. 41-48",null,null,null,null,null,null,"Print Header for all printed pages on this worksheet:"]
[null,"PRESENT BILL DETERMINANTS",null,null,null,null,null,null,null,null,null,"Calculate all revenue exhibits using  ____ rates:",null,null,null,{"$f":"\"AVISTA UTILITIES\nWASHINGTON ELECTRIC\nPRO FORMA REVENUE UNDER PRESENT AND PROPOSED \"&N9&\" RATES\n12 MONTHS ENDED DECEMBER 31, 2015\"","v":"AVISTA UTILITIES\nWASHINGTON ELECTRIC\nPRO FORMA REVENUE UNDER PRESENT AND PROPOSED BASE TARIFF RATES\n12 MONTHS ENDED DECEMBER 31, 2015"}]
[null,"KILOWATT HOURS (KWHS)",null,null,null,null,null,null,null,null,"1)","BASE TARIFF"]
["PDE-E-10","BLOCK 1",null,{"$f":"'Bill Determ'!$B$9","v":1592525923},{"$f":"'Bill Determ'!$B$17","v":420252327},{"$f":"'Bill Determ'!$B$28","v":1271405693},{"$f":"'Bill Determ'!$B$37","v":125425699},{"$f":"SUM('Bill Determ'!$B$41:$C$41)","v":49734289},null,null,null,"or",null,1]
{"$rows_left_out":293}
{"sheet":"Rate Design","index":1,"n_rows":127,"n_cols":23,"rows_kept":127,"cut":false,"hidden":false,"merged":[]}
["PRESENT RATES",null,null,1,2,3,4,5,6,null,null,null,null,"Tiers - used for bill comparisons"]
[null,null,"TOTAL","SCH. 1","SCH. 11,12","SCH. 21,22","SCH. 25","SCH. 30, 31, 32",null,null,null,"Range Name",null,"SCHEDULE 1","SCH. 11,12","SCH. 21,22","SCHEDULE 25","SCH. 30, 31, 32"]
[null,"Base Tariff Rates"]
[1,"BASIC CHARGE",null,8,15,0,0,15]
[2,"BLOCK 1 PER KWH",null,{"$f":"7.133+0.236","v":7.3689999999999998},{"$f":"11.031+0.36","v":11.391},{"$f":"6.878+0.221","v":7.0990000000000002},{"$f":"5.539+0.169","v":5.7079999999999993},{"$f":"9.253+0.292","v":9.5449999999999999},null,null,null,null,null,800,3650,250000,500000]
[3,"BLOCK 2 PER KWH",null,{"$f":"8.299+0.274","v":8.5730000000000004},{"$f":"8.105+0.265","v":8.370000000000001},{"$f":"6.15+0.199","v":6.3490000000000002},{"$f":"4.983+0.152","v":5.1349999999999998},{"$f":"6.609+0.208","v":6.8170000000000002},null,null,null,null,null,1500,9999999,9999999,9999999]
[4,"BLOCK 3 PER KWH",null,{"$f":"9.728+0.322","v":10.049999999999999},0,0,4.391,0,null,null,null,"Rates_Base_Present",null,9999999,9999999,9999999,9999999]
[5,"BLOCK 4 PER KWH"]
{"$rows_left_out":120}
{"sheet":"Exh 1","index":2,"n_rows":54,"n_cols":23,"rows_kept":54,"cut":false,"hidden":false,"merged":[[5,13,5,15],[4,0,4,15],[0,18,2,19],[0,0,0,15],[1,0,1,15],[2,0,2,15],[3,0,3,15]]}
["AVISTA UTILITIES",null,null,null,null,null,null,null,null,null,null,null,null,null,null,null,null,null,"This worksheet pulls data from 'Pres & Prop Rev' tab."]
["WASHINGTON ELECTRIC"]
["PROPOSED INCREASE BY SERVICE SCHEDULE"]
["12 MONTHS ENDED DECEMBER 31, 2015"]
["(000s of Dollars)"]
[null,null,null,null,null,null,null,null,null,null,null,null,null,"To be updated to reflect Nov. 1 Power Supply update & ERM offset."]
[]
[null,null,null,"Base Tariff",null,"Base Tariff","Base","Total Billed",null,"Percent",null,null,"Expiration of ",null,null,"Percent ",null,null,null,"Percent ","Total Billed"]
{"$rows_left_out":47}
{"sheet":"Exh 2","index":3,"n_rows":20,"n_cols":12,"rows_kept":20,"cut":false,"hidden":true,"merged":[]}
["AVISTA UTILITIES",null,null,null,null,null,null,null,null,null,null,"This worksheet pulls data from 'ROR' tab."]
["WASHINGTON ELECTRIC"]
["PRESENT & PROPOSED RATES OF RETURN BY RATE SCHEDULE"]
["12 MONTHS ENDED JUNE 30, 2013"]
[]
[]
[]
[]
{"$rows_left_out":13}
{"sheet":"Exh 3","index":4,"n_rows":59,"n_cols":24,"rows_kept":59,"cut":false,"hidden":false,"merged":[[8,0,8,2],[3,10,4,12]]}
["AVISTA UTILITIES",null,null,null,null,null,null,null,null,null,null,null,null,null,null,null,null,"This worksheet uses Base & Billing rates from 'Rate Design' tab."]
["WASHINGTON ELECTRIC"]
["PRESENT AND PROPOSED RATE COMPONENTS BY SCHEDULE"]
[null,null,null,null,null,null,null,null,null,null,"To be updated to reflect Nov. 1 Power Supply update & ERM offset."]
[]
[]
[null,null,null,null,null,null,null,"General ","Sch. 93/98","Sch. 93/94","Sch. 92","Proposed ","Proposed ","Sch. 98","Sch. 93/94","Proposed Billing"]
[null,null,null,"Base Tariff","Present","Present ",null,"Rate ","ERM/REC","ERM/BPA","LIRAP","Billing ","Base Tariff","REC Revenue","ERM/BPA","Rate With",null,null,null,null,null,null,"GRC"]
{"$rows_left_out":52}
{"sheet":"LIRAP","index":5,"n_rows":45,"n_cols":31,"rows_kept":45,"cut":false,"hidden":false,"merged":[]}
[]
[null,"Avista Electric"]
[null,"LIRAP Rate Calculation"]
[null,"UE-140188"]
[null,null,null,"Present",null,"Present","Settlement",null,"Present",null,"Adjusted ",null,"Sch 025",null,"Adjusted",null,{"$f":"S24","v":0.05},null,"Settlement",null,"Settlement"]
[null,null,null,"Sch. 92",null,"Billing ","Billing ",null,"LIRAP",null,"LIRAP",null,"3rd Block Revenue ",null,"LIRAP",null,"LIRAP",null,"LIRAP",null,"Sch 92",null,"Rate ","Revenue ",null,"IEP"]
[null,null,null,"kWh Rate",null,"Determinants","Determinants *",null,"Revenue",null,"Revenue",null,"Impact",null,"Revenue",null,"Increase",null,"Revenue",null,"kWh Rate",null,"Impact","Impact",null,"Present"]
[1,"Residential",1,6.9999999999999999E-4,null,{"$f":"'Pres & Prop Rev'!D23","v":2437508068},2437508067,null,{"$f":"D8*F8","v":1706255.6476},null,{"$f":"G8*D8","v":1706255.6469000001},null,{"$f":"(K8/($K$20))*$K$29","v":83990.839691038564},null,{"$f":"K8+M8","v":1790246.4865910385},null,{"$f":"S8-O8","v":89512.324329552008},null,{"$f":"O8*(1+$S$24)","v":1879758.8109205905},null,{"$f":"ROUND(S8/G8,5)","v":7.6999999999999996E-4},null,{"$f":"ROUND(U8-D8,5)","v":6.9999999999999994E-5},{"$f":"S8-I8","v":173503.16332059051},{"$f":"Q8/O8","v":5.0000000000000044E-2},null,null,1,"Residential",1,{"$f":"(I8/$I$20)*$I$29","v":80050.342562915219}]
{"$rows_left_out":38}
{"sheet":"ERM Offset","index":6,"n_rows":28,"n_cols":22,"rows_kept":28,"cut":false,"hidden":false,"merged":[[0,0,0,10],[1,0,1,10],[2,0,2,10],[3,0,3,10],[4,8,5,10]]}
["AVISTA UTILITIES"]
["WASHINGTON ELECTRIC"]
["ERM REVENUE DECREASE BY SERVICE SCHEDULE"]
["(000s of Dollars)"]
[null,null,null,null,null,null,null,null,"To be updated to reflect Nov. 1 Power Supply update & ERM offset."]
[]
[]
[null,null,null,"Present Base ",null,"ERM",null,"Percentage",null,null,"Billing "]
{"$rows_left_out":21}
{"sheet":"Sch 98 REC Revenue","index":7,"n_rows":22,"n_cols":8,"rows_kept":22,"cut":false,"hidden":false,"merged":[[0,0,0,7],[1,0,1,7],[2,0,2,7],[3,0,3,7]]}
["AVISTA UTILITIES"]
["WASHINGTON ELECTRIC"]
["PROPOSED REC REVENUE DECREASE BY SERVICE SCHEDULE"]
["(000s of Dollars)"]
[]
[]
[]
[null,null,null,null,null,"Billing ",null,"REC"]
{"$rows_left_out":15}
{"sheet":"ROR","index":8,"n_rows":79,"n_cols":11,"rows_kept":79,"cut":false,"hidden":false,"merged":[]}
[null,"AVISTA UTILITIES"]
[null,"WASHINGTON ELECTRIC"]
[null,"PRESENT & PROPOSED RATE OF RETURN BY RATE SCHEDULE"]
[null,"12 MONTHS ENDED JUNE 30, 2013"]
[]
[]
[null,null,"Total","Sch 1","Sch 11","Sch 21","Sch 25","Sch 31","Schs 41-48"]
[null,"Total Rate Base",{"$f":"SUM(D8:I8)","v":1365444000},665460004,148788571,332574904,158469076,32921768,27229677,"from COS"]
{"$rows_left_out":72}
{"sheet":"Bill Determ","index":9,"n_rows":87,"n_cols":7,"rows_kept":87,"cut":false,"hidden":false,"merged":[]}
["AVISTA UTILITIES"]
["WASHINGTON ELECTRIC"]
["ACTUAL / PRO FORMA BILLING DETERMINANTS BY RATE SCHEDULE"]
["12 MONTHS ENDED DECEMBER 31, 2015"]
[]
[]
[]
["Schedule 1","0-800 kwhs","801-1500 kwhs","over 1500 kwhs","Total kwhs","Total Billings(2)"]
{"$rows_left_out":80}
{"sheet":"Bill Impact","index":10,"n_rows":24,"n_cols":13,"rows_kept":24,"cut":false,"hidden":false,"merged":[]}
[]
[]
["Schedule 001 Bill Impact"]
[]
[]
[]
["Schedule 001 Present",null,null,null,null,null,"Schedule 001 Proposed"]
[null,"Basic Charge","Block 1","Block 2","Total Bill",null,"Basic Charge","Block 1","Block 2","Total Bill",null,"Bill Impact","% Change"]
{"$rows_left_out":17}
{"sheet":"WA Sch 25","index":11,"n_rows":167,"n_cols":23,"rows_kept":167,"cut":false,"hidden":true,"merged":[]}
["Washington Schedule 25 Billing Determinants",null,null,null,null,null,null,null,null,null,null,null,null,null,null,null,"1st",{"$f":"Q2","v":500000},{"$f":"R2","v":6000000}]
[null,null,null,null,null,null,null,null,null,null,null,null,null,null,null,"12-mo Ended",500000,6000000,99999999,null,"Present","Proposed ","Annual "]
[null,"KWHs","Acct No.","2012-07-01","2012-08-01","2012-09-01","2012-10-01","2012-11-01","2012-12-01","2013-01-01","2013-02-01","2013-03-01","2013-04-01","2013-05-01","2013-06-01","Total","kwhs/mo","kwhs/mo","kwhs/mo",null,"LIRAP","LIRAP","Bill Impact"]
[1,"BF Goodrich",770037736,4920409,5471306,5089955,4422298,4694815,5445493,5033826,4877725,5530526,5120850,4452916,3330474,{"$f":"SUM(D4:O4)","v":58390593},{"$f":"Q$2*12-SUMPRODUCT(--($D4:$O4<=Q$2),Q$2-$D4:$O4)","v":6000000},{"$f":"R$2*12-SUM($Q4:Q4)-SUMPRODUCT(--($D4:$O4<=R$2),R$2-$D4:$O4)","v":52390593},{"$f":"S$2*12-SUM($Q4:R4)-SUMPRODUCT(--($D4:$O4<=S$2),S$2-$D4:$O4)","v":0},null,{"$f":"(Q4+R4)*LIRAP!$D$14","v":26859.672780000001},{"$f":"(Q4+R4)*LIRAP!$U$14","v":29779.202430000001},{"$f":"V4-U4","v":2919.5296500000004}]
[2,"Boise Cascade Plywood",500017,3325249,3446923,3236491,3368492,3063022,2609788,2963335,3091540,3348299,3278856,3200870,3189022,38121887,{"$f":"Q$2*12-SUMPRODUCT(--($D5:$O5<=Q$2),Q$2-$D5:$O5)","v":6000000},{"$f":"R$2*12-SUM($Q5:Q5)-SUMPRODUCT(--($D5:$O5<=R$2),R$2-$D5:$O5)","v":32121887},{"$f":"S$2*12-SUM($Q5:R5)-SUMPRODUCT(--($D5:$O5<=S$2),S$2-$D5:$O5)","v":0},null,{"$f":"(Q5+R5)*LIRAP!$D$14","v":17536.068019999999},{"$f":"(Q5+R5)*LIRAP!$U$14","v":19442.162370000002},{"$f":"V5-U5","v":1906.094350000003}]
[3,"Boise Cascade Sawmill",500018,1245605,1206076,1212763,1410623,1428388,1462269,1571434,1385908,1351486,1442672,1338567,1310046,16365837,6000000,{"$f":"R$2*12-SUM($Q6:Q6)-SUMPRODUCT(--($D6:$O6<=R$2),R$2-$D6:$O6)","v":10365837},{"$f":"S$2*12-SUM($Q6:R6)-SUMPRODUCT(--($D6:$O6<=S$2),S$2-$D6:$O6)","v":0},null,{"$f":"(Q6+R6)*LIRAP!$D$14","v":7528.2850200000003},{"$f":"(Q6+R6)*LIRAP!$U$14","v":8346.5768700000008},818.29185000000052]
[4,"City of Spokane Sewage Treatment Plt",1900002,1349275,1305515,1318655,1341383,1351362,1419006,1455130,1340094,1352240,1282447,1333145,1344481,16192733,6000000,{"$f":"R$2*12-SUM($Q7:Q7)-SUMPRODUCT(--($D7:$O7<=R$2),R$2-$D7:$O7)","v":10192733},{"$f":"S$2*12-SUM($Q7:R7)-SUMPRODUCT(--($D7:$O7<=S$2),S$2-$D7:$O7)","v":0},null,{"$f":"(Q7+R7)*LIRAP!$D$14","v":7448.6571800000002},{"$f":"(Q7+R7)*LIRAP!$U$14","v":8258.2938300000005},809.63665000000037]
[5,"Deaconess Medical Center",1900011,1871797,1846297,1652204,1708501,1667005,1724612,1779078,1558513,1704854,1661570,1706762,1676678,20557871,6000000,{"$f":"R$2*12-SUM($Q8:Q8)-SUMPRODUCT(--($D8:$O8<=R$2),R$2-$D8:$O8)","v":14557871},{"$f":"S$2*12-SUM($Q8:R8)-SUMPRODUCT(--($D8:$O8<=S$2),S$2-$D8:$O8)","v":0},null,{"$f":"(Q8+R8)*LIRAP!$D$14","v":9456.6206600000005},{"$f":"(Q8+R8)*LIRAP!$U$14","v":10484.514210000001},1027.8935500000007]
{"$rows_left_out":160}
{"sheet":"Lighting summary","index":12,"n_rows":44,"n_cols":16,"rows_kept":44,"cut":false,"hidden":false,"merged":[[6,2,6,3],[6,5,6,6]]}
[null,"AVISTA UTILITIES"]
[null,"WASHINGTON ELECTRIC"]
[null,"STREET & AREA LIGHT REVENUE UNDER PRESENT & PROPOSED RATES"]
[null,"12 MONTHS ENDED JUNE 30, 2013"]
[]
[]
[null,null,{"$f":"\"Present \"&IF(Base1_Billing2=2,\"Billing \",\"\")&\"Rates(1)\"","v":"Present Rates(1)"},{"$f":"\"Present \"&IF(Base1_Billing2=2,\"Billing\",\"\")&\" Rates\"","v":"Present  Rates"},null,{"$f":"\"Proposed \"&IF(Base1_Billing2=2,\"Billing \",\"\")&\"Rates(2)\"","v":"Proposed Rates(2)"},{"$f":"\"Proposed \"&IF(Base1_Billing2=2,\"Billing \",\"\")&\"Rates\"","v":"Proposed Rates"},null,"% Revenue Change"]
[null,null,"Monthly ","Annual",null,"Monthly ","Annual",null,null,null,null,"Target Base",null,null,"Present","Proposed"]
{"$rows_left_out":37}
{"sheet":"St Lts","index":13,"n_rows":87,"n_cols":74,"rows_kept":87,"cut":false,"hidden":false,"merged":[]}
["Street Light Summary",null,null,null,null,null,null,null,"WASHINGTON Street Lights",null,null,null,null,null,null,null,null,null,null,null,null,null,null,null,null,null,null,null,null,null,null,null,null,null,null,"% rate increase -->",{"$f":"'Lighting summary'!L11","v":1.2934586338647512E-2},{"$f":"'Lighting summary'!L12","v":1.2934586338647512E-2},{"$f":"'Lighting summary'!L13","v":1.2934586338647512E-2},{"$f":"'Lighting summary'!L14","v":1.2934586338647512E-2},{"$f":"'Lighting summary'!L15","v":1.2934586338647512E-2},null,null,null,null,null,null,null,null,null,null,null,null,null,null,null,"compare input Present Billing Rates to calculated Present Billing Rates",null,null,null,null,null,null,{"$f":"BE2","v":1.0401}]
["DWWPAOAE Report, as of 01/10/12",null,null,null,null,null,null,null,null,null,null,null,"Number of Lights(1)",null,null,null,null,null,"Present Rates",null,null,null,null,null,"Monthly Revenue at Present Rates",null,null,null,null,null,"Number of Lights",null,null,null,null,null,"Proposed Rates",null,null,null,null,null,"Monthly Revenue at Proposed Rates",null,null,null,null,null,null,"Present Billing Rates",null,null,null,null,null,{"$f":"-0.00067-0.00503","v":-5.7000000000000002E-3},{"$f":"1+'Lighting summary'!I39","v":1.0401},"Sch 91 & 93",null,null,null,null,null,"New Billing Rates",null,null,null,null,null,"Increase"]
[null,null,null,null,null,null,null,null,"Fixture Type","Pole Facility","Size","Sched","041","042","044","045","046",null,"041","042","044","045","046",null,"041","042","044","045","046",null,"041","042","044","045","046",null,"041","042","044","045","046",null,"041","042","044","045","046",null,"kwh","041","042","044","045","046",null,"Sch 93","041","042","044","045","046",null,null,"041","042","044","045","046",null,"041","042","044","045","046"]
[null,null,null,null,null,null,null,null,"Single Mercury Vapor","Direct Burial",4000,214,{"$f":"SUMIF($G:$G,TEXT(M$3,\"000\")&TEXT($L4,\"000\"),$E:$E)","v":75},0,0,0,0,null,13.89,0,0,0,0,null,{"$f":"IF(AND(M4<>0,S4=0),#VALUE!,M4*S4)","v":1041.75},{"$f":"IF(AND(N4<>0,T4=0),#VALUE!,N4*T4)","v":0},{"$f":"IF(AND(O4<>0,U4=0),#VALUE!,O4*U4)","v":0},{"$f":"IF(AND(P4<>0,V4=0),#VALUE!,P4*V4)","v":0},{"$f":"IF(AND(Q4<>0,W4=0),#VALUE!,Q4*W4)","v":0},null,{"$f":"M4","v":75},{"$f":"N4","v":0},0,0,0,null,{"$f":"ROUND(S4*(1+AK$1),2)","v":14.07},0,0,0,0,null,{"$f":"IF(AND(AE4<>0,AK4=0),#VALUE!,AE4*AK4)","v":1055.25},{"$f":"IF(AND(AF4<>0,AL4=0),#VALUE!,AF4*AL4)","v":0},{"$f":"IF(AND(AG4<>0,AM4=0),#VALUE!,AG4*AM4)","v":0},{"$f":"IF(AND(AH4<>0,AN4=0),#VALUE!,AH4*AN4)","v":0},{"$f":"IF(AND(AI4<>0,AO4=0),#VALUE!,AI4*AO4)","v":0},{"$f":"SUM(AQ4:AU4)-SUM(Y4:AC4)","v":13.5},42,14.21,null,null,null,null,null,{"$f":"ROUND(AW4*$BD$2,2)","v":-0.24},{"$f":"ROUND((S4*$BE$2)+$BD4-AX4,2)","v":0},null,null,null,null,null,null,{"$f":"AK4*$BL$1","v":14.634207},{"$f":"AL4*$BL$1","v":0},0,0,0,null,{"$f":"BL4-AX4","v":0.42420699999999911},{"$f":"BM4-AY4","v":0},{"$f":"BN4-AZ4","v":0},{"$f":"BO4-BA4","v":0},{"$f":"BP4-BB4","v":0}]
[null,"State","Sched","Rate Sub","# of Lights",null,null,null,"Single High-Pressure Sodium Vapor","Direct Burial","50W",234,0,129,0,0,0,null,0,13.04,0,0,0,null,{"$f":"IF(AND(M5<>0,S5=0),#VALUE!,M5*S5)","v":0},{"$f":"IF(AND(N5<>0,T5=0),#VALUE!,N5*T5)","v":1682.1599999999999},{"$f":"IF(AND(O5<>0,U5=0),#VALUE!,O5*U5)","v":0},{"$f":"IF(AND(P5<>0,V5=0),#VALUE!,P5*V5)","v":0},{"$f":"IF(AND(Q5<>0,W5=0),#VALUE!,Q5*W5)","v":0},null,{"$f":"M5","v":0},129,0,0,0,null,0,13.21,0,0,0,null,{"$f":"IF(AND(AE5<>0,AK5=0),#VALUE!,AE5*AK5)","v":0},{"$f":"IF(AND(AF5<>0,AL5=0),#VALUE!,AF5*AL5)","v":1704.0900000000001},0,0,0,21.930000000000291,20,null,13.45,null,null,null,null,{"$f":"ROUND(AW5*$BD$2,2)","v":-0.11},null,{"$f":"ROUND((T5*$BE$2)+$BD5-AY5,2)","v":0},null,null,null,null,null,{"$f":"AK5*$BL$1","v":0},{"$f":"AL5*$BL$1","v":13.739721000000001},{"$f":"AM5*$BL$1","v":0},{"$f":"AN5*$BL$1","v":0},{"$f":"AO5*$BL$1","v":0},null,{"$f":"BL5-AX5","v":0},{"$f":"BM5-AY5","v":0.28972100000000189},{"$f":"BN5-AZ5","v":0},{"$f":"BO5-BA5","v":0},{"$f":"BP5-BB5","v":0}]
[null,null,null,null,null,null,null,null,"High-Pressure Sodium Vapor","Dusk to Dawn","70W",335,0,0,0,0,41,null,0,0,0,0,3.36,null,0,0,0,0,137.76,null,0,0,0,0,41,null,0,0,0,0,3.4,null,0,0,0,0,139.4,1.6400000000000148,25,null,null,null,null,3.34,null,-0.14000000000000001,null,null,null,null,0.01,null,null,0,0,0,0,3.53634,null,0,0,0,0,0.19634000000000018]
[null,2,"041",214,{"$f":"75","v":75},null,{"$f":"IF(OR(ISBLANK(C7),ISBLANK(D7)),\"\",TEXT(C7,\"000\")&TEXT(D7,\"000\"))","v":"041214"},null,"Single Mercury Vapor","Wood Pole",7000,411,34,0,0,0,0,null,15.06,0,0,0,0,null,512.04,0,0,0,0,null,34,0,0,0,0,null,15.25,0,0,0,0,null,518.5,0,0,0,0,6.4600000000000364,80,15.21,null,null,null,null,null,-0.46,{"$f":"ROUND((S7*$BE$2)+$BD7-AX7,2)","v":-0.01},null,null,null,null,null,null,15.861525,0,0,0,0,null,0.65152499999999947,0,0,0,0]
[null,2,"041",411,34,null,"041411",null,"Mercury Vapor","Dusk to Dawn",7000,415,0,0,0,87,0,null,0,0,0,6.61,0,null,0,0,0,575.07000000000005,0,null,0,0,0,87,0,null,0,0,0,6.7,0,null,0,0,0,582.9,0,7.8299999999999272,80,null,null,null,6.43,null,null,-0.46,null,null,null,-0.01,null,null,null,0,0,0,6.9686700000000004,0,null,0,0,0,0.53867000000000065,0]
{"$rows_left_out":80}
{"sheet":"Area Lts","index":14,"n_rows":63,"n_cols":48,"rows_kept":63,"cut":false,"hidden":false,"merged":[]}
["Area Light Summary",null,null,null,null,null,null,null,"WASHINGTON Area Lights",null,null,null,null,null,null,null,null,null,"Monthly Rev.",null,null,null,null,null,null,{"$f":"SL_RateIncr","v":0},null,null,"% rate increase -->",{"$f":"'Lighting summary'!L16","v":1.2934586338647512E-2},null,null,"Monthly Rev.",null,null,-1.9499999999999999E-3,{"$f":"-0.00503-0.00067","v":-5.7000000000000002E-3},null,null,null,"compare input Present Billing Rates to calculated Present Billing Rates"]
["DWWPWMS.AREA_LIGHT_ASMBLY1, as of 2/10/11",null,null,null,null,null,null,null,null,null,null,null,"# of Lights(1)",null,null,"Pres. Rates",null,null,"at Pres. Rates",null,null,"# of Lights(1)",null,null,null,null,"# of Lights",null,null,"Prop. Rates",null,null,"at Prop. Rates",null,null,null,"Pres. Billing Rates",null,null,null,{"$f":"'St Lts'!BE2","v":1.0401},{"$f":"'St Lts'!BF2","v":"Sch 91 & 93"},null,"New Billing Rates",null,{"$f":"'Lighting summary'!I39","v":4.0100000000000004E-2},"Increase"]
[null,null,null,null,null,null,null,null,"Fixture Type","Pole Facility","Size","Sched","047","048",null,"047","048",null,"047","048",null,"047","048",null,null,null,"047","048",null,"047","048",null,"047","048",null,"kwh","047","048","Sch 59","Sch 93/94","047","048",null,"047","048",null,"047","048"]
[null,null,null,null,null,null,null,null,"Sodium Vapor","Granville w/16' decorative pole","100W","HAG",{"$f":"SUMIF($G:$G,TEXT(M$3,\"000\")&TEXT($L4,\"000\"),$E:$E)","v":0},0,null,29.14,{"$f":"P4","v":29.14},null,{"$f":"IF(AND(M4<>0,P4=0),#VALUE!,M4*P4)","v":0},{"$f":"IF(AND(N4<>0,Q4=0),#VALUE!,N4*Q4)","v":0},null,{"$f":"SUMIF($G:$G,TEXT(V$3,\"000\")&TEXT($L4,\"000\"),$E:$E)","v":0},0,null,null,null,{"$f":"M4","v":0},{"$f":"N4","v":0},null,{"$f":"ROUND(P4*(1+AD$1),2)","v":29.52},{"$f":"AD4","v":29.52},null,{"$f":"IF(AND(AA4<>0,AD4=0),#VALUE!,AA4*AD4)","v":0},{"$f":"IF(AND(AB4<>0,AE4=0),#VALUE!,AB4*AE4)","v":0},null,40,30.08,30,{"$f":"ROUND($AJ$1*$AJ4,2)","v":-0.08},{"$f":"ROUND($AK$1*$AJ4,2)","v":-0.23},{"$f":"ROUND(P4*$AO$2-AK4+AN4,2)","v":0},{"$f":"ROUND(Q4*$AO$2-AL4+AM4+AN4,2)","v":0},null,{"$f":"AD4*$AT$2","v":1.1837520000000001},{"$f":"AE4*$AT$2+AM4","v":1.1037520000000001},null,{"$f":"AR4-AK4","v":-28.896248},{"$f":"AS4-AL4","v":-28.896248}]
[null,"State","Sched","Rate Sub","# of Lights",null,null,null,"Sodium Vapor","Floodlight on existing standard","250W","HAH",95,9,null,21.56,{"$f":"P5","v":21.56},null,2048.1999999999998,194.04,null,95,9,null,null,null,{"$f":"M5","v":95},9,null,21.84,{"$f":"AD5","v":21.84},null,2074.8000000000002,196.56,null,107,21.81,21.6,{"$f":"ROUND($AJ$1*$AJ5,2)","v":-0.21},{"$f":"ROUND($AK$1*$AJ5,2)","v":-0.61},{"$f":"ROUND(P5*$AO$2-AK5+AN5,2)","v":0},{"$f":"ROUND(Q5*$AO$2-AL5+AM5+AN5,2)","v":0},null,{"$f":"AD5*$AT$2","v":0.87578400000000012},{"$f":"AE5*$AT$2+AM5","v":0.66578400000000015},null,{"$f":"AR5-AK5","v":-20.934215999999999},{"$f":"AS5-AL5","v":-20.934216000000003}]
[null,null,null,null,null,null,null,null,"Sodium Vapor","Kim light w/25' fiberglass pole","100W","HAI",15,3,null,28.14,28.14,null,422.1,84.42,null,15,3,null,null,null,15,3,null,28.5,{"$f":"AD6","v":28.5},null,427.5,85.5,null,40,29.04,28.96,-0.08,-0.23,0,0,null,{"$f":"AD6*$AT$2","v":1.1428500000000001},1.0628500000000001,null,-27.89715,-27.89715]
[null,"WA","047","HAH",95,null,{"$f":"IF(OR(ISBLANK(C7),ISBLANK(D7)),\"\",TEXT(C7,\"000\")&TEXT(D7,\"000\"))","v":"047HAH"},null,"Sodium Vapor","Post Top w/16' decorative pole","100W","HAP",0,0,null,27.79,27.79,null,0,0,null,0,0,null,null,null,0,0,null,28.15,28.15,null,0,0,null,40,28.67,28.59,-0.08,-0.23,0,0,null,1.1288150000000001,1.0488150000000001,null,-27.541185000000002,-27.541184999999999]
[null,"WA","047","HAI",15,null,{"$f":"IF(OR(ISBLANK(C8),ISBLANK(D8)),\"\",TEXT(C8,\"000\")&TEXT(D8,\"000\"))","v":"047HAI"},null,"Sodium Vapor","on existing standard","100W","HPA",609,881,null,13.36,13.36,null,8136.24,11770.16,null,609,881,null,null,null,609,881,null,13.53,13.53,null,8239.77,11919.93,null,40,13.67,13.59,-0.08,-0.23,0,0,null,0.54255300000000006,0.46255300000000005,null,-13.127447,-13.127447]
{"$rows_left_out":56}
{"sheet":"Capital Recovery Factor Calc","index":15,"n_rows":36,"n_cols":6,"rows_kept":36,"cut":false,"hidden":true,"merged":[[25,1,25,4]]}
[null,"Avista"]
[null,"Capital Recovery Factor Calculation"]
[null,"Proposed - UE-140188"]
[]
[]
[null,"Cost of Capital",null,null,null,"Source"]
[null,"Capital"]
[null,"Component"]
{"$rows_left_out":29}
{"sheet":"Block Data","index":16,"n_rows":101,"n_cols":21,"rows_kept":101,"cut":false,"hidden":true,"merged":[]}
[]
[null,null,null,null,null,null,null,null,null,null,null,null,null,null,null,null,null,null,null,null,"Rate Design"]
["WASHINGTON ELECTRIC SYSTEM"]
[null,null,"July","August","September","October","November","December","January","February","March","April","May","June","Annual Total",null,null,null,null,null,"May"]
["Rate Design Program Monthly Results"]
["Block ID 900","Schedule 001"]
[null,"Block 1",117669129,123766009,120879903,115292478,125210871,137873168,142115857,140917325,135542628,130705783,14978538,119292151,{"$f":"SUM(C7:N7)","v":1424243840},null,null,{"$f":"SUM(C7:L7,N7)","v":1409265302},{"$f":"R7/$R$10","v":0.64544820757525634},null,14978538]
[null,"Block 2",29167233,41014399,33822151,24022052,34477861,56677282,68578636,65463345,52517788,43107819,3538501,27377223,{"$f":"SUM(C8:N8)","v":479764290},null,null,{"$f":"SUM(C8:L8,N8)","v":476225789},{"$f":"R8/$R$10","v":0.21811299935855671},null,3538501]
{"$rows_left_out":94}
{"sheet":"Rev Runs 12MEJUNE2013","index":17,"n_rows":110,"n_cols":19,"rows_kept":110,"cut":false,"hidden":true,"merged":[]}
[]
[]
[]
[null,"Electric Revenue Meters Report by Location  Twelve Months Ended  for Report Date : '06/30/2013'"]
[]
[null,"State Cde:WA"]
[]
[null,null,null,"Meters"]
{"$rows_left_out":103}
{"sheet":"LED Rates","index":18,"n_rows":129,"n_cols":29,"rows_kept":129,"cut":false,"hidden":true,"merged":[[1,1,1,2],[2,1,2,2]]}
[]
[null,"Rates for New LED Street Lights"]
[null,"Washington"]
[]
[]
[]
[null,"60W LED","Present ",null,"Proposed",null,"High-Pressure Sodium Vapor",null,null,null,null,null,null,null,"Double","Granville","Post Top","Kim Light",null,"High-Pressure Sodium Vapor"]
[null,"LED Fixture & Install",{"$f":"155+74.17","v":229.17000000000002},null,{"$f":"155+74.17","v":229.17000000000002},null,"Present Rates","No  ","Wood  ","Pedestal   ","Direct   ","Developer ","Underground","Decorative","Wood","Direct ","Direct","Pedestal",null,"Present Rates","No  ","Wood  ","Pedestal   ","Direct   ","Developer "]
{"$rows_left_out":121}