{"text_format":"1","workbook":"xlsx","n_sheets":13,"sheets":["Pres & Prop Rev","Rate Design","Exh1","Exh2","Exh3","LIRAP","ROR","BFG","Bill Impact","Bill Determ","Block Usage","Big Schedules","Rev Runs CY"],"not_rendered":{"charts":0,"images":0,"macros":1,"external_links":0,"defined_names":19,"comments":8,"pivot_tables":0},"unopened":[],"bounds":{"document_bytes":16777216,"sheet_cells":100000,"rows_first":2000,"rows_last":500,"rows_between":2000,"halvings":0,"cell_chars":16384,"cell_head_chars":4096},"cells_cut":0,"cells_raw":0,"read":"whole","date_system":"1900"}

{"sheet":"Pres & Prop Rev","index":0,"n_rows":284,"n_cols":17,"rows_kept":284,"cut":false,"hidden":false,"merged":[[5,16,10,18]]}
[]
[null,null,null,null,null,null,null,null,null,"TRANSPORT"]
[null,null,null,null,null,null,null,null,null,"SCH 148 - WSU/"]
["WORK PAPER",null," ","GEN SERVICE","LRG GEN SVC","EX LRG GEN SVC","INTERRUPTIBLE","TRANSPORT","TRANSPORT","BF GOODRICH"]
["REFERENCE",null,"TOTAL","SCHEDULE 101","SCH. 111&112","SCH. 121&122","SCH. 131&132","SCHEDULE 146","SCHEDULE 148","ANN. MINIMUM",null,null,null,null,null,null,"Print Header for all printed pages on this worksheet:"]
[null,"PRESENT BILL DETERMINANTS",null,null,null,null,null,null,null,null,null,null,"Calculate all revenue exhibits using  ____ rates:",null,null,null,{"$f":"\"AVISTA UTILITIES\nWASHINGTON GAS\nPRO FORMA REVENUE UNDER PRESENT AND PROPOSED \"&O9&\" RATES\n12 MONTHS ENDED JUNE 30, 2013\"","v":"AVISTA UTILITIES\nWASHINGTON GAS\nPRO FORMA REVENUE UNDER PRESENT AND PROPOSED BASE TARIFF RATES\n12 MONTHS ENDED JUNE 30, 2013"}]
[null,"THERMS",null,null,null,null,null,null,null,null,null,"1)","BASE TARIFF"]
["PDE-G-8","BLOCK 1",null,{"$f":"'Bill Determ'!E7","v":74519037},{"$f":"'Bill Determ'!B12","v":5632648},{"$f":"'Bill Determ'!B21","v":177068},{"$f":"'Bill Determ'!B25","v":240000},{"$f":"'Bill Determ'!B29","v":8309188},{"$f":"'Bill Determ'!B35","v":20651786},{"$f":"'Bill Determ'!B41","v":9870961},null,null,"or",null,1]
["PDE-G-8","BLOCK 2",null,{"$f":"'Bill Determ'!F7","v":42492170},{"$f":"'Bill Determ'!C12","v":14800997},{"$f":"'Bill Determ'!C21","v":176746},{"$f":"'Bill Determ'!C25","v":360000},{"$f":"'Bill Determ'!C29","v":7562641},{"$f":"'Bill Determ'!B36","v":7028636},null,null,"2)","BILLING",null,{"$f":"CHOOSE(Base1_Billing2,M7,M9)","v":"BASE TARIFF"}]
["PDE-G-8","BLOCK 3",null,null,{"$f":"'Bill Determ'!D12","v":25823248},{"$f":"'Bill Determ'!D21","v":2926401},{"$f":"'Bill Determ'!D25","v":449338},{"$f":"'Bill Determ'!D29","v":11926882},{"$f":"'Bill Determ'!B37","v":1730058},null,null,null,null,null,{"$f":"CHOOSE(Base1_Billing2,\"Base\",\"Billing\")","v":"Base"}]
{"$rows_left_out":275}
{"sheet":"Rate Design","index":1,"n_rows":122,"n_cols":22,"rows_kept":122,"cut":false,"hidden":false,"merged":[]}
["PRESENT RATES",null,null,1,2,3,4,5,null,null,null,"Tiers - used for bill comparisons"]
[null,null,"TOTAL","SCH. 101","SCH. 111,112","SCH. 121,122","SCH. 132","SCH. 146",null,"Range Name",null,"SCH. 101","SCH. 111,112","SCH. 121,122","SCH. 131,132","SCH. 146"]
[null,"Base Tariff Rates"]
[1,"BASIC CHARGE",null,8,null,null,null,400]
[2,"MONTHLY MINIMUM",null,null,161.21,409.92]
[3,"BLOCK 1 PER THERM",null,{"$f":"27.398+0.821+49.803","v":78.021999999999991},{"$f":"-41.539+0.065+49.535","v":8.0609999999999928},{"$f":"-41.437+0.05+47.449","v":6.0619999999999976},{"$f":"18.464+0.51+44.955","v":63.929000000000002},{"$f":"8.151+0.082+0.056","v":8.2889999999999997},null,null,null,9999999,200,500,10000,20000]
[4,"BLOCK 2 PER THERM",null,{"$f":"37.398+0.929+49.803","v":88.13},{"$f":"25.957+0.687+49.535","v":76.179000000000002},{"$f":"27.558+0.688+47.449","v":75.694999999999993},{"$f":"13.996+0.474+44.955","v":59.424999999999997},{"$f":"7.251+0.073+0.056","v":7.3800000000000008},{"$f":"H7/H6-1","v":-0.10966340933767627},null,null,9999999,1000,1000,25000,50000]
[5,"BLOCK 3 PER THERM",null,null,{"$f":"18.701+0.621+49.535","v":68.856999999999999},{"$f":"20.138+0.62+47.449","v":68.206999999999994},{"$f":"12.9+0.465+44.955","v":58.32},{"$f":"6.537+0.066+0.056","v":6.6589999999999998},{"$f":"H8/H7-1","v":-9.7696476964769796E-2},"Rates_Base_Present",null,9999999,9999999,10000,50000,300000]
[6,"BLOCK 4 PER THERM",null,null,null,{"$f":"15.479+0.577+47.449","v":63.504999999999995},{"$f":"12.537+0.462+44.955","v":57.954000000000001},{"$f":"6.045+0.061+0.056","v":6.1619999999999999},-7.4635831205886793E-2,null,null,9999999,9999999,25000,9999999,500000]
[7,"BLOCK 5 PER THERM",null,null,null,{"$f":"11.73+0.542+47.449","v":59.720999999999997},null,{"$f":"4.54+0.046+0.056","v":4.6420000000000003},-0.24667315806556311,null,null,9999999,9999999,9999999,9999999,9999999]
{"$rows_left_out":113}
{"sheet":"Exh1","index":2,"n_rows":36,"n_cols":18,"rows_kept":36,"cut":false,"hidden":false,"merged":[[0,16,2,17]]}
["AVISTA UTILITIES",null,null,null,null,null,null,null,null,null,null,null,null,null,null,null,"This worksheet pulls data from 'Pres & Prop Rev' tab."]
["WASHINGTON NATURAL GAS"]
["PROPOSED INCREASE BY SERVICE SCHEDULE"]
["12 MONTHS ENDED DECEMBER 31, 2015"]
["(000s of Dollars)"]
[]
[]
[null,null,null,"Base Tariff",null,"Base Tariff","Base",null,null,null,"Total Billed",null,null,"Percent "]
[null,null,null,"Revenue","Proposed","Revenue","Tariff",null,null,null,"Revenue","Sch. 192","Total","Increase"]
["Line","Type of","Schedule","Under Present","General","Under Proposed","Percent",null,null,null,"at Present","LIRAP","GRC/LIRAP","on Billed"]
{"$rows_left_out":27}
{"sheet":"Exh2","index":3,"n_rows":20,"n_cols":12,"rows_kept":20,"cut":false,"hidden":true,"merged":[]}
["AVISTA UTILITIES",null,null,null,null,null,null,null,null,null,null,"This worksheet pulls data from 'ROR' tab."]
["WASHINGTON NATURAL GAS"]
["PRESENT & PROPOSED RATES OF RETURN BY RATE SCHEDULE"]
["12 MONTHS ENDED JUNE 30, 2013"]
[]
[]
[]
[]
[null,null,null,"Present Rates",null,null,"Base",null,"Proposed Rates"]
[null,null,null,"Present","Present",null,"Tariff",null,"Proposed","Proposed"]
{"$rows_left_out":11}
{"sheet":"Exh3","index":4,"n_rows":60,"n_cols":30,"rows_kept":60,"cut":false,"hidden":false,"merged":[[9,0,9,2]]}
["AVISTA UTILITIES",null,null,null,null,null,null,null,null,null,null,null,null,null,null,null,null,null,"This worksheet uses Base & Billing rates from 'Rate Design' tab."]
["WASHINGTON NATURAL GAS"]
["PRESENT AND PROPOSED RATE COMPONENTS BY SCHEDULE"]
[]
[]
[]
[null,null,null,null,null,null,null,null,null,null,null,"Proposed","Proposed"]
[null,null,null,null,"Sch. 150","Base Rate","Present",null,"General ","Sch. 192","Proposed ","Base Rate","Base Rate"]
[null,null,null,"Base","PGA","including","Billing","Present ","Rate ","LIRAP","Billing ","including","excluding",null,null,null,"GRC"]
["Type of Service",null,null,"Rate","Rate Adj","Schedule 150","Rate Adj.","Billing Rate (1)","Increase","Increase","Rate(1)","Schedule 150","Schedule 150",null,"Base","Bill ","Revenue"]
{"$rows_left_out":51}
{"sheet":"LIRAP","index":5,"n_rows":27,"n_cols":18,"rows_kept":27,"cut":false,"hidden":false,"merged":[]}
[]
[null,"Avista Natural Gas"]
[null,"LIRAP Rate Calculation"]
[null,"UG-140189"]
[]
[]
[]
[null,null,null,"Present",null,null,null,"Present",null,{"$f":"L27","v":0.11600000000000001},null,"Settlement",null,"Settlement"]
[null,null,null,"Sch 192",null,"Billing ",null,"LIRAP",null,"LIRAP",null,"LIRAP",null,"Sch 192",null,"Rate ","Revenue ","Percentage"]
[null,null,null,"Therm Rate",null,"Determinants",null,"Revenue",null,"Increase",null,"Revenue",null,"Therm Rate",null,"Impact","Impact","Increase"]
{"$rows_left_out":18}
{"sheet":"ROR","index":6,"n_rows":91,"n_cols":15,"rows_kept":91,"cut":false,"hidden":false,"merged":[]}
[null,"AVISTA UTILITIES"]
[null,"WASHINGTON GAS"]
[null,"PRESENT & PROPOSED RATE OF RETURN BY RATE SCHEDULE"]
[null,"12 MONTHS ENDED JUNE 30, 2013"]
[]
[]
[null,null,"Total","Sch 101","Sch 111","Sch 121","Sch 131","Sch 146"]
[null,"Total Rate Base",{"$f":"SUM(D8:H8)","v":242844000.00000003},187932930.46062326,42819754.113000751,3841452.9369198815,545813.28435795789,7704049.2050981764,"from COS"]
[]
[null,"Revenue From Retail Rates",{"$f":"SUM(D10:H10)","v":151532665.57999998},110007472.47,34391207.099999994,3931772.67,767855.19000000006,2434358.15,"from COS"]
{"$rows_left_out":82}
{"sheet":"BFG","index":7,"n_rows":24,"n_cols":6,"rows_kept":24,"cut":false,"hidden":true,"merged":[]}
["AVISTA UTILITIES"]
["GAS ANNUAL MINIMUM DEFICIENCY FOR B.F. GOODRICH"]
["STATE OF WASHINGTON"]
["BASED ON 2007 ANNUAL MINIMUM"]
[]
[null,null,null,null,null,"Gas"]
["Annual Minimum Usage Requirement(1)",null,null,null,null,10500000]
["Less: Jan 09 - Dec 09 Usage(2)",null,null,null,null,{"$f":"SUMIF('Big Schedules'!$A$4:$A$44,\"BF Goodrich\",'Big Schedules'!$N$4:$N$44)","v":0}]
["Usage Deficiency",null,null,null,null,{"$f":"F7-F8","v":10500000}]
["Deficiency Charge per therm(3)",null,null,null,null,0]
{"$rows_left_out":15}
{"sheet":"Bill Impact","index":8,"n_rows":107,"n_cols":15,"rows_kept":107,"cut":false,"hidden":false,"merged":[]}
[]
["Schedule 101 Bill Impact"]
[]
[]
[]
["Schedule 101 Present",null,null,null,null,null,"Schedule 101 Proposed"]
[null,"Basic Charge","Block 1","Block 2","Total Bill",null,"Basic Charge","Block 1","Block 2","Total Bill",null,"Bill Impact","% Change"]
[null,{"$f":"'Rate Design'!D4","v":8},{"$f":"'Rate Design'!D16/100","v":0.81824999999999992},{"$f":"'Rate Design'!D17/100","v":0.91932999999999998},null,null,{"$f":"'Rate Design'!D26","v":9},{"$f":"'Rate Design'!D38/100","v":0.85858999999999996},{"$f":"'Rate Design'!D39/100","v":0.96471999999999991}]
[10,{"$f":"$B$8","v":8},{"$f":"A9*$C$8","v":8.1824999999999992},null,{"$f":"SUM(B9:D9)","v":16.182499999999997},null,{"$f":"$G$8","v":9},{"$f":"A9*$H$8","v":8.5858999999999988},null,{"$f":"SUM(G9:I9)","v":17.585899999999999},null,{"$f":"J9-E9","v":1.4034000000000013},{"$f":"L9/E9","v":8.6723312219990828E-2}]
[{"$f":"A9+10","v":20},{"$f":"$B$8","v":8},16.364999999999998,null,{"$f":"SUM(B10:D10)","v":24.364999999999998},null,{"$f":"$G$8","v":9},{"$f":"A10*$H$8","v":17.171799999999998},null,26.171799999999998,null,1.8067999999999991,7.4155550995280081E-2]
{"$rows_left_out":98}
{"sheet":"Bill Determ","index":9,"n_rows":87,"n_cols":8,"rows_kept":87,"cut":false,"hidden":false,"merged":[]}
["AVISTA UTILITIES"]
["WASHINGTON GAS"]
["USAGE & BILLINGS BY RATE SCHEDULE"]
["12 MONTHS ENDED DECEMBER 31, 2015"]
[]
["Schedule 101","Total therms","Total Billings",null,"0-70",">70","Total Therms"]
["therms per Revenue Run(1)(2)",117011207,1802235,null,74519037,42492170,{"$f":"SUM(D7:F7)","v":117011207}]
[null,null,null,null,null,null,117011207]
["Schedule 111,112","0-200 thms","201-1000 thms","> 1000 thms",null,null,{"$f":"G8-G7","v":0}]
["therms by block(2)",5632648,14800997,25823248,{"$f":"SUM(B10:D10)","v":46256893}]
{"$rows_left_out":78}
{"sheet":"Block Usage","index":10,"n_rows":39,"n_cols":16,"rows_kept":39,"cut":false,"hidden":true,"merged":[]}
["WASHINGTON NATURAL GAS SYSTEM"]
[null,null,"July","August","September","October","November","December","January","February","March","April","May","June","Annual Total"]
["Rate Design Program Monthly Results"]
["Block ID 994","Schedule 101"]
[null,"Block 1",{"$f":"2289856+338058","v":2627914},{"$f":"1685830+153167","v":1838997},{"$f":"1748325+172886","v":1921211},{"$f":"2425764+440062","v":2865826},{"$f":"3838030+2758236","v":6596266},{"$f":"4148979+4700019","v":8848998},{"$f":"4227979+5233524","v":9461503},{"$f":"4250537+5275282","v":9525819},{"$f":"4209112+4882989","v":9092101},{"$f":"4123889+4015673","v":8139562},6221393,{"$f":"2904457+709593","v":3614050},{"$f":"SUM(C5:N5)","v":70753640}]
[null,"Block 2",286903,144006,224810,278742,1447215,5714564,10740840,10755014,6221729,3048323,1011294,374714,{"$f":"SUM(C6:N6)","v":40248154}]
["Therms","Total",{"$f":"SUM(C5:C6)","v":2914817},1983003,2146021,3144568,8043481,14563562,20202343,20280833,15313830,11187885,7232687,3988764,111001794]
[null,"Billed Customers",146524,146433,147360,146875,147245,147536,147902,147934,147801,147781,147555,147321,{"$f":"SUM(C8:N8)","v":1768267}]
[null,"Block 1 Limit",{"$f":"C8*70","v":10256680},{"$f":"D8*70","v":10250310},10315200,10281250,10307150,10327520,10353140,10355380,10346070,10344670,10328850,10312470,{"$f":"SUM(C9:N9)","v":123778690}]
[null,"Revenue Run Total",2891517,1968467,2118366,3134468,8101674,14671902,20307726,20355015,15326447,11144122,7232104,3936374,{"$f":"SUM(C10:N10)","v":111188182}]
{"$rows_left_out":30}
{"sheet":"Big Schedules","index":11,"n_rows":133,"n_cols":26,"rows_kept":133,"cut":false,"hidden":true,"merged":[]}
["Washington Gas Billing Determinants by Customer"]
[null,null,null,null,null,null,null,null,null,null,null,null,null,null,null,"1st",{"$f":"P3","v":20000},{"$f":"Q3","v":50000},{"$f":"R3","v":300000},{"$f":"S3","v":500000}]
["ANNUAL USAGE, Sch 146",null,null,null,null,null,null,null,null,null,null,null,null,"12-mo ended",null,20000,50000,300000,500000,99999999,null,null,"Present Base","Proposed Base"]
["Washington","2012-07-01","2012-08-01","2012-09-01","2012-10-01","2012-11-01","2012-12-01","2013-01-01","2013-02-01","2013-03-01","2013-04-01","2013-05-01","2013-06-01","Total",null,"thms/mo","thms/mo","thms/mo","thms/mo","thms/mo",null,null,"Revenue","Revenue"]
["92 CES/CER-M",20564,573,6848,22580,188950,347042,470645,527900,351026,272295,183435,23446,{"$f":"SUM(B5:M5)","v":2415304},null,{"$f":"P$3*12-SUMPRODUCT(--($B5:$M5<=P$3),P$3-$B5:$M5)","v":207421},{"$f":"Q$3*12-SUM($P5:P5)-SUMPRODUCT(--($B5:$M5<=Q$3),Q$3-$B5:$M5)","v":216590},{"$f":"R$3*12-SUM($P5:Q5)-SUMPRODUCT(--($B5:$M5<=R$3),R$3-$B5:$M5)","v":1494680},{"$f":"S$3*12-SUM($P5:R5)-SUMPRODUCT(--($B5:$M5<=S$3),S$3-$B5:$M5)","v":468713},{"$f":"T$3*12-SUM($P5:S5)-SUMPRODUCT(--($B5:$M5<=T$3),T$3-$B5:$M5)","v":27900},null,null,{"$f":"P5*'Exh3'!$F$49+'Big Schedules'!Q5*'Exh3'!$F$50+'Big Schedules'!R5*'Exh3'!$F$51+'Big Schedules'!S5*'Exh3'!$F$52+'Big Schedules'!T5*'Exh3'!$F$53+'Exh3'!$F$47*12","v":167685.42294999998},{"$f":"P5*'Exh3'!$L$49+'Big Schedules'!Q5*'Exh3'!$L$50+'Big Schedules'!R5*'Exh3'!$L$51+'Big Schedules'!S5*'Exh3'!$L$52+'Big Schedules'!T5*'Exh3'!$L$53+'Exh3'!$L$47*12","v":178352.09741000002},null,{"$f":"X5/W5-1","v":6.3611220774870914E-2}]
["ALSCO",25131,24359,26353,23294,29175,26926,26435,29483,25565,25713,26414,26613,{"$f":"SUM(B6:M6)","v":315461},null,240000,{"$f":"Q$3*12-SUM($P6:P6)-SUMPRODUCT(--($B6:$M6<=Q$3),Q$3-$B6:$M6)","v":75461},{"$f":"R$3*12-SUM($P6:Q6)-SUMPRODUCT(--($B6:$M6<=R$3),R$3-$B6:$M6)","v":0},{"$f":"S$3*12-SUM($P6:R6)-SUMPRODUCT(--($B6:$M6<=S$3),S$3-$B6:$M6)","v":0},{"$f":"T$3*12-SUM($P6:S6)-SUMPRODUCT(--($B6:$M6<=T$3),T$3-$B6:$M6)","v":0},null,null,{"$f":"P6*'Exh3'!$F$49+'Big Schedules'!Q6*'Exh3'!$F$50+'Big Schedules'!R6*'Exh3'!$F$51+'Big Schedules'!S6*'Exh3'!$F$52+'Big Schedules'!T6*'Exh3'!$F$53+'Exh3'!$F$47*12","v":30262.621800000001},{"$f":"P6*'Exh3'!$L$49+'Big Schedules'!Q6*'Exh3'!$L$50+'Big Schedules'!R6*'Exh3'!$L$51+'Big Schedules'!S6*'Exh3'!$L$52+'Big Schedules'!T6*'Exh3'!$L$53+'Exh3'!$L$47*12","v":32943.149490000003},null,{"$f":"X6/W6-1","v":8.8575527517579467E-2}]
["BAKER COMMODITIES, INC",28687,32273,45398,27675,42624,48836,33733,50735,39818,45937,33067,42330,471113,null,240000,{"$f":"Q$3*12-SUM($P7:P7)-SUMPRODUCT(--($B7:$M7<=Q$3),Q$3-$B7:$M7)","v":230378},{"$f":"R$3*12-SUM($P7:Q7)-SUMPRODUCT(--($B7:$M7<=R$3),R$3-$B7:$M7)","v":735},{"$f":"S$3*12-SUM($P7:R7)-SUMPRODUCT(--($B7:$M7<=S$3),S$3-$B7:$M7)","v":0},{"$f":"T$3*12-SUM($P7:S7)-SUMPRODUCT(--($B7:$M7<=T$3),T$3-$B7:$M7)","v":0},null,null,{"$f":"P7*'Exh3'!$F$49+'Big Schedules'!Q7*'Exh3'!$F$50+'Big Schedules'!R7*'Exh3'!$F$51+'Big Schedules'!S7*'Exh3'!$F$52+'Big Schedules'!T7*'Exh3'!$F$53+'Exh3'!$F$47*12","v":41744.440050000005},{"$f":"P7*'Exh3'!$L$49+'Big Schedules'!Q7*'Exh3'!$L$50+'Big Schedules'!R7*'Exh3'!$L$51+'Big Schedules'!S7*'Exh3'!$L$52+'Big Schedules'!T7*'Exh3'!$L$53+'Exh3'!$L$47*12","v":45092.40612},null,8.02014847004755E-2]
["BOISE CASCADE LLC INLAND REGION",34079,57633,35917,29740,35920,31209,24090,39532,32771,33116,34667,31156,419830,null,240000,{"$f":"Q$3*12-SUM($P8:P8)-SUMPRODUCT(--($B8:$M8<=Q$3),Q$3-$B8:$M8)","v":172197},{"$f":"R$3*12-SUM($P8:Q8)-SUMPRODUCT(--($B8:$M8<=R$3),R$3-$B8:$M8)","v":7633},{"$f":"S$3*12-SUM($P8:R8)-SUMPRODUCT(--($B8:$M8<=S$3),S$3-$B8:$M8)","v":0},{"$f":"T$3*12-SUM($P8:S8)-SUMPRODUCT(--($B8:$M8<=T$3),T$3-$B8:$M8)","v":0},null,null,{"$f":"P8*'Exh3'!$F$49+'Big Schedules'!Q8*'Exh3'!$F$50+'Big Schedules'!R8*'Exh3'!$F$51+'Big Schedules'!S8*'Exh3'!$F$52+'Big Schedules'!T8*'Exh3'!$F$53+'Exh3'!$F$47*12","v":37910.020069999999},{"$f":"P8*'Exh3'!$L$49+'Big Schedules'!Q8*'Exh3'!$L$50+'Big Schedules'!R8*'Exh3'!$L$51+'Big Schedules'!S8*'Exh3'!$L$52+'Big Schedules'!T8*'Exh3'!$L$53+'Exh3'!$L$47*12","v":41035.084910000005},null,8.2433742694665968E-2]
["BOISE CASCADE LLC INLAND REGION",108951,0,0,null,6717,20259,17788,30614,36063,32644,74305,16747,344088,null,161252,{"$f":"Q$3*12-SUM($P9:P9)-SUMPRODUCT(--($B9:$M9<=Q$3),Q$3-$B9:$M9)","v":99580},{"$f":"R$3*12-SUM($P9:Q9)-SUMPRODUCT(--($B9:$M9<=R$3),R$3-$B9:$M9)","v":83256},{"$f":"S$3*12-SUM($P9:R9)-SUMPRODUCT(--($B9:$M9<=S$3),S$3-$B9:$M9)","v":0},{"$f":"T$3*12-SUM($P9:S9)-SUMPRODUCT(--($B9:$M9<=T$3),T$3-$B9:$M9)","v":0},null,null,{"$f":"P9*'Exh3'!$F$49+'Big Schedules'!Q9*'Exh3'!$F$50+'Big Schedules'!R9*'Exh3'!$F$51+'Big Schedules'!S9*'Exh3'!$F$52+'Big Schedules'!T9*'Exh3'!$F$53+'Exh3'!$F$47*12","v":31059.19932},{"$f":"P9*'Exh3'!$L$49+'Big Schedules'!Q9*'Exh3'!$L$50+'Big Schedules'!R9*'Exh3'!$L$51+'Big Schedules'!S9*'Exh3'!$L$52+'Big Schedules'!T9*'Exh3'!$L$53+'Exh3'!$L$47*12","v":33785.832880000002},null,8.7788275927777493E-2]
["CENTRAL PRE-MIX BLOCK",22163,13832,15498,21585,25609,20647,11565,31991,29346,28397,22651,22785,266069,null,220895,{"$f":"Q$3*12-SUM($P10:P10)-SUMPRODUCT(--($B10:$M10<=Q$3),Q$3-$B10:$M10)","v":45174},{"$f":"R$3*12-SUM($P10:Q10)-SUMPRODUCT(--($B10:$M10<=R$3),R$3-$B10:$M10)","v":0},{"$f":"S$3*12-SUM($P10:R10)-SUMPRODUCT(--($B10:$M10<=S$3),S$3-$B10:$M10)","v":0},{"$f":"T$3*12-SUM($P10:S10)-SUMPRODUCT(--($B10:$M10<=T$3),T$3-$B10:$M10)","v":0},null,null,{"$f":"P10*'Exh3'!$F$49+'Big Schedules'!Q10*'Exh3'!$F$50+'Big Schedules'!R10*'Exh3'!$F$51+'Big Schedules'!S10*'Exh3'!$F$52+'Big Schedules'!T10*'Exh3'!$F$53+'Exh3'!$F$47*12","v":26443.827749999997},{"$f":"P10*'Exh3'!$L$49+'Big Schedules'!Q10*'Exh3'!$L$50+'Big Schedules'!R10*'Exh3'!$L$51+'Big Schedules'!S10*'Exh3'!$L$52+'Big Schedules'!T10*'Exh3'!$L$53+'Exh3'!$L$47*12","v":28902.338110000004},null,9.2971047279643892E-2]
{"$rows_left_out":124}
{"sheet":"Rev Runs CY","index":12,"n_rows":54,"n_cols":15,"rows_kept":54,"cut":false,"hidden":true,"merged":[]}
[]
[]
[]
[]
["Gas Revenue Meters Report by Location  Twelve Months Ended  for Report Date : '06/30/2013'"]
[]
["State Cde:WA"]
[]
[null,null,"Meters"]
[null,"Period","201207","201208","201209","201210","201211","201212","201301","201302","201303","201304","201305","201306","12 Month Average"]
{"$rows_left_out":44}