{"text_format":"1","workbook":"xlsx","n_sheets":21,"sheets":["Pres & Prop Rev","Exh 1","Exh 2","Exh 3","Sch 98 REC Revenue","Rebate","Generation Allocation","Rate Design","ROR","Bill Determ","Lighting summary","Bill Comparison","Revenue Stability","Bill Impact","WA Sch 25","St Lts","Area Lts","Capital Recovery Factor Calc","Block Data","Rev Runs 12MEJUNE2013","LED Rates"],"not_rendered":{"charts":0,"images":0,"macros":1,"external_links":6,"defined_names":59,"comments":7,"pivot_tables":0},"unopened":[],"bounds":{"document_bytes":16777216,"sheet_cells":100000,"rows_first":2000,"rows_last":500,"rows_between":2000,"halvings":0,"cell_chars":16384,"cell_head_chars":4096},"cells_cut":0,"cells_raw":0,"read":"whole","date_system":"1900"}

{"sheet":"Pres & Prop Rev","index":0,"n_rows":302,"n_cols":18,"rows_kept":302,"cut":false,"hidden":true,"merged":[[5,16,10,18],[94,1,95,8]]}
[]
[null,{"$f":"IF(Base1_Billing2=2,\"BILLED\",\"\")","v":""}]
[]
["WORK PAPER",null," ","RESIDENTIAL","GENERAL SVC. ","LG. GEN. SVC.","EX LG GEN SVC","ULX LG GEN SVC","PUMPING","ST & AREA LTG"]
["REFERENCE",null,"TOTAL","SCHEDULE 1","SCH. 11,12","SCH. 21,22","SCHEDULE 25","SCHEDULE 26","SCH. 30, 31, 32","SCH. 41-48",null,null,null,null,null,null,"Print Header for all printed pages on this worksheet:"]
[null,"PRESENT BILL DETERMINANTS",null,null,null,null,null,null,null,null,null,null,"Calculate all revenue exhibits using  ____ rates:",null,null,null,{"$f":"\"AVISTA UTILITIES\nWASHINGTON ELECTRIC\nPRO FORMA REVENUE UNDER PRESENT AND PROPOSED \"&O9&\" RATES\n12 MONTHS ENDED JUNE 30, 2013\"","v":"AVISTA UTILITIES\nWASHINGTON ELECTRIC\nPRO FORMA REVENUE UNDER PRESENT AND PROPOSED BASE TARIFF RATES\n12 MONTHS ENDED JUNE 30, 2013"}]
{"$rows_left_out":297}
{"sheet":"Exh 1","index":1,"n_rows":56,"n_cols":19,"rows_kept":56,"cut":false,"hidden":false,"merged":[[4,0,4,13],[0,16,2,17],[0,0,0,13],[1,0,1,13],[2,0,2,13],[3,0,3,13]]}
["AVISTA UTILITIES",null,null,null,null,null,null,null,null,null,null,null,null,null,null,null,"This worksheet pulls data from 'Pres & Prop Rev' tab."]
["WASHINGTON ELECTRIC"]
["PROPOSED INCREASE BY SERVICE SCHEDULE"]
["12 MONTHS ENDED JUNE 30, 2013"]
["(000s of Dollars)"]
[]
{"$rows_left_out":51}
{"sheet":"Exh 2","index":2,"n_rows":21,"n_cols":12,"rows_kept":21,"cut":false,"hidden":false,"merged":[]}
["AVISTA UTILITIES",null,null,null,null,null,null,null,null,null,null,"This worksheet pulls data from 'ROR' tab."]
["WASHINGTON ELECTRIC"]
["PRESENT & PROPOSED RATES OF RETURN BY RATE SCHEDULE"]
["12 MONTHS ENDED JUNE 30, 2013"]
[]
[]
{"$rows_left_out":16}
{"sheet":"Exh 3","index":3,"n_rows":76,"n_cols":19,"rows_kept":76,"cut":false,"hidden":false,"merged":[[75,0,76,9]]}
["AVISTA UTILITIES",null,null,null,null,null,null,null,null,null,null,null,null,null,"This worksheet uses Base & Billing rates from 'Rate Design' tab."]
["WASHINGTON ELECTRIC"]
["PRESENT AND PROPOSED RATE COMPONENTS BY SCHEDULE"]
[]
[null,null,null,null,null,"General ","Sch. 98","Sch. 93/94","Proposed ","Proposed ","Sch. 98","Sch. 93/94","Proposed Billing"]
[null,"Base Tariff","Present","Present ","Block ","Rate ","REC Revenue","ERM/BPA","Billing ","Base Tariff","REC Revenue","ERM/BPA","Rate With"]
{"$rows_left_out":71}
{"sheet":"Sch 98 REC Revenue","index":4,"n_rows":39,"n_cols":8,"rows_kept":39,"cut":false,"hidden":true,"merged":[[0,0,0,7],[1,0,1,7],[2,0,2,7],[3,0,3,7],[4,0,4,7]]}
["AVISTA UTILITIES"]
["WASHINGTON ELECTRIC"]
["PROPOSED REC REVENUE DECREASE BY SERVICE SCHEDULE"]
["12 MONTHS ENDED JUNE 30, 2013"]
["(000s of Dollars)"]
[]
{"$rows_left_out":34}
{"sheet":"Rebate","index":5,"n_rows":21,"n_cols":10,"rows_kept":21,"cut":false,"hidden":true,"merged":[]}
["REC Revenue Rebate Calculation"]
["REC Revenue and Expenses, 2012 through June 2016."]
["Washington Allocation"]
[]
[]
[null,null,"Projected","Projected","REC Revenue","REC Expense",null,null,null,"Net REC"]
{"$rows_left_out":16}
{"sheet":"Generation Allocation","index":6,"n_rows":23,"n_cols":11,"rows_kept":23,"cut":false,"hidden":true,"merged":[]}
[null,null,"REC Revenues Rebate Allocation - Generation Level Consumption"]
[]
[null,null,null,null,null,null,null,"NEW"]
[null,null," ","RESIDENTIAL","GENERAL SVC. ","LG. GEN. SVC.","EX LG GEN SVC","ULT LG GEN SVC","PUMPING","ST & AREA LTG"]
[null,"DESCRIPTION","TOTAL","SCHEDULE 1","SCH. 11,12","SCH. 21,22","SCHEDULE 25","SCHEDULE 26","SCH. 30, 31, 32","SCH. 41-48"]
["Line No.","A","B","C","D","E ","F","G","H","I","J"]
{"$rows_left_out":18}
{"sheet":"Rate Design","index":7,"n_rows":127,"n_cols":25,"rows_kept":127,"cut":false,"hidden":true,"merged":[]}
["PRESENT RATES",null,null,1,2,3,4,5,6,7,null,null,null,null,"Tiers - used for bill comparisons"]
[null,null,"TOTAL","SCH. 1","SCH. 11,12","SCH. 21,22","SCH. 25","SCH. 26","SCH. 30, 31, 32",null,null,null,"Range Name",null,"SCHEDULE 1","SCH. 11,12","SCH. 21,22","SCHEDULE 25","SCHEDULE 26","SCH. 30, 31, 32"]
[null,"Base Tariff Rates"]
[1,"BASIC CHARGE",null,8,15,0,0,0,15]
[2,"BLOCK 1 PER KWH",null,{"$f":"7.133+0.236","v":7.3689999999999998},{"$f":"11.031+0.36","v":11.391},{"$f":"6.878+0.221","v":7.0990000000000002},{"$f":"5.539+0.169","v":5.7079999999999993},{"$f":"5.539+0.169","v":5.7079999999999993},{"$f":"9.253+0.292","v":9.5449999999999999},null,null,null,null,null,800,3650,250000,500000,500000]
[3,"BLOCK 2 PER KWH",null,{"$f":"8.299+0.274","v":8.5730000000000004},{"$f":"8.105+0.265","v":8.370000000000001},{"$f":"6.15+0.199","v":6.3490000000000002},{"$f":"4.983+0.152","v":5.1349999999999998},{"$f":"4.983+0.152","v":5.1349999999999998},{"$f":"6.609+0.208","v":6.8170000000000002},null,null,null,null,null,1500,9999999,9999999,9999999,9999999]
{"$rows_left_out":122}
{"sheet":"ROR","index":8,"n_rows":79,"n_cols":14,"rows_kept":79,"cut":false,"hidden":true,"merged":[]}
[null,"AVISTA UTILITIES"]
[null,"WASHINGTON ELECTRIC"]
[null,"PRESENT & PROPOSED RATE OF RETURN BY RATE SCHEDULE"]
[null,"12 MONTHS ENDED JUNE 30, 2013"]
[]
[]
{"$rows_left_out":74}
{"sheet":"Bill Determ","index":9,"n_rows":90,"n_cols":42,"rows_kept":90,"cut":false,"hidden":true,"merged":[[7,36,7,41],[7,1,7,6],[7,8,7,13],[7,15,7,20],[7,22,7,27],[7,29,7,34]]}
["AVISTA UTILITIES"]
["WASHINGTON ELECTRIC"]
["ACTUAL / PRO FORMA BILLING DETERMINANTS BY RATE SCHEDULE"]
["12 MONTHS ENDED JUNE 30, 2013"]
[]
["Billing Determinants"]
{"$rows_left_out":85}
{"sheet":"Lighting summary","index":10,"n_rows":44,"n_cols":16,"rows_kept":44,"cut":false,"hidden":true,"merged":[[6,2,6,3],[6,5,6,6]]}
[null,"AVISTA UTILITIES"]
[null,"WASHINGTON ELECTRIC"]
[null,"STREET & AREA LIGHT REVENUE UNDER PRESENT & PROPOSED RATES"]
[null,"12 MONTHS ENDED JUNE 30, 2013"]
[]
[]
{"$rows_left_out":39}
{"sheet":"Bill Comparison","index":11,"n_rows":134,"n_cols":22,"rows_kept":134,"cut":false,"hidden":false,"merged":[[4,2,4,4],[4,5,4,7],[4,8,4,10],[5,2,5,4],[5,5,5,7],[5,8,5,10],[0,3,0,4],[0,6,0,7],[0,9,0,10],[1,1,1,10],[2,1,2,10],[3,2,3,4],[3,5,3,7],[3,8,3,10],[8,2,8,4],[8,5,8,7],[8,8,8,10],[9,2,9,4],[9,5,9,7],[9,8,9,10],[6,2,6,4],[6,5,6,7],[6,8,6,10],[7,2,7,4],[7,5,7,7],[7,8,7,10],[12,2,12,4],[12,5,12,7],[12,8,12,10],[13,2,13,4],[13,5,13,7],[13,8,13,10],[10,2,10,4],[10,5,10,7],[10,8,10,10],[11,2,11,4],[11,5,11,7],[11,8,11,10],[17,3,17,4],[17,6,17,7],[17,9,17,10],[18,3,18,4],[18,6,18,7],[18,9,18,10],[14,1,14,10],[15,3,15,4],[15,6,15,7],[15,9,15,10],[16,3,16,4],[16,6,16,7],[16,9,16,10],[21,3,21,4],[21,6,21,7],[21,9,21,10],[22,3,22,4],[22,6,22,7],[22,9,22,10],[19,3,19,4],[19,6,19,7],[19,9,19,10],[20,3,20,4],[20,6,20,7],[20,9,20,10],[25,3,25,4],[25,6,25,7],[25,9,25,10],[26,3,26,4],[26,6,26,7],[26,9,26,10],[23,3,23,4],[23,6,23,7],[23,9,23,10],[24,3,24,4],[24,6,24,7],[24,9,24,10],[29,3,29,4],[29,6,29,7],[29,9,29,10],[30,3,30,4],[30,6,30,7],[30,9,30,10],[27,3,27,4],[27,6,27,7],[27,9,27,10],[28,3,28,4],[28,6,28,7],[28,9,28,10],[33,3,33,4],[33,6,33,7],[33,9,33,10],[34,3,34,4],[34,6,34,7],[34,9,34,10],[31,3,31,4],[31,6,31,7],[31,9,31,10],[32,3,32,4],[32,6,32,7],[32,9,32,10],[37,3,37,4],[37,6,37,7],[37,9,37,10],[38,3,38,4],[38,6,38,7],[38,9,38,10],[35,3,35,4],[35,6,35,7],[35,9,35,10],[36,3,36,4],[36,6,36,7],[36,9,36,10],[41,3,41,4],[41,6,41,7],[41,9,41,10],[42,3,42,4],[42,6,42,7],[42,9,42,10],[39,3,39,4],[39,6,39,7],[39,9,39,10],[40,3,40,4],[40,6,40,7],[40,9,40,10],[45,3,45,4],[45,6,45,7],[45,9,45,10],[46,3,46,4],[46,6,46,7],[46,9,46,10],[43,3,43,4],[43,6,43,7],[43,9,43,10],[44,3,44,4],[44,6,44,7],[44,9,44,10],[49,3,49,4],[49,6,49,7],[49,9,49,10],[50,3,50,4],[50,6,50,7],[50,9,50,10],[47,3,47,4],[47,6,47,7],[47,9,47,10],[48,3,48,4],[48,6,48,7],[48,9,48,10],[53,3,53,4],[53,6,53,7],[53,9,53,10],[54,3,54,4],[54,6,54,7],[54,9,54,10],[51,3,51,4],[51,6,51,7],[51,9,51,10],[52,3,52,4],[52,6,52,7],[52,9,52,10],[57,3,57,4],[57,6,57,7],[57,9,57,10],[58,3,58,4],[58,6,58,7],[58,9,58,10],[55,3,55,4],[55,6,55,7],[55,9,55,10],[56,3,56,4],[56,6,56,7],[56,9,56,10],[61,3,61,4],[61,6,61,7],[61,9,61,10],[62,3,62,4],[62,6,62,7],[62,9,62,10],[59,3,59,4],[59,6,59,7],[59,9,59,10],[60,3,60,4],[60,6,60,7],[60,9,60,10],[65,3,65,4],[65,6,65,7],[65,9,65,10],[66,3,66,4],[66,6,66,7],[66,9,66,10],[63,3,63,4],[63,6,63,7],[63,9,63,10],[64,3,64,4],[64,6,64,7],[64,9,64,10],[69,3,69,4],[69,6,69,7],[69,9,69,10],[70,3,70,4],[70,6,70,7],[70,9,70,10],[67,3,67,4],[67,6,67,7],[67,9,67,10],[68,3,68,4],[68,6,68,7],[68,9,68,10],[73,3,73,4],[73,6,73,7],[73,9,73,10],[74,3,74,4],[74,6,74,7],[74,9,74,10],[71,3,71,4],[71,6,71,7],[71,9,71,10],[72,3,72,4],[72,6,72,7],[72,9,72,10],[77,3,77,4],[77,6,77,7],[77,9,77,10],[78,3,78,4],[78,6,78,7],[78,9,78,10],[75,3,75,4],[75,6,75,7],[75,9,75,10],[76,3,76,4],[76,6,76,7],[76,9,76,10],[81,3,81,4],[81,6,81,7],[81,9,81,10],[82,3,82,4],[82,6,82,7],[82,9,82,10],[79,3,79,4],[79,6,79,7],[79,9,79,10],[80,3,80,4],[80,6,80,7],[80,9,80,10],[85,3,85,4],[85,6,85,7],[85,9,85,10],[86,3,86,4],[86,6,86,7],[86,9,86,10],[83,3,83,4],[83,6,83,7],[83,9,83,10],[84,3,84,4],[84,6,84,7],[84,9,84,10],[89,3,89,4],[89,6,89,7],[89,9,89,10],[90,3,90,4],[90,6,90,7],[90,9,90,10],[87,3,87,4],[87,6,87,7],[87,9,87,10],[88,3,88,4],[88,6,88,7],[88,9,88,10],[93,3,93,4],[93,6,93,7],[93,9,93,10],[94,3,94,4],[94,6,94,7],[94,9,94,10],[91,3,91,4],[91,6,91,7],[91,9,91,10],[92,3,92,4],[92,6,92,7],[92,9,92,10],[97,3,97,4],[97,6,97,7],[97,9,97,10],[98,3,98,4],[98,6,98,7],[98,9,98,10],[95,3,95,4],[95,6,95,7],[95,9,95,10],[96,3,96,4],[96,6,96,7],[96,9,96,10],[101,3,101,4],[101,6,101,7],[101,9,101,10],[102,3,102,4],[102,6,102,7],[102,9,102,10],[99,3,99,4],[99,6,99,7],[99,9,99,10],[100,3,100,4],[100,6,100,7],[100,9,100,10],[105,3,105,4],[105,6,105,7],[105,9,105,10],[106,3,106,4],[106,6,106,7],[106,9,106,10],[103,3,103,4],[103,6,103,7],[103,9,103,10],[104,3,104,4],[104,6,104,7],[104,9,104,10],[109,3,109,4],[109,6,109,7],[109,9,109,10],[110,3,110,4],[110,6,110,7],[110,9,110,10],[107,3,107,4],[107,6,107,7],[107,9,107,10],[108,3,108,4],[108,6,108,7],[108,9,108,10],[113,3,113,4],[113,6,113,7],[113,9,113,10],[114,3,114,4],[114,6,114,7],[114,9,114,10],[111,3,111,4],[111,6,111,7],[111,9,111,10],[112,3,112,4],[112,6,112,7],[112,9,112,10],[117,3,117,4],[117,6,117,7],[117,9,117,10],[118,3,118,4],[118,6,118,7],[118,9,118,10],[115,3,115,4],[115,6,115,7],[115,9,115,10],[116,3,116,4],[116,6,116,7],[116,9,116,10],[121,3,121,4],[121,6,121,7],[121,9,121,10],[122,3,122,4],[122,6,122,7],[122,9,122,10],[119,3,119,4],[119,6,119,7],[119,9,119,10],[120,3,120,4],[120,6,120,7],[120,9,120,10],[125,3,125,4],[125,6,125,7],[125,9,125,10],[126,3,126,4],[126,6,126,7],[126,9,126,10],[123,3,123,4],[123,6,123,7],[123,9,123,10],[124,3,124,4],[124,6,124,7],[124,9,124,10],[129,3,129,4],[129,6,129,7],[129,9,129,10],[130,3,130,4],[130,6,130,7],[130,9,130,10],[127,3,127,4],[127,6,127,7],[127,9,127,10],[128,3,128,4],[128,6,128,7],[128,9,128,10],[133,3,133,4],[133,6,133,7],[133,9,133,10],[131,3,131,4],[131,6,131,7],[131,9,131,10],[132,3,132,4],[132,6,132,7],[132,9,132,10]]}
["Line No.","(a)","(b)","(c)",null,"(d)","(e)",null,"(f)","(g)"]
[1,"Bill Comparison"]
[2,"Schedule 1 - Residential"]
[3,null,"Current",null,null,"Proposed",null,null,"Revised",null,null,null,null,null,"3/4-inch",0.75]
[4,"Customer Count",{"$f":"'Bill Determ'!F11/12","v":207849.75},null,null,{"$f":"C5","v":207849.75},null,null,{"$f":"F5","v":207849.75},null,null,null,null,null,"1-inch",1]
[5,"Base",{"$f":"'Rate Design'!D4","v":8},null,null,15,null,null,{"$f":"'Rate Design'!D26","v":8.5},null,null,null,null,null,"1 1/2-inch",1.5]
{"$rows_left_out":129}
{"sheet":"Revenue Stability","index":12,"n_rows":26,"n_cols":12,"rows_kept":26,"cut":false,"hidden":false,"merged":[[12,2,12,4],[18,7,18,11],[0,1,0,11],[1,1,1,11],[2,1,2,11],[3,1,3,11],[5,2,5,4],[5,6,5,11]]}
[null,"AVISTA UTILITIES"]
[null,"WASHINGTON ELECTRIC"]
[null,"COLLECTION OF REVENUE AND DIFFERENCE IN RATES"]
[null,"12 MONTHS ENDED JUNE 30, 2013"]
["Line No.","A","B","C","D","E","F","G","H","I","J","K"]
[1,null,"Rates",null,null,null,"Revenue Percentages Collected by Rate Design (Sch. 1)"]
{"$rows_left_out":21}
{"sheet":"Bill Impact","index":13,"n_rows":24,"n_cols":13,"rows_kept":24,"cut":false,"hidden":true,"merged":[]}
[]
[]
["Schedule 001 Bill Impact"]
[]
[]
[]
{"$rows_left_out":19}
{"sheet":"WA Sch 25","index":14,"n_rows":167,"n_cols":25,"rows_kept":167,"cut":false,"hidden":true,"merged":[]}
["Washington Schedule 25 Billing Determinants",null,null,null,null,null,null,null,null,null,null,null,null,null,null,null,"1st",{"$f":"Q2","v":500000},{"$f":"R2","v":6000000}]
[null,null,null,null,null,null,null,null,null,null,null,null,null,null,null,"12-mo Ended",500000,6000000,99999999]
[null,"KWHs","Acct No.","2012-07-01","2012-08-01","2012-09-01","2012-10-01","2012-11-01","2012-12-01","2013-01-01","2013-02-01","2013-03-01","2013-04-01","2013-05-01","2013-06-01","Total","kwhs/mo","kwhs/mo","kwhs/mo",null,null,"Energy"]
[1,"BF Goodrich",770037736,4920409,5471306,5089955,4422298,4694815,5445493,5033826,4877725,5530526,5120850,4452916,3330474,{"$f":"SUM(D4:O4)","v":58390593},{"$f":"Q$2*12-SUMPRODUCT(--($D4:$O4<=Q$2),Q$2-$D4:$O4)","v":6000000},{"$f":"R$2*12-SUM($Q4:Q4)-SUMPRODUCT(--($D4:$O4<=R$2),R$2-$D4:$O4)","v":52390593},{"$f":"S$2*12-SUM($Q4:R4)-SUMPRODUCT(--($D4:$O4<=S$2),S$2-$D4:$O4)","v":0},null,null,{"$f":"P4/$P$25","v":5.4042911244335197E-2}]
[2,"Boise Cascade Plywood",500017,3325249,3446923,3236491,3368492,3063022,2609788,2963335,3091540,3348299,3278856,3200870,3189022,38121887,{"$f":"Q$2*12-SUMPRODUCT(--($D5:$O5<=Q$2),Q$2-$D5:$O5)","v":6000000},{"$f":"R$2*12-SUM($Q5:Q5)-SUMPRODUCT(--($D5:$O5<=R$2),R$2-$D5:$O5)","v":32121887},{"$f":"S$2*12-SUM($Q5:R5)-SUMPRODUCT(--($D5:$O5<=S$2),S$2-$D5:$O5)","v":0},null,null,3.5283384698757483E-2]
[3,"Boise Cascade Sawmill",500018,1245605,1206076,1212763,1410623,1428388,1462269,1571434,1385908,1351486,1442672,1338567,1310046,16365837,6000000,{"$f":"R$2*12-SUM($Q6:Q6)-SUMPRODUCT(--($D6:$O6<=R$2),R$2-$D6:$O6)","v":10365837},{"$f":"S$2*12-SUM($Q6:R6)-SUMPRODUCT(--($D6:$O6<=S$2),S$2-$D6:$O6)","v":0},null,null,1.5147259703806348E-2]
{"$rows_left_out":162}
{"sheet":"St Lts","index":15,"n_rows":87,"n_cols":74,"rows_kept":87,"cut":false,"hidden":true,"merged":[]}
["Street Light Summary",null,null,null,null,null,null,null,"WASHINGTON Street Lights",null,null,null,null,null,null,null,null,null,null,null,null,null,null,null,null,null,null,null,null,null,null,null,null,null,null,"% rate increase -->",{"$f":"'Lighting summary'!L11","v":0},{"$f":"'Lighting summary'!L12","v":0},{"$f":"'Lighting summary'!L13","v":0},{"$f":"'Lighting summary'!L14","v":0},{"$f":"'Lighting summary'!L15","v":0},null,null,null,null,null,null,null,null,null,null,null,null,null,null,null,"compare input Present Billing Rates to calculated Present Billing Rates",null,null,null,null,null,null,{"$f":"BE2","v":1.0401}]
["DWWPAOAE Report, as of 01/10/12",null,null,null,null,null,null,null,null,null,null,null,"Number of Lights(1)",null,null,null,null,null,"Present Rates",null,null,null,null,null,"Monthly Revenue at Present Rates",null,null,null,null,null,"Number of Lights",null,null,null,null,null,"Proposed Rates",null,null,null,null,null,"Monthly Revenue at Proposed Rates",null,null,null,null,null,null,"Present Billing Rates",null,null,null,null,null,{"$f":"-0.00067-0.00503","v":-5.7000000000000002E-3},{"$f":"1+'Lighting summary'!I39","v":1.0401},"Sch 91 & 93",null,null,null,null,null,"New Billing Rates",null,null,null,null,null,"Increase"]
[null,null,null,null,null,null,null,null,"Fixture Type","Pole Facility","Size","Sched","041","042","044","045","046",null,"041","042","044","045","046",null,"041","042","044","045","046",null,"041","042","044","045","046",null,"041","042","044","045","046",null,"041","042","044","045","046",null,"kwh","041","042","044","045","046",null,"Sch 93","041","042","044","045","046",null,null,"041","042","044","045","046",null,"041","042","044","045","046"]
[null,null,null,null,null,null,null,null,"Single Mercury Vapor","Direct Burial",4000,214,{"$f":"SUMIF($G:$G,TEXT(M$3,\"000\")&TEXT($L4,\"000\"),$E:$E)","v":75},0,0,0,0,null,13.89,0,0,0,0,null,{"$f":"IF(AND(M4<>0,S4=0),#VALUE!,M4*S4)","v":1041.75},{"$f":"IF(AND(N4<>0,T4=0),#VALUE!,N4*T4)","v":0},{"$f":"IF(AND(O4<>0,U4=0),#VALUE!,O4*U4)","v":0},{"$f":"IF(AND(P4<>0,V4=0),#VALUE!,P4*V4)","v":0},{"$f":"IF(AND(Q4<>0,W4=0),#VALUE!,Q4*W4)","v":0},null,{"$f":"M4","v":75},{"$f":"N4","v":0},0,0,0,null,{"$f":"ROUND(S4*(1+AK$1),2)","v":13.89},0,0,0,0,null,{"$f":"IF(AND(AE4<>0,AK4=0),#VALUE!,AE4*AK4)","v":1041.75},{"$f":"IF(AND(AF4<>0,AL4=0),#VALUE!,AF4*AL4)","v":0},{"$f":"IF(AND(AG4<>0,AM4=0),#VALUE!,AG4*AM4)","v":0},{"$f":"IF(AND(AH4<>0,AN4=0),#VALUE!,AH4*AN4)","v":0},{"$f":"IF(AND(AI4<>0,AO4=0),#VALUE!,AI4*AO4)","v":0},{"$f":"SUM(AQ4:AU4)-SUM(Y4:AC4)","v":0},42,14.21,null,null,null,null,null,{"$f":"ROUND(AW4*$BD$2,2)","v":-0.24},{"$f":"ROUND((S4*$BE$2)+$BD4-AX4,2)","v":0},null,null,null,null,null,null,{"$f":"AK4*$BL$1","v":14.446989},{"$f":"AL4*$BL$1","v":0},0,0,0,null,{"$f":"BL4-AX4","v":0.23698899999999945},{"$f":"BM4-AY4","v":0},{"$f":"BN4-AZ4","v":0},{"$f":"BO4-BA4","v":0},{"$f":"BP4-BB4","v":0}]
[null,"State","Sched","Rate Sub","# of Lights",null,null,null,"Single High-Pressure Sodium Vapor","Direct Burial","50W",234,0,129,0,0,0,null,0,13.04,0,0,0,null,{"$f":"IF(AND(M5<>0,S5=0),#VALUE!,M5*S5)","v":0},{"$f":"IF(AND(N5<>0,T5=0),#VALUE!,N5*T5)","v":1682.1599999999999},{"$f":"IF(AND(O5<>0,U5=0),#VALUE!,O5*U5)","v":0},{"$f":"IF(AND(P5<>0,V5=0),#VALUE!,P5*V5)","v":0},{"$f":"IF(AND(Q5<>0,W5=0),#VALUE!,Q5*W5)","v":0},null,{"$f":"M5","v":0},129,0,0,0,null,0,13.04,0,0,0,null,{"$f":"IF(AND(AE5<>0,AK5=0),#VALUE!,AE5*AK5)","v":0},{"$f":"IF(AND(AF5<>0,AL5=0),#VALUE!,AF5*AL5)","v":1682.1599999999999},0,0,0,0,20,null,13.45,null,null,null,null,{"$f":"ROUND(AW5*$BD$2,2)","v":-0.11},null,{"$f":"ROUND((T5*$BE$2)+$BD5-AY5,2)","v":0},null,null,null,null,null,{"$f":"AK5*$BL$1","v":0},{"$f":"AL5*$BL$1","v":13.562904},{"$f":"AM5*$BL$1","v":0},{"$f":"AN5*$BL$1","v":0},{"$f":"AO5*$BL$1","v":0},null,{"$f":"BL5-AX5","v":0},{"$f":"BM5-AY5","v":0.11290400000000034},{"$f":"BN5-AZ5","v":0},{"$f":"BO5-BA5","v":0},{"$f":"BP5-BB5","v":0}]
[null,null,null,null,null,null,null,null,"High-Pressure Sodium Vapor","Dusk to Dawn","70W",335,0,0,0,0,41,null,0,0,0,0,3.36,null,0,0,0,0,137.76,null,0,0,0,0,41,null,0,0,0,0,3.36,null,0,0,0,0,137.76,0,25,null,null,null,null,3.34,null,-0.14000000000000001,null,null,null,null,0.01,null,null,0,0,0,0,3.4947360000000001,null,0,0,0,0,0.15473600000000021]
{"$rows_left_out":82}
{"sheet":"Area Lts","index":16,"n_rows":63,"n_cols":48,"rows_kept":63,"cut":false,"hidden":true,"merged":[]}
["Area Light Summary",null,null,null,null,null,null,null,"WASHINGTON Area Lights",null,null,null,null,null,null,null,null,null,"Monthly Rev.",null,null,null,null,null,null,{"$f":"SL_RateIncr","v":0},null,null,"% rate increase -->",{"$f":"'Lighting summary'!L16","v":0},null,null,"Monthly Rev.",null,null,-1.9499999999999999E-3,{"$f":"-0.00503-0.00067","v":-5.7000000000000002E-3},null,null,null,"compare input Present Billing Rates to calculated Present Billing Rates"]
["DWWPWMS.AREA_LIGHT_ASMBLY1, as of 2/10/11",null,null,null,null,null,null,null,null,null,null,null,"# of Lights(1)",null,null,"Pres. Rates",null,null,"at Pres. Rates",null,null,"# of Lights(1)",null,null,null,null,"# of Lights",null,null,"Prop. Rates",null,null,"at Prop. Rates",null,null,null,"Pres. Billing Rates",null,null,null,{"$f":"'St Lts'!BE2","v":1.0401},{"$f":"'St Lts'!BF2","v":"Sch 91 & 93"},null,"New Billing Rates",null,{"$f":"'Lighting summary'!I39","v":4.0100000000000004E-2},"Increase"]
[null,null,null,null,null,null,null,null,"Fixture Type","Pole Facility","Size","Sched","047","048",null,"047","048",null,"047","048",null,"047","048",null,null,null,"047","048",null,"047","048",null,"047","048",null,"kwh","047","048","Sch 59","Sch 93","047","048",null,"047","048",null,"047","048"]
[null,null,null,null,null,null,null,null,"Sodium Vapor","Granville w/16' decorative pole","100W","HAG",{"$f":"SUMIF($G:$G,TEXT(M$3,\"000\")&TEXT($L4,\"000\"),$E:$E)","v":0},0,null,29.14,{"$f":"P4","v":29.14},null,{"$f":"IF(AND(M4<>0,P4=0),#VALUE!,M4*P4)","v":0},{"$f":"IF(AND(N4<>0,Q4=0),#VALUE!,N4*Q4)","v":0},null,{"$f":"SUMIF($G:$G,TEXT(V$3,\"000\")&TEXT($L4,\"000\"),$E:$E)","v":0},0,null,null,null,{"$f":"M4","v":0},{"$f":"N4","v":0},null,{"$f":"ROUND(P4*(1+AD$1),2)","v":29.14},{"$f":"AD4","v":29.14},null,{"$f":"IF(AND(AA4<>0,AD4=0),#VALUE!,AA4*AD4)","v":0},{"$f":"IF(AND(AB4<>0,AE4=0),#VALUE!,AB4*AE4)","v":0},null,40,30.08,30,{"$f":"ROUND($AJ$1*$AJ4,2)","v":-0.08},{"$f":"ROUND($AK$1*$AJ4,2)","v":-0.23},{"$f":"ROUND(P4*$AO$2-AK4+AN4,2)","v":0},{"$f":"ROUND(Q4*$AO$2-AL4+AM4+AN4,2)","v":0},null,{"$f":"AD4*$AT$2","v":1.1685140000000001},{"$f":"AE4*$AT$2+AM4","v":1.088514},null,{"$f":"AR4-AK4","v":-28.911485999999996},{"$f":"AS4-AL4","v":-28.911486}]
[null,"State","Sched","Rate Sub","# of Lights",null,null,null,"Sodium Vapor","Floodlight on existing standard","250W","HAH",95,9,null,21.56,{"$f":"P5","v":21.56},null,2048.1999999999998,194.04,null,95,9,null,null,null,{"$f":"M5","v":95},9,null,21.56,{"$f":"AD5","v":21.56},null,2048.1999999999998,194.04,null,107,21.81,21.6,{"$f":"ROUND($AJ$1*$AJ5,2)","v":-0.21},{"$f":"ROUND($AK$1*$AJ5,2)","v":-0.61},{"$f":"ROUND(P5*$AO$2-AK5+AN5,2)","v":0},{"$f":"ROUND(Q5*$AO$2-AL5+AM5+AN5,2)","v":0},null,{"$f":"AD5*$AT$2","v":0.86455599999999999},{"$f":"AE5*$AT$2+AM5","v":0.65455600000000003},null,{"$f":"AR5-AK5","v":-20.945443999999998},{"$f":"AS5-AL5","v":-20.945444000000002}]
[null,null,null,null,null,null,null,null,"Sodium Vapor","Kim light w/25' fiberglass pole","100W","HAI",15,3,null,28.14,28.14,null,422.1,84.42,null,15,3,null,null,null,15,3,null,{"$f":"ROUND(P6*(1+AD$1),2)","v":28.14},{"$f":"AD6","v":28.14},null,422.1,84.42,null,40,29.04,28.96,-0.08,-0.23,0,0,null,{"$f":"AD6*$AT$2","v":1.128414},1.048414,null,-27.911586,-27.911586]
{"$rows_left_out":58}
{"sheet":"Capital Recovery Factor Calc","index":17,"n_rows":38,"n_cols":11,"rows_kept":38,"cut":false,"hidden":true,"merged":[]}
[]
[]
[]
[]
["Avista",null,null,null,null,"Avista"]
["Capital Recovery Factor Calculation",null,null,null,null,"Capital Recovery Factor Calculation"]
{"$rows_left_out":33}
{"sheet":"Block Data","index":18,"n_rows":101,"n_cols":21,"rows_kept":101,"cut":false,"hidden":true,"merged":[]}
[]
[null,null,null,null,null,null,null,null,null,null,null,null,null,null,null,null,null,null,null,null,"Rate Design"]
["WASHINGTON ELECTRIC SYSTEM"]
[null,null,"July","August","September","October","November","December","January","February","March","April","May","June","Annual Total",null,null,null,null,null,"May"]
["Rate Design Program Monthly Results"]
["Block ID 900","Schedule 001"]
{"$rows_left_out":96}
{"sheet":"Rev Runs 12MEJUNE2013","index":19,"n_rows":110,"n_cols":19,"rows_kept":110,"cut":false,"hidden":true,"merged":[]}
[]
[]
[]
[null,"Electric Revenue Meters Report by Location  Twelve Months Ended  for Report Date : '06/30/2013'"]
[]
[null,"State Cde:WA"]
{"$rows_left_out":105}
{"sheet":"LED Rates","index":20,"n_rows":129,"n_cols":29,"rows_kept":129,"cut":false,"hidden":true,"merged":[[1,1,1,2],[2,1,2,2]]}
[]
[null,"Rates for New LED Street Lights"]
[null,"Washington"]
[]
[]
[]
{"$rows_left_out":123}