{"text_format":"1","workbook":"xlsx","n_sheets":13,"sheets":["Pres & Prop Rev","Exh1","Exh2","Exh3","Rate Design","ROR","BFG","Bill Determ","Crossover","Bill Impact","Block Usage","Big Schedules","Rev Runs CY"],"not_rendered":{"charts":0,"images":0,"macros":1,"external_links":5,"defined_names":36,"comments":8,"pivot_tables":0},"unopened":[],"bounds":{"document_bytes":16777216,"sheet_cells":100000,"rows_first":2000,"rows_last":500,"rows_between":2000,"halvings":0,"cell_chars":16384,"cell_head_chars":4096},"cells_cut":0,"cells_raw":0,"read":"whole","date_system":"1900"}

{"sheet":"Pres & Prop Rev","index":0,"n_rows":284,"n_cols":17,"rows_kept":284,"cut":false,"hidden":true,"merged":[[5,16,10,18]]}
[]
[null,null,null,null,null,null,null,null,null,"TRANSPORT"]
[null,null,null,null,null,null,null,null,null,"SCH 148 - WSU/"]
["WORK PAPER",null," ","GEN SERVICE","LRG GEN SVC","EX LRG GEN SVC","INTERRUPTIBLE","TRANSPORT","TRANSPORT","BF GOODRICH"]
["REFERENCE",null,"TOTAL","SCHEDULE 101","SCH. 111&112","SCH. 121&122","SCH. 131&132","SCHEDULE 146","SCHEDULE 148","ANN. MINIMUM",null,null,null,null,null,null,"Print Header for all printed pages on this worksheet:"]
[null,"PRESENT BILL DETERMINANTS",null,null,null,null,null,null,null,null,null,null,"Calculate all revenue exhibits using  ____ rates:",null,null,null,{"$f":"\"AVISTA UTILITIES\nWASHINGTON GAS\nPRO FORMA REVENUE UNDER PRESENT AND PROPOSED \"&O9&\" RATES\n12 MONTHS ENDED JUNE 30, 2013\"","v":"AVISTA UTILITIES\nWASHINGTON GAS\nPRO FORMA REVENUE UNDER PRESENT AND PROPOSED BASE TARIFF RATES\n12 MONTHS ENDED JUNE 30, 2013"}]
[null,"THERMS",null,null,null,null,null,null,null,null,null,"1)","BASE TARIFF"]
["PDE-G-8","BLOCK 1",null,{"$f":"'Bill Determ'!E7","v":74519037.366955951},{"$f":"'Bill Determ'!B12","v":5632648.154774134},{"$f":"'Bill Determ'!B21","v":177068.43212912412},{"$f":"'Bill Determ'!B25","v":240000},{"$f":"'Bill Determ'!B29","v":8309188.1009310083},{"$f":"'Bill Determ'!B35","v":20651785.813562941},{"$f":"'Bill Determ'!B41","v":9870960.7879201509},null,null,"or",null,1]
{"$rows_left_out":277}
{"sheet":"Exh1","index":1,"n_rows":36,"n_cols":14,"rows_kept":36,"cut":false,"hidden":false,"merged":[[0,13,2,14]]}
["AVISTA UTILITIES",null,null,null,null,null,null,null,null,null,null,null,null,"This worksheet pulls data from 'Pres & Prop Rev' tab."]
["WASHINGTON NATURAL GAS"]
["PROPOSED INCREASE BY SERVICE SCHEDULE"]
["12 MONTHS ENDED JUNE 30, 2013"]
["(000s of Dollars)"]
[]
[]
[null,null,null,"Base Tariff",null,"Base Tariff","Base","Total Billed",null,null,"Percent "]
{"$rows_left_out":29}
{"sheet":"Exh2","index":2,"n_rows":20,"n_cols":12,"rows_kept":20,"cut":false,"hidden":false,"merged":[]}
["AVISTA UTILITIES",null,null,null,null,null,null,null,null,null,null,"This worksheet pulls data from 'ROR' tab."]
["WASHINGTON NATURAL GAS"]
["PRESENT & PROPOSED RATES OF RETURN BY RATE SCHEDULE"]
["12 MONTHS ENDED JUNE 30, 2013"]
[]
[]
[]
[]
{"$rows_left_out":13}
{"sheet":"Exh3","index":3,"n_rows":55,"n_cols":23,"rows_kept":55,"cut":false,"hidden":false,"merged":[[54,0,54,9]]}
["AVISTA UTILITIES",null,null,null,null,null,null,null,null,null,null,"This worksheet uses Base & Billing rates from 'Rate Design' tab."]
["WASHINGTON NATURAL GAS"]
["PRESENT AND PROPOSED RATE COMPONENTS BY SCHEDULE"]
[]
[null,null,null,null,null,null,null,null,"Proposed","Proposed"]
[null,null,"Sch. 150","Base Rate","Present",null,"General ","Proposed ","Base Rate","Base Rate"]
[null,"Base","PGA","including","Billing","Present ","Rate ","Billing ","including","excluding"]
["Type of Service","Rate","Rate Adj","Schedule 150","Rate Adj.","Billing Rate (1)","Increase","Rate(1)","Schedule 150","Schedule 150"]
{"$rows_left_out":48}
{"sheet":"Rate Design","index":4,"n_rows":122,"n_cols":22,"rows_kept":122,"cut":false,"hidden":true,"merged":[]}
["PRESENT RATES",null,null,1,2,3,4,5,null,null,null,"Tiers - used for bill comparisons"]
[null,null,"TOTAL","SCH. 101","SCH. 111,112","SCH. 121,122","SCH. 132","SCH. 146",null,"Range Name",null,"SCH. 101","SCH. 111,112","SCH. 121,122","SCH. 131,132","SCH. 146"]
[null,"Base Tariff Rates"]
[1,"BASIC CHARGE",null,8,null,null,null,400]
[2,"MONTHLY MINIMUM",null,null,161.21,409.92]
[3,"BLOCK 1 PER THERM",null,{"$f":"27.398+0.821+49.803","v":78.021999999999991},{"$f":"-41.539+0.065+49.535","v":8.0609999999999928},{"$f":"-41.437+0.05+47.449","v":6.0619999999999976},{"$f":"18.464+0.51+44.955","v":63.929000000000002},{"$f":"8.151+0.082+0.056","v":8.2889999999999997},null,null,null,70,200,500,10000,20000]
[4,"BLOCK 2 PER THERM",null,{"$f":"37.398+0.929+49.803","v":88.13},{"$f":"25.957+0.687+49.535","v":76.179000000000002},{"$f":"27.558+0.688+47.449","v":75.694999999999993},{"$f":"13.996+0.474+44.955","v":59.424999999999997},{"$f":"7.251+0.073+0.056","v":7.3800000000000008},{"$f":"H7/H6-1","v":-0.10966340933767627},null,null,70,1000,1000,25000,50000]
[5,"BLOCK 3 PER THERM",null,null,{"$f":"18.701+0.621+49.535","v":68.856999999999999},{"$f":"20.138+0.62+47.449","v":68.206999999999994},{"$f":"12.9+0.465+44.955","v":58.32},{"$f":"6.537+0.066+0.056","v":6.6589999999999998},{"$f":"H8/H7-1","v":-9.7696476964769796E-2},"Rates_Base_Present",null,9999999,9999999,10000,50000,300000]
{"$rows_left_out":115}
{"sheet":"ROR","index":5,"n_rows":62,"n_cols":15,"rows_kept":62,"cut":false,"hidden":true,"merged":[]}
[null,"AVISTA UTILITIES"]
[null,"WASHINGTON GAS"]
[null,"PRESENT & PROPOSED RATE OF RETURN BY RATE SCHEDULE"]
[null,"12 MONTHS ENDED JUNE 30, 2013"]
[]
[]
[null,null,"Total","Sch 101","Sch 111","Sch 121","Sch 131","Sch 146",null,null,"COS Line"]
[null,"Total Rate Base",{"$f":"SUM(D8:H8)","v":249359999.99999997},193733066.96157509,39932442.330106474,3569118.4786558771,851456.4145485498,11273915.815114003,"from COS",null,461]
{"$rows_left_out":55}
{"sheet":"BFG","index":6,"n_rows":24,"n_cols":6,"rows_kept":24,"cut":false,"hidden":true,"merged":[]}
["AVISTA UTILITIES"]
["GAS ANNUAL MINIMUM DEFICIENCY FOR B.F. GOODRICH"]
["STATE OF WASHINGTON"]
["BASED ON 2007 ANNUAL MINIMUM"]
[]
[null,null,null,null,null,"Gas"]
["Annual Minimum Usage Requirement(1)",null,null,null,null,10500000]
["Less: Jan 09 - Dec 09 Usage(2)",null,null,null,null,{"$f":"SUMIF('Big Schedules'!$A$4:$A$44,\"BF Goodrich\",'Big Schedules'!$N$4:$N$44)","v":0}]
{"$rows_left_out":17}
{"sheet":"Bill Determ","index":7,"n_rows":87,"n_cols":48,"rows_kept":87,"cut":false,"hidden":true,"merged":[[4,41,4,47],[4,1,4,7],[4,9,4,15],[4,17,4,23],[4,25,4,31],[4,33,4,39]]}
["AVISTA UTILITIES"]
["WASHINGTON GAS"]
["USAGE & BILLINGS BY RATE SCHEDULE",null,"Billing Determinants"]
["12 MONTHS ENDED JUNE 30, 2013",null,"Rate Year"]
[null,"Current",null,null,null,null,null,null,null,"Last GRC",null,null,null,null,null,null,null,"Difference",null,null,null,null,null,null,null,"Percentage",null,null,null,null,null,null,null,2015,null,null,null,null,null,null,null,2016]
["Schedule 101","Total therms","Total Billings",null,"0-70",">70","Total Therms",null,null,"Total therms","Total Billings",null,"0-70",">70","Total Therms",null,null,"Total therms","Total Billings",null,"0-70",">70","Total Therms",null,null,"Total therms","Total Billings",null,"0-70",">70","Total Therms",null,null,"Total therms","Total Billings",null,"0-70",">70","Total Therms",null,null,"Total therms","Total Billings",null,"0-70",">70","Total Therms"]
["therms per Revenue Run(1)(2)",{"$f":"IF($C$4=\"Rate Year\",AH7,IF($C$4=2016,AP7,'Rev Runs CY'!O38))","v":117011207},{"$f":"IF($C$4=\"Rate Year\",AI7,IF($C$4=2016,AQ7,'Rev Runs CY'!O12*12))","v":1802235},null,{"$f":"IF($C$4=\"Rate Year\",AK7,IF($C$4=\"2016\",AS7,'Block Usage'!O17))","v":74519037.366955951},{"$f":"IF($C$4=\"Rate Year\",AL7,IF($C$4=\"2016\",AT7,'Block Usage'!O18))","v":42492169.633044057},{"$f":"SUM(D7:F7)","v":117011207},null,null,123192356,1748256,null,75494547,47697809,{"$f":"SUM(L7:N7)","v":123192356},null,null,{"$f":"B7-J7","v":-6181149},{"$f":"C7-K7","v":53979},null,{"$f":"E7-M7","v":-975509.63304404914},{"$f":"F7-N7","v":-5205639.3669559434},{"$f":"SUM(T7:V7)","v":-6181148.9999999925},null,null,{"$f":"R7/J7","v":-5.0174777077889476E-2},{"$f":"S7/K7","v":3.0875912909779802E-2},null,{"$f":"U7/M7","v":-1.2921590655336327E-2},{"$f":"V7/N7","v":-0.10913791379717135},{"$f":"W7/O7","v":-5.0174777077889414E-2},null,null,117011207,1802235,null,74519037.366955951,42492169.633044057,{"$f":"SUM(AJ7:AL7)","v":117011207},null,null,117834261,1818533,null,75043202.473474532,42791058.526525475,{"$f":"SUM(AR7:AT7)","v":117834261}]
[null,null,null,null,null,null,{"$f":"IF($C$4=\"Rate Year\",AM8,IF($C$4=\"2016\",AU8,'Rev Runs CY'!O38))","v":117011207},null,null,null,null,null,null,null,123192356,null,null,null,null,null,null,null,{"$f":"G8-O8","v":-6181149},null,null,null,null,null,null,null,{"$f":"W8/O8","v":-5.0174777077889476E-2},null,null,null,null,null,null,null,117011207,null,null,null,null,null,null,null,117834261]
{"$rows_left_out":80}
{"sheet":"Crossover","index":8,"n_rows":134,"n_cols":24,"rows_kept":134,"cut":false,"hidden":false,"merged":[[132,3,132,4],[132,6,132,7],[132,9,132,10],[132,12,132,13],[133,3,133,4],[133,6,133,7],[133,9,133,10],[133,12,133,13],[130,3,130,4],[130,6,130,7],[130,9,130,10],[130,12,130,13],[131,3,131,4],[131,6,131,7],[131,9,131,10],[131,12,131,13],[128,3,128,4],[128,6,128,7],[128,9,128,10],[128,12,128,13],[129,3,129,4],[129,6,129,7],[129,9,129,10],[129,12,129,13],[126,3,126,4],[126,6,126,7],[126,9,126,10],[126,12,126,13],[127,3,127,4],[127,6,127,7],[127,9,127,10],[127,12,127,13],[124,3,124,4],[124,6,124,7],[124,9,124,10],[124,12,124,13],[125,3,125,4],[125,6,125,7],[125,9,125,10],[125,12,125,13],[122,3,122,4],[122,6,122,7],[122,9,122,10],[122,12,122,13],[123,3,123,4],[123,6,123,7],[123,9,123,10],[123,12,123,13],[120,3,120,4],[120,6,120,7],[120,9,120,10],[120,12,120,13],[121,3,121,4],[121,6,121,7],[121,9,121,10],[121,12,121,13],[118,3,118,4],[118,6,118,7],[118,9,118,10],[118,12,118,13],[119,3,119,4],[119,6,119,7],[119,9,119,10],[119,12,119,13],[116,3,116,4],[116,6,116,7],[116,9,116,10],[116,12,116,13],[117,3,117,4],[117,6,117,7],[117,9,117,10],[117,12,117,13],[114,3,114,4],[114,6,114,7],[114,9,114,10],[114,12,114,13],[115,3,115,4],[115,6,115,7],[115,9,115,10],[115,12,115,13],[112,3,112,4],[112,6,112,7],[112,9,112,10],[112,12,112,13],[113,3,113,4],[113,6,113,7],[113,9,113,10],[113,12,113,13],[110,3,110,4],[110,6,110,7],[110,9,110,10],[110,12,110,13],[111,3,111,4],[111,6,111,7],[111,9,111,10],[111,12,111,13],[108,3,108,4],[108,6,108,7],[108,9,108,10],[108,12,108,13],[109,3,109,4],[109,6,109,7],[109,9,109,10],[109,12,109,13],[106,3,106,4],[106,6,106,7],[106,9,106,10],[106,12,106,13],[107,3,107,4],[107,6,107,7],[107,9,107,10],[107,12,107,13],[104,3,104,4],[104,6,104,7],[104,9,104,10],[104,12,104,13],[105,3,105,4],[105,6,105,7],[105,9,105,10],[105,12,105,13],[102,3,102,4],[102,6,102,7],[102,9,102,10],[102,12,102,13],[103,3,103,4],[103,6,103,7],[103,9,103,10],[103,12,103,13],[100,3,100,4],[100,6,100,7],[100,9,100,10],[100,12,100,13],[101,3,101,4],[101,6,101,7],[101,9,101,10],[101,12,101,13],[98,3,98,4],[98,6,98,7],[98,9,98,10],[98,12,98,13],[99,3,99,4],[99,6,99,7],[99,9,99,10],[99,12,99,13],[96,3,96,4],[96,6,96,7],[96,9,96,10],[96,12,96,13],[97,3,97,4],[97,6,97,7],[97,9,97,10],[97,12,97,13],[94,3,94,4],[94,6,94,7],[94,9,94,10],[94,12,94,13],[95,3,95,4],[95,6,95,7],[95,9,95,10],[95,12,95,13],[92,3,92,4],[92,6,92,7],[92,9,92,10],[92,12,92,13],[93,3,93,4],[93,6,93,7],[93,9,93,10],[93,12,93,13],[90,3,90,4],[90,6,90,7],[90,9,90,10],[90,12,90,13],[91,3,91,4],[91,6,91,7],[91,9,91,10],[91,12,91,13],[88,3,88,4],[88,6,88,7],[88,9,88,10],[88,12,88,13],[89,3,89,4],[89,6,89,7],[89,9,89,10],[89,12,89,13],[86,3,86,4],[86,6,86,7],[86,9,86,10],[86,12,86,13],[87,3,87,4],[87,6,87,7],[87,9,87,10],[87,12,87,13],[84,3,84,4],[84,6,84,7],[84,9,84,10],[84,12,84,13],[85,3,85,4],[85,6,85,7],[85,9,85,10],[85,12,85,13],[82,3,82,4],[82,6,82,7],[82,9,82,10],[82,12,82,13],[83,3,83,4],[83,6,83,7],[83,9,83,10],[83,12,83,13],[80,3,80,4],[80,6,80,7],[80,9,80,10],[80,12,80,13],[81,3,81,4],[81,6,81,7],[81,9,81,10],[81,12,81,13],[78,3,78,4],[78,6,78,7],[78,9,78,10],[78,12,78,13],[79,3,79,4],[79,6,79,7],[79,9,79,10],[79,12,79,13],[76,3,76,4],[76,6,76,7],[76,9,76,10],[76,12,76,13],[77,3,77,4],[77,6,77,7],[77,9,77,10],[77,12,77,13],[74,3,74,4],[74,6,74,7],[74,9,74,10],[74,12,74,13],[75,3,75,4],[75,6,75,7],[75,9,75,10],[75,12,75,13],[72,3,72,4],[72,6,72,7],[72,9,72,10],[72,12,72,13],[73,3,73,4],[73,6,73,7],[73,9,73,10],[73,12,73,13],[70,3,70,4],[70,6,70,7],[70,9,70,10],[70,12,70,13],[71,3,71,4],[71,6,71,7],[71,9,71,10],[71,12,71,13],[68,3,68,4],[68,6,68,7],[68,9,68,10],[68,12,68,13],[69,3,69,4],[69,6,69,7],[69,9,69,10],[69,12,69,13],[66,3,66,4],[66,6,66,7],[66,9,66,10],[66,12,66,13],[67,3,67,4],[67,6,67,7],[67,9,67,10],[67,12,67,13],[64,3,64,4],[64,6,64,7],[64,9,64,10],[64,12,64,13],[65,3,65,4],[65,6,65,7],[65,9,65,10],[65,12,65,13],[62,3,62,4],[62,6,62,7],[62,9,62,10],[62,12,62,13],[63,3,63,4],[63,6,63,7],[63,9,63,10],[63,12,63,13],[60,3,60,4],[60,6,60,7],[60,9,60,10],[60,12,60,13],[61,3,61,4],[61,6,61,7],[61,9,61,10],[61,12,61,13],[58,3,58,4],[58,6,58,7],[58,9,58,10],[58,12,58,13],[59,3,59,4],[59,6,59,7],[59,9,59,10],[59,12,59,13],[56,3,56,4],[56,6,56,7],[56,9,56,10],[56,12,56,13],[57,3,57,4],[57,6,57,7],[57,9,57,10],[57,12,57,13],[54,3,54,4],[54,6,54,7],[54,9,54,10],[54,12,54,13],[55,3,55,4],[55,6,55,7],[55,9,55,10],[55,12,55,13],[52,3,52,4],[52,6,52,7],[52,9,52,10],[52,12,52,13],[53,3,53,4],[53,6,53,7],[53,9,53,10],[53,12,53,13],[50,3,50,4],[50,6,50,7],[50,9,50,10],[50,12,50,13],[51,3,51,4],[51,6,51,7],[51,9,51,10],[51,12,51,13],[48,3,48,4],[48,6,48,7],[48,9,48,10],[48,12,48,13],[49,3,49,4],[49,6,49,7],[49,9,49,10],[49,12,49,13],[46,3,46,4],[46,6,46,7],[46,9,46,10],[46,12,46,13],[47,3,47,4],[47,6,47,7],[47,9,47,10],[47,12,47,13],[44,3,44,4],[44,6,44,7],[44,9,44,10],[44,12,44,13],[45,3,45,4],[45,6,45,7],[45,9,45,10],[45,12,45,13],[42,3,42,4],[42,6,42,7],[42,9,42,10],[42,12,42,13],[43,3,43,4],[43,6,43,7],[43,9,43,10],[43,12,43,13],[40,3,40,4],[40,6,40,7],[40,9,40,10],[40,12,40,13],[41,3,41,4],[41,6,41,7],[41,9,41,10],[41,12,41,13],[38,3,38,4],[38,6,38,7],[38,9,38,10],[38,12,38,13],[39,3,39,4],[39,6,39,7],[39,9,39,10],[39,12,39,13],[36,3,36,4],[36,6,36,7],[36,9,36,10],[36,12,36,13],[37,3,37,4],[37,6,37,7],[37,9,37,10],[37,12,37,13],[34,3,34,4],[34,6,34,7],[34,9,34,10],[34,12,34,13],[35,3,35,4],[35,6,35,7],[35,9,35,10],[35,12,35,13],[32,3,32,4],[32,6,32,7],[32,9,32,10],[32,12,32,13],[33,3,33,4],[33,6,33,7],[33,9,33,10],[33,12,33,13],[30,3,30,4],[30,6,30,7],[30,9,30,10],[30,12,30,13],[31,3,31,4],[31,6,31,7],[31,9,31,10],[31,12,31,13],[28,3,28,4],[28,6,28,7],[28,9,28,10],[28,12,28,13],[29,3,29,4],[29,6,29,7],[29,9,29,10],[29,12,29,13],[26,3,26,4],[26,6,26,7],[26,9,26,10],[26,12,26,13],[27,3,27,4],[27,6,27,7],[27,9,27,10],[27,12,27,13],[24,3,24,4],[24,6,24,7],[24,9,24,10],[24,12,24,13],[25,3,25,4],[25,6,25,7],[25,9,25,10],[25,12,25,13],[22,3,22,4],[22,6,22,7],[22,9,22,10],[22,12,22,13],[23,3,23,4],[23,6,23,7],[23,9,23,10],[23,12,23,13],[20,3,20,4],[20,6,20,7],[20,9,20,10],[20,12,20,13],[21,3,21,4],[21,6,21,7],[21,9,21,10],[21,12,21,13],[18,3,18,4],[18,6,18,7],[18,9,18,10],[18,12,18,13],[19,3,19,4],[19,6,19,7],[19,9,19,10],[19,12,19,13],[16,3,16,4],[16,6,16,7],[16,9,16,10],[16,12,16,13],[17,3,17,4],[17,6,17,7],[17,9,17,10],[17,12,17,13],[13,2,13,4],[13,5,13,7],[13,8,13,10],[13,11,13,13],[14,1,14,10],[15,3,15,4],[15,6,15,7],[15,9,15,10],[15,12,15,13],[11,2,11,4],[11,5,11,7],[11,8,11,10],[11,11,11,13],[12,2,12,4],[12,5,12,7],[12,8,12,10],[12,11,12,13],[9,2,9,4],[9,5,9,7],[9,8,9,10],[9,11,9,13],[10,2,10,4],[10,5,10,7],[10,8,10,10],[10,11,10,13],[7,2,7,4],[7,5,7,7],[7,8,7,10],[7,11,7,13],[8,2,8,4],[8,5,8,7],[8,8,8,10],[8,11,8,13],[5,2,5,4],[5,5,5,7],[5,8,5,10],[5,11,5,13],[6,2,6,4],[6,5,6,7],[6,8,6,10],[6,11,6,13],[3,2,3,4],[3,5,3,7],[3,8,3,10],[3,11,3,13],[4,2,4,4],[4,5,4,7],[4,8,4,10],[4,11,4,13],[0,3,0,4],[0,6,0,7],[0,9,0,10],[0,12,0,13],[1,1,1,10],[2,1,2,10],[2,11,2,13]]}
["Line No.","(a)","(b)","(c)",null,"(d)","(e)",null,"(f)","(g)",null,"(h)","(i)"]
[1,"Bill Comparison"]
[2,"Schedule 101 - General Service",null,null,null,null,null,null,null,null,null,"Compare"]
[3,null,"Current",null,null,"Proposed",null,null,"Revised",null,null,"Schedule 111/112",null,null,null,null,null,"3/4-inch",0.75]
[4,"Customer Count",{"$f":"'Bill Determ'!C7/12","v":150186.25},null,null,{"$f":"C5","v":150186.25},null,null,{"$f":"F5","v":150186.25},null,null,{"$f":"'Bill Determ'!F21","v":874046.27393154439},null,null,null,null,null,"1-inch",1]
[5,"Base",{"$f":"'Rate Design'!D4","v":8},null,null,12,null,null,{"$f":"'Rate Design'!D26","v":8.92},null,null,{"$f":"'Rate Design'!E63","v":78.498400000000004},null,null,null,null,null,"1 1/2-inch",1.5]
[6,"Allowance",0,null,null,0,null,null,0,null,null,0,null,null,null,null,null,"2-inch",2]
[7,"Rate 1",{"$f":"'Rate Design'!D16/100","v":0.81824999999999992},null,null,0.83727999999999991,null,null,{"$f":"'Rate Design'!D38/100","v":0.81825000000000003},null,null,{"$f":"'Rate Design'!E28/100","v":0.49534999999999996},null,null,null,null,null,"3-inch",3]
{"$rows_left_out":127}
{"sheet":"Bill Impact","index":9,"n_rows":107,"n_cols":15,"rows_kept":107,"cut":false,"hidden":true,"merged":[]}
[]
["Schedule 101 Bill Impact"]
[]
[]
[]
["Schedule 101 Present",null,null,null,null,null,"Schedule 101 Proposed"]
[null,"Basic Charge","Block 1","Block 2","Total Bill",null,"Basic Charge","Block 1","Block 2","Total Bill",null,"Bill Impact","% Change"]
[null,{"$f":"'Rate Design'!D4","v":8},{"$f":"'Rate Design'!D16/100","v":0.81824999999999992},{"$f":"'Rate Design'!D17/100","v":0.91932999999999998},null,null,{"$f":"'Rate Design'!D26","v":8.92},{"$f":"'Rate Design'!D38/100","v":0.81825000000000003},{"$f":"'Rate Design'!D39/100","v":0.91932999999999998}]
{"$rows_left_out":100}
{"sheet":"Block Usage","index":10,"n_rows":39,"n_cols":16,"rows_kept":39,"cut":false,"hidden":true,"merged":[]}
["WASHINGTON NATURAL GAS SYSTEM"]
[null,null,"July","August","September","October","November","December","January","February","March","April","May","June","Annual Total"]
["Rate Design Program Monthly Results"]
["Block ID 994","Schedule 101"]
[null,"Block 1",{"$f":"2289856+338058","v":2627914},{"$f":"1685830+153167","v":1838997},{"$f":"1748325+172886","v":1921211},{"$f":"2425764+440062","v":2865826},{"$f":"3838030+2758236","v":6596266},{"$f":"4148979+4700019","v":8848998},{"$f":"4227979+5233524","v":9461503},{"$f":"4250537+5275282","v":9525819},{"$f":"4209112+4882989","v":9092101},{"$f":"4123889+4015673","v":8139562},6221393,{"$f":"2904457+709593","v":3614050},{"$f":"SUM(C5:N5)","v":70753640}]
[null,"Block 2",286903,144006,224810,278742,1447215,5714564,10740840,10755014,6221729,3048323,1011294,374714,{"$f":"SUM(C6:N6)","v":40248154}]
["Therms","Total",{"$f":"SUM(C5:C6)","v":2914817},1983003,2146021,3144568,8043481,14563562,20202343,20280833,15313830,11187885,7232687,3988764,111001794]
[null,"Billed Customers",146524,146433,147360,146875,147245,147536,147902,147934,147801,147781,147555,147321,{"$f":"SUM(C8:N8)","v":1768267}]
{"$rows_left_out":32}
{"sheet":"Big Schedules","index":11,"n_rows":133,"n_cols":21,"rows_kept":133,"cut":false,"hidden":true,"merged":[]}
["Washington Gas Billing Determinants by Customer"]
[null,null,null,null,null,null,null,null,null,null,null,null,null,null,null,"1st",{"$f":"P3","v":20000},{"$f":"Q3","v":50000},{"$f":"R3","v":300000},{"$f":"S3","v":500000}]
["ANNUAL USAGE, Sch 146",null,null,null,null,null,null,null,null,null,null,null,null,"12-mo ended",null,20000,50000,300000,500000,99999999]
["Washington","2012-07-01","2012-08-01","2012-09-01","2012-10-01","2012-11-01","2012-12-01","2013-01-01","2013-02-01","2013-03-01","2013-04-01","2013-05-01","2013-06-01","Total",null,"thms/mo","thms/mo","thms/mo","thms/mo","thms/mo"]
[null,20564,573,6848,22580,188950,347042,470645,527900,351026,272295,183435,23446,{"$f":"SUM(B5:M5)","v":2415304},null,{"$f":"P$3*12-SUMPRODUCT(--($B5:$M5<=P$3),P$3-$B5:$M5)","v":207421},{"$f":"Q$3*12-SUM($P5:P5)-SUMPRODUCT(--($B5:$M5<=Q$3),Q$3-$B5:$M5)","v":216590},{"$f":"R$3*12-SUM($P5:Q5)-SUMPRODUCT(--($B5:$M5<=R$3),R$3-$B5:$M5)","v":1494680},{"$f":"S$3*12-SUM($P5:R5)-SUMPRODUCT(--($B5:$M5<=S$3),S$3-$B5:$M5)","v":468713},{"$f":"T$3*12-SUM($P5:S5)-SUMPRODUCT(--($B5:$M5<=T$3),T$3-$B5:$M5)","v":27900}]
[null,25131,24359,26353,23294,29175,26926,26435,29483,25565,25713,26414,26613,{"$f":"SUM(B6:M6)","v":315461},null,240000,{"$f":"Q$3*12-SUM($P6:P6)-SUMPRODUCT(--($B6:$M6<=Q$3),Q$3-$B6:$M6)","v":75461},{"$f":"R$3*12-SUM($P6:Q6)-SUMPRODUCT(--($B6:$M6<=R$3),R$3-$B6:$M6)","v":0},{"$f":"S$3*12-SUM($P6:R6)-SUMPRODUCT(--($B6:$M6<=S$3),S$3-$B6:$M6)","v":0},{"$f":"T$3*12-SUM($P6:S6)-SUMPRODUCT(--($B6:$M6<=T$3),T$3-$B6:$M6)","v":0}]
[null,28687,32273,45398,27675,42624,48836,33733,50735,39818,45937,33067,42330,471113,null,240000,{"$f":"Q$3*12-SUM($P7:P7)-SUMPRODUCT(--($B7:$M7<=Q$3),Q$3-$B7:$M7)","v":230378},{"$f":"R$3*12-SUM($P7:Q7)-SUMPRODUCT(--($B7:$M7<=R$3),R$3-$B7:$M7)","v":735},{"$f":"S$3*12-SUM($P7:R7)-SUMPRODUCT(--($B7:$M7<=S$3),S$3-$B7:$M7)","v":0},{"$f":"T$3*12-SUM($P7:S7)-SUMPRODUCT(--($B7:$M7<=T$3),T$3-$B7:$M7)","v":0}]
[null,34079,57633,35917,29740,35920,31209,24090,39532,32771,33116,34667,31156,419830,null,240000,{"$f":"Q$3*12-SUM($P8:P8)-SUMPRODUCT(--($B8:$M8<=Q$3),Q$3-$B8:$M8)","v":172197},{"$f":"R$3*12-SUM($P8:Q8)-SUMPRODUCT(--($B8:$M8<=R$3),R$3-$B8:$M8)","v":7633},{"$f":"S$3*12-SUM($P8:R8)-SUMPRODUCT(--($B8:$M8<=S$3),S$3-$B8:$M8)","v":0},{"$f":"T$3*12-SUM($P8:S8)-SUMPRODUCT(--($B8:$M8<=T$3),T$3-$B8:$M8)","v":0}]
{"$rows_left_out":126}
{"sheet":"Rev Runs CY","index":12,"n_rows":54,"n_cols":15,"rows_kept":54,"cut":false,"hidden":true,"merged":[]}
[]
[]
[]
[]
["Gas Revenue Meters Report by Location  Twelve Months Ended  for Report Date : '06/30/2013'"]
[]
["State Cde:WA"]
[]
{"$rows_left_out":46}