{"text_format":"1","workbook":"xlsx","n_sheets":25,"sheets":["Index","Input","OpEx","Cost of Service","Net Carryover","Return on Rate Base","Income Tax Allowance","Rate Base","AFUDC - Calculation","AFUDC - Amortization","Amortization Rate","Tax Depreciation","ADIT","TEFRA","FASB-Excess","Rates","Tput Adjuster","Index - Data","Annual Data","Monthly CWIP","Tariff Year Data","TransitionCosts","2017 opex","2017 project exp","Revenue"],"not_rendered":{"charts":0,"images":0,"macros":0,"external_links":12,"defined_names":3544,"comments":1,"pivot_tables":0},"unopened":[],"bounds":{"document_bytes":16777216,"sheet_cells":100000,"rows_first":2000,"rows_last":500,"rows_between":2000,"halvings":0,"cell_chars":16384,"cell_head_chars":4096},"cells_cut":0,"cells_raw":0,"read":"whole","date_system":"1900"}

{"sheet":"Index","index":0,"n_rows":25,"n_cols":3,"rows_kept":25,"cut":false,"hidden":false,"merged":[]}
[]
[]
[null,"Exhibit No. 1.4(a)"]
[null,"Olympic Pipe Line Company"]
[null,"Index"]
[]
[]
[null,"Schedule","Schedule Descriptions"]
{"$rows_left_out":18}
{"sheet":"Input","index":1,"n_rows":295,"n_cols":20,"rows_kept":295,"cut":false,"hidden":false,"merged":[]}
[{"$f":"+Index!B4","v":"Olympic Pipe Line Company"},null,null,null,null,null,null,null,null,{"$f":"+'Cost of Service'!U1","v":"Exhibit No. 1.4(a)"},null,null,null,null,null,null,null,null,{"$f":"J1","v":"Exhibit No. 1.4(a)"}]
[{"$f":"Index!C10","v":"Input Summary"},null,null,null,null,null,null,null,null,{"$f":"Index!$B$10","v":"Schedule 1"},null,null,null,null,null,null,null,null,{"$f":"Index!$B$10","v":"Schedule 1"}]
["($000's)",null,"Input Data"]
[null,null,"YEAR",2018,null,null,null,null,null,"Page 1 of 10",null,null,null,null,null,null,null,null,"Page 6 of 10"]
[]
["Line"]
["No.","Description","Source",null,"2003 EOY",2004,2005,2006,2007,2008,2009,2010,2011,2012,2013,2014,2015,2016,2017,2018]
[]
{"$rows_left_out":288}
{"sheet":"OpEx","index":2,"n_rows":50,"n_cols":20,"rows_kept":50,"cut":false,"hidden":false,"merged":[]}
[{"$f":"+'Cost of Service'!A1","v":"Olympic Pipe Line Company"},null,null,null,null,null,null,null,null,null,null,null,null,null,null,null,null,null,{"$f":"+Input!S1","v":"Exhibit No. 1.4(a)"}]
[{"$f":"+Index!C11","v":"Adjustment to Operating Expenses"},null,null,null,null,null,null,null,null,null,null,null,null,null,null,null,null,null,{"$f":"+Index!B11","v":"Schedule 2"}]
[{"$f":"+units","v":"($000's)"}]
[]
["Line"]
["No","Description ($ 000's)","Source",null,null,{"$f":"+Input!F7","v":2004},{"$f":"+Input!G7","v":2005},{"$f":"+Input!H7","v":2006},{"$f":"+Input!I7","v":2007},{"$f":"+Input!J7","v":2008},{"$f":"+Input!K7","v":2009},{"$f":"+Input!L7","v":2010},{"$f":"+Input!M7","v":2011},{"$f":"+Input!N7","v":2012},{"$f":"+Input!O7","v":2013},{"$f":"+Input!P7","v":2014},{"$f":"+Input!Q7","v":2015},{"$f":"+Input!R7","v":2016},{"$f":"+Input!S7","v":2017},{"$f":"+Input!T7","v":2018}]
[]
[null,"Operating Expenses - Unadjusted"]
{"$rows_left_out":43}
{"sheet":"Cost of Service","index":3,"n_rows":41,"n_cols":22,"rows_kept":41,"cut":false,"hidden":false,"merged":[]}
[{"$f":"+Index!B4","v":"Olympic Pipe Line Company"},null,null,null,null,null,null,null,null,null,null,null,null,null,null,null,null,null,null,null,{"$f":"+Index!B3","v":"Exhibit No. 1.4(a)"}]
[{"$f":"Index!$C$12","v":"Total Revenue Requirment (Including Net Carryover)"},null,null,null,null,null,null,null,null,null,null,null,null,null,null,null,null,null,null,null,{"$f":"Index!$B$12","v":"Schedule 3"}]
[{"$f":"units","v":"($000's)"}]
[]
[]
["Line"]
["No.","Description","Source",null,null,null,null,{"$f":"+Input!F7","v":2004},{"$f":"+Input!G7","v":2005},{"$f":"+Input!H7","v":2006},{"$f":"+Input!I7","v":2007},{"$f":"+Input!J7","v":2008},{"$f":"+Input!K7","v":2009},{"$f":"+Input!L7","v":2010},{"$f":"+Input!M7","v":2011},{"$f":"+Input!N7","v":2012},{"$f":"+Input!O7","v":2013},{"$f":"+Input!P7","v":2014},{"$f":"+Input!Q7","v":2015},{"$f":"+Input!R7","v":2016},{"$f":"+Input!S7","v":2017},{"$f":"+Input!T7","v":2018}]
[]
{"$rows_left_out":34}
{"sheet":"Net Carryover","index":4,"n_rows":16,"n_cols":22,"rows_kept":16,"cut":false,"hidden":false,"merged":[]}
[{"$f":"+'Cost of Service'!A1","v":"Olympic Pipe Line Company"},null,null,null,null,null,null,null,null,null,null,null,null,null,null,null,null,null,null,null,{"$f":"+'Cost of Service'!U1","v":"Exhibit No. 1.4(a)"}]
[{"$f":"+Index!C13","v":"Net Carryover"},null,null,null,null,null,null,null,null,null,null,null,null,null,null,null,null,null,null,null,{"$f":"+Index!B13","v":"Schedule 4"}]
[{"$f":"+'Cost of Service'!A3","v":"($000's)"}]
[]
[]
["Line"]
["No.","Description",null,null,null,"Source",null,{"$f":"+'Cost of Service'!H7","v":2004},{"$f":"+'Cost of Service'!I7","v":2005},{"$f":"+'Cost of Service'!J7","v":2006},{"$f":"+'Cost of Service'!K7","v":2007},{"$f":"+'Cost of Service'!L7","v":2008},{"$f":"+'Cost of Service'!M7","v":2009},{"$f":"+'Cost of Service'!N7","v":2010},{"$f":"+'Cost of Service'!O7","v":2011},{"$f":"+'Cost of Service'!P7","v":2012},{"$f":"+'Cost of Service'!Q7","v":2013},{"$f":"+'Cost of Service'!R7","v":2014},{"$f":"+'Cost of Service'!S7","v":2015},{"$f":"+'Cost of Service'!T7","v":2016},{"$f":"+'Cost of Service'!U7","v":2017},{"$f":"+'Cost of Service'!V7","v":2018}]
[1,{"$f":"+'Cost of Service'!B24","v":"Total Revenue Requirement (Including Net Carryover)"},null,null,null,{"$f":"+'Cost of Service'!$U$2&\" Ln \"&'Cost of Service'!A24","v":"Schedule 3 Ln 8"},null,{"$f":"+'Cost of Service'!H24","v":52354.570523783921},{"$f":"'Cost of Service'!I24","v":61229.348541337364},{"$f":"+'Cost of Service'!J24","v":74135.140275335914},{"$f":"+'Cost of Service'!K24","v":78996.279314264961},{"$f":"+'Cost of Service'!L24","v":72235.515758761641},{"$f":"+'Cost of Service'!M24","v":54939.486371449428},{"$f":"IF(N7<=Input!D4,'Cost of Service'!N24,0)","v":58858.392293937082},{"$f":"+'Cost of Service'!O24","v":68248.115981108102},{"$f":"+'Cost of Service'!P24","v":73725.157094602328},{"$f":"+'Cost of Service'!Q24","v":73960.688182105994},{"$f":"+'Cost of Service'!R24","v":63526.755914387955},{"$f":"+'Cost of Service'!S24","v":63623.790117865996},{"$f":"+'Cost of Service'!T24","v":74288.617481850437},{"$f":"+'Cost of Service'!U24","v":79250.609050813102},{"$f":"+'Cost of Service'!V24","v":68957.063342476235}]
{"$rows_left_out":9}
{"sheet":"Return on Rate Base","index":5,"n_rows":34,"n_cols":22,"rows_kept":34,"cut":false,"hidden":false,"merged":[]}
[{"$f":"Company_Name","v":"Olympic Pipe Line Company"},null,null,null,null,null,null,null,null,null,null,null,null,null,null,null,null,null,null,null,{"$f":"+'Cost of Service'!U1","v":"Exhibit No. 1.4(a)"}]
["Overall Return on Rate Base",null,null,null,null,null,null,null,null,null,null,null,null,null,null,null,null,null,null,null,{"$f":"Index!$B$14","v":"Schedule 5"}]
[{"$f":"units","v":"($000's)"}]
[]
[]
["Line"]
["No.","Description","Source",null,null,null,null,{"$f":"+'Cost of Service'!H7","v":2004},{"$f":"+'Cost of Service'!I7","v":2005},{"$f":"+'Cost of Service'!J7","v":2006},{"$f":"+'Cost of Service'!K7","v":2007},{"$f":"+'Cost of Service'!L7","v":2008},{"$f":"+'Cost of Service'!M7","v":2009},{"$f":"+'Cost of Service'!N7","v":2010},{"$f":"+'Cost of Service'!O7","v":2011},{"$f":"+'Cost of Service'!P7","v":2012},{"$f":"+'Cost of Service'!Q7","v":2013},{"$f":"+'Cost of Service'!R7","v":2014},{"$f":"+'Cost of Service'!S7","v":2015},{"$f":"+'Cost of Service'!T7","v":2016},{"$f":"+'Cost of Service'!U7","v":2017},{"$f":"+'Cost of Service'!V7","v":2018}]
[]
{"$rows_left_out":27}
{"sheet":"Income Tax Allowance","index":6,"n_rows":36,"n_cols":22,"rows_kept":36,"cut":false,"hidden":false,"merged":[]}
[{"$f":"Company_Name","v":"Olympic Pipe Line Company"},null,null,null,null,null,null,null,null,null,null,null,null,null,null,null,null,null,null,null,{"$f":"+'Return on Rate Base'!U1","v":"Exhibit No. 1.4(a)"}]
[{"$f":"Index!$C$15","v":"Income Tax Allowance"},null,null,null,null,null,null,null,null,null,null,null,null,null,null,null,null,null,null,null,{"$f":"Index!$B$15","v":"Schedule 6"}]
[{"$f":"units","v":"($000's)"}]
[]
[]
["Line"]
["No.","Description","Source",null,null,null,null,{"$f":"+'Return on Rate Base'!H7","v":2004},{"$f":"+'Return on Rate Base'!I7","v":2005},{"$f":"+'Return on Rate Base'!J7","v":2006},{"$f":"+'Return on Rate Base'!K7","v":2007},{"$f":"+'Return on Rate Base'!L7","v":2008},{"$f":"+'Return on Rate Base'!M7","v":2009},{"$f":"+'Return on Rate Base'!N7","v":2010},{"$f":"+'Return on Rate Base'!O7","v":2011},{"$f":"+'Return on Rate Base'!P7","v":2012},{"$f":"+'Return on Rate Base'!Q7","v":2013},{"$f":"+'Return on Rate Base'!R7","v":2014},{"$f":"+'Return on Rate Base'!S7","v":2015},{"$f":"+'Return on Rate Base'!T7","v":2016},{"$f":"+'Return on Rate Base'!U7","v":2017},{"$f":"+'Return on Rate Base'!V7","v":2018}]
[]
{"$rows_left_out":29}
{"sheet":"Rate Base","index":7,"n_rows":34,"n_cols":22,"rows_kept":34,"cut":false,"hidden":false,"merged":[]}
[{"$f":"Company_Name","v":"Olympic Pipe Line Company"},null,null,null,null,null,null,null,null,null,null,null,null,null,null,null,null,null,null,null,{"$f":"+'Income Tax Allowance'!U1","v":"Exhibit No. 1.4(a)"}]
[{"$f":"Index!$C$16","v":"Rate Base"},null,null,null,null,null,null,null,null,null,null,null,null,null,null,null,null,null,null,null,{"$f":"Index!$B$16","v":"Schedule 7"}]
[{"$f":"units","v":"($000's)"}]
[]
[]
["Line"]
["No.","Description","Source",null,null,null,{"$f":"+Input!E7","v":"2003 EOY"},{"$f":"+Input!F7","v":2004},{"$f":"+Input!G7","v":2005},{"$f":"+Input!H7","v":2006},{"$f":"+Input!I7","v":2007},{"$f":"+Input!J7","v":2008},{"$f":"+Input!K7","v":2009},{"$f":"+Input!L7","v":2010},{"$f":"+Input!M7","v":2011},{"$f":"+Input!N7","v":2012},{"$f":"+Input!O7","v":2013},{"$f":"+Input!P7","v":2014},{"$f":"+Input!Q7","v":2015},{"$f":"+Input!R7","v":2016},{"$f":"+Input!S7","v":2017},{"$f":"+Input!T7","v":2018}]
[null,null,null,null,null,null,null,null,null,null,null,null," 3/"]
{"$rows_left_out":27}
{"sheet":"AFUDC - Calculation","index":8,"n_rows":50,"n_cols":22,"rows_kept":50,"cut":false,"hidden":false,"merged":[]}
[{"$f":"Company_Name","v":"Olympic Pipe Line Company"},null,null,null,null,null,null,null,null,null,null,null,null,null,null,null,null,null,null,null,{"$f":"+'Cost of Service'!U1","v":"Exhibit No. 1.4(a)"}]
[{"$f":"Index!$C$17","v":"AFUDC - Calculation"},null,null,null,null,null,null,null,null,null,null,null,null,null,null,null,null,null,null,null,{"$f":"Index!$B$17","v":"Schedule 8"}]
[{"$f":"units","v":"($000's)"}]
[]
[]
["Line"]
["No.","Description","Source",null,null,null,null,{"$f":"+'Rate Base'!H7","v":2004},{"$f":"+'Rate Base'!I7","v":2005},{"$f":"+'Rate Base'!J7","v":2006},{"$f":"+'Rate Base'!K7","v":2007},{"$f":"+'Rate Base'!L7","v":2008},{"$f":"+'Rate Base'!M7","v":2009},{"$f":"+'Rate Base'!N7","v":2010},{"$f":"+'Rate Base'!O7","v":2011},{"$f":"+'Rate Base'!P7","v":2012},{"$f":"+'Rate Base'!Q7","v":2013},{"$f":"+'Rate Base'!R7","v":2014},{"$f":"+'Rate Base'!S7","v":2015},{"$f":"+'Rate Base'!T7","v":2016},{"$f":"+'Rate Base'!U7","v":2017},{"$f":"+'Rate Base'!V7","v":2018}]
[]
{"$rows_left_out":43}
{"sheet":"AFUDC - Amortization","index":9,"n_rows":36,"n_cols":23,"rows_kept":36,"cut":false,"hidden":false,"merged":[]}
[{"$f":"Company_Name","v":"Olympic Pipe Line Company"},null,null,null,null,null,null,null,null,null,null,null,null,null,null,null,null,null,null,null,null,{"$f":"+'AFUDC - Calculation'!U1","v":"Exhibit No. 1.4(a)"}]
[{"$f":"Index!$C$18","v":"AFUDC - Amortization"},null,null,null,null,null,null,null,null,null,null,null,null,null,null,null,null,null,null,null,null,{"$f":"Index!$B$18","v":"Schedule 9"}]
[{"$f":"units","v":"($000's)"}]
[]
[]
["Line"]
["No.","Description","Source",null,null,null,null,{"$f":"+Input!E7","v":"2003 EOY"},{"$f":"+Input!F7","v":2004},{"$f":"+Input!G7","v":2005},{"$f":"+Input!H7","v":2006},{"$f":"+Input!I7","v":2007},{"$f":"+Input!J7","v":2008},{"$f":"+Input!K7","v":2009},{"$f":"+Input!L7","v":2010},{"$f":"+Input!M7","v":2011},{"$f":"+Input!N7","v":2012},{"$f":"+Input!O7","v":2013},{"$f":"+Input!P7","v":2014},{"$f":"+Input!Q7","v":2015},{"$f":"+Input!R7","v":2016},{"$f":"+Input!S7","v":2017},{"$f":"+Input!T7","v":2018}]
[]
{"$rows_left_out":29}
{"sheet":"Amortization Rate","index":10,"n_rows":25,"n_cols":22,"rows_kept":25,"cut":false,"hidden":false,"merged":[]}
[{"$f":"Company_Name","v":"Olympic Pipe Line Company"},null,null,null,null,null,null,null,null,null,null,null,null,null,null,null,null,null,null,null,{"$f":"+'AFUDC - Amortization'!V1","v":"Exhibit No. 1.4(a)"}]
[{"$f":"Index!$C$19","v":"Amortization Rate"},null,null,null,null,null,null,null,null,null,null,null,null,null,null,null,null,null,null,null,{"$f":"Index!$B$19","v":"Schedule 10"}]
[{"$f":"units","v":"($000's)"}]
[]
[]
["Line"]
["No.","Description","Source",null,null,null,{"$f":"+Input!E7","v":"2003 EOY"},{"$f":"+Input!F7","v":2004},{"$f":"+Input!G7","v":2005},{"$f":"+Input!H7","v":2006},{"$f":"+Input!I7","v":2007},{"$f":"+Input!J7","v":2008},{"$f":"+Input!K7","v":2009},{"$f":"+Input!L7","v":2010},{"$f":"+Input!M7","v":2011},{"$f":"+Input!N7","v":2012},{"$f":"+Input!O7","v":2013},{"$f":"+Input!P7","v":2014},{"$f":"+Input!Q7","v":2015},{"$f":"+Input!R7","v":2016},{"$f":"+Input!S7","v":2017},{"$f":"+Input!T7","v":2018}]
[]
{"$rows_left_out":18}
{"sheet":"Tax Depreciation","index":11,"n_rows":62,"n_cols":22,"rows_kept":62,"cut":false,"hidden":false,"merged":[]}
[{"$f":"Company_Name","v":"Olympic Pipe Line Company"},null,null,null,null,null,null,null,null,null,null,null,null,null,null,null,null,null,null,null,null,{"$f":"+'Amortization Rate'!U1","v":"Exhibit No. 1.4(a)"}]
[{"$f":"Index!C20","v":"Tax Depreciation"},null,null,null,null,null,null,null,null,null,null,null,null,null,null,null,null,null,null,null,null,{"$f":"Index!B20","v":"Schedule 11"}]
[{"$f":"units","v":"($000's)"}]
[]
[]
["Line"]
["No.","Description",null,null,null,null,{"$f":"+Input!E7","v":"2003 EOY"},{"$f":"+Input!F7","v":2004},{"$f":"+Input!G7","v":2005},{"$f":"+Input!H7","v":2006},{"$f":"+Input!I7","v":2007},{"$f":"+Input!J7","v":2008},{"$f":"+Input!K7","v":2009},{"$f":"+Input!L7","v":2010},{"$f":"+Input!M7","v":2011},{"$f":"+Input!N7","v":2012},{"$f":"+Input!O7","v":2013},{"$f":"+Input!P7","v":2014},{"$f":"+Input!Q7","v":2015},{"$f":"+Input!R7","v":2016},{"$f":"+Input!S7","v":2017},{"$f":"+Input!T7","v":2018}]
[]
{"$rows_left_out":55}
{"sheet":"ADIT","index":12,"n_rows":36,"n_cols":22,"rows_kept":36,"cut":false,"hidden":false,"merged":[]}
[{"$f":"Company_Name","v":"Olympic Pipe Line Company"},null,null,null,null,null,null,null,null,null,null,null,null,null,null,null,null,null,null,null,{"$f":"+'Tax Depreciation'!V1","v":"Exhibit No. 1.4(a)"}]
[{"$f":"Index!C21","v":"Accumulated Deferred Income Taxes"},null,null,null,null,null,null,null,null,null,null,null,null,null,null,null,null,null,null,null,{"$f":"Index!$B$21","v":"Schedule 12"}]
[{"$f":"units","v":"($000's)"}]
[]
[]
["Line"]
["No.","Description","Source",null,null,null,{"$f":"+'Tax Depreciation'!G7","v":"2003 EOY"},{"$f":"+'Tax Depreciation'!H7","v":2004},{"$f":"+'Tax Depreciation'!I7","v":2005},{"$f":"+'Tax Depreciation'!J7","v":2006},{"$f":"+'Tax Depreciation'!K7","v":2007},{"$f":"+'Tax Depreciation'!L7","v":2008},{"$f":"+'Tax Depreciation'!M7","v":2009},{"$f":"+'Tax Depreciation'!N7","v":2010},{"$f":"+'Tax Depreciation'!O7","v":2011},{"$f":"+'Tax Depreciation'!P7","v":2012},{"$f":"+'Tax Depreciation'!Q7","v":2013},{"$f":"+'Tax Depreciation'!R7","v":2014},{"$f":"+'Tax Depreciation'!S7","v":2015},{"$f":"+'Tax Depreciation'!T7","v":2016},{"$f":"+'Tax Depreciation'!U7","v":2017},{"$f":"+'Tax Depreciation'!V7","v":2018}]
[]
{"$rows_left_out":29}
{"sheet":"TEFRA","index":13,"n_rows":27,"n_cols":22,"rows_kept":27,"cut":false,"hidden":false,"merged":[]}
[{"$f":"Company_Name","v":"Olympic Pipe Line Company"},null,null,null,null,null,null,null,null,null,null,null,null,null,null,null,null,null,null,null,{"$f":"+ADIT!U1","v":"Exhibit No. 1.4(a)"}]
[{"$f":"Index!C22","v":"TEFRA Adjustment to ADIT"},null,null,null,null,null,null,null,null,null,null,null,null,null,null,null,null,null,null,null,{"$f":"Index!$B$22","v":"Schedule 13"}]
[{"$f":"units","v":"($000's)"}]
[]
[]
["Line"]
["No.","Description","Source",null,null,null,{"$f":"+ADIT!G7","v":"2003 EOY"},{"$f":"+ADIT!H7","v":2004},{"$f":"+ADIT!I7","v":2005},{"$f":"+ADIT!J7","v":2006},{"$f":"+ADIT!K7","v":2007},{"$f":"+ADIT!L7","v":2008},{"$f":"+ADIT!M7","v":2009},{"$f":"+ADIT!N7","v":2010},{"$f":"+ADIT!O7","v":2011},{"$f":"+ADIT!P7","v":2012},{"$f":"+ADIT!Q7","v":2013},{"$f":"+ADIT!R7","v":2014},{"$f":"+ADIT!S7","v":2015},{"$f":"+ADIT!T7","v":2016},{"$f":"+ADIT!U7","v":2017},{"$f":"+ADIT!V7","v":2018}]
[]
{"$rows_left_out":20}
{"sheet":"FASB-Excess","index":14,"n_rows":61,"n_cols":22,"rows_kept":61,"cut":false,"hidden":false,"merged":[]}
[{"$f":"Company_Name","v":"Olympic Pipe Line Company"},null,null,null,null,null,null,null,null,null,null,null,null,null,null,null,null,null,null,null,{"$f":"+TEFRA!U1","v":"Exhibit No. 1.4(a)"}]
[{"$f":"Index!$C$23","v":"Excess Deferred Income Tax Amortization Adjustment to ADIT"},null,null,null,null,null,null,null,null,null,null,null,null,null,null,null,null,null,null,null,{"$f":"Index!$B$23","v":"Schedule 14"}]
[{"$f":"units","v":"($000's)"}]
[]
[]
["Line"]
["No.","Description",null,"Source",null,null,{"$f":"+TEFRA!G7","v":"2003 EOY"},{"$f":"+TEFRA!H7","v":2004},{"$f":"+TEFRA!I7","v":2005},{"$f":"+TEFRA!J7","v":2006},{"$f":"+TEFRA!K7","v":2007},{"$f":"+TEFRA!L7","v":2008},{"$f":"+TEFRA!M7","v":2009},{"$f":"+TEFRA!N7","v":2010},{"$f":"+TEFRA!O7","v":2011},{"$f":"+TEFRA!P7","v":2012},{"$f":"+TEFRA!Q7","v":2013},{"$f":"+TEFRA!R7","v":2014},{"$f":"+TEFRA!S7","v":2015},{"$f":"+TEFRA!T7","v":2016},{"$f":"+TEFRA!U7","v":2017},{"$f":"+TEFRA!V7","v":2018}]
[]
{"$rows_left_out":54}
{"sheet":"Rates","index":15,"n_rows":172,"n_cols":24,"rows_kept":172,"cut":false,"hidden":false,"merged":[]}
[{"$f":"+'FASB-Excess'!A1","v":"Olympic Pipe Line Company"},null,null,null,null,null,null,null,null,null,null,null,null,null,null,null,null,null,null,null,{"$f":"+Input!S1","v":"Exhibit No. 1.4(a)"}]
[{"$f":"+Index!C24","v":"Calculation of Tariff Rates"},null,null,null,null,null,null,null,null,null,null,null,null,null,null,null,null,null,null,null,{"$f":"+Index!B24","v":"Schedule 15"}]
[]
[]
[null,null,null,null,null,null,null,null,null,null,null,null,null,null,null,null,null,null,null,null,"Page 1 of 2"]
["Line"]
["No.","Description",null,null,"Source",null,null,{"$f":"+'FASB-Excess'!H7","v":2004},{"$f":"+'FASB-Excess'!I7","v":2005},{"$f":"+'FASB-Excess'!J7","v":2006},{"$f":"+'FASB-Excess'!K7","v":2007},{"$f":"+'FASB-Excess'!L7","v":2008},{"$f":"+'FASB-Excess'!M7","v":2009},{"$f":"+'FASB-Excess'!N7","v":2010},{"$f":"+'FASB-Excess'!O7","v":2011},{"$f":"+'FASB-Excess'!P7","v":2012},{"$f":"+'FASB-Excess'!Q7","v":2013},{"$f":"+'FASB-Excess'!R7","v":2014},{"$f":"+'FASB-Excess'!S7","v":2015},{"$f":"+'FASB-Excess'!T7","v":2016},{"$f":"+'FASB-Excess'!U7","v":2017},{"$f":"+'FASB-Excess'!V7","v":2018}]
[]
{"$rows_left_out":165}
{"sheet":"Tput Adjuster","index":16,"n_rows":366,"n_cols":22,"rows_kept":366,"cut":false,"hidden":false,"merged":[]}
[{"$f":"+Rates!A1","v":"Olympic Pipe Line Company"},null,null,null,null,null,null,null,null,null,null,null,null,null,null,null,null,null,null,null,{"$f":"+Rates!U1","v":"Exhibit No. 1.4(a)"}]
[{"$f":"+Index!C25","v":"Throughput Adjuster - Tariff Rates"},null,null,null,null,null,null,null,null,null,null,null,null,null,null,null,null,null,null,null,{"$f":"+Index!B25","v":"Schedule 16"}]
[]
[]
[]
[null,null,null,null,null,null,null,null,null,null,null,null,null,null,null,null,null,null,null,null,"Page 1 of 5"]
["Line"]
["No","Description",null,null,null,"Source",null,{"$f":"+Rates!H7","v":2004},{"$f":"+Rates!I7","v":2005},{"$f":"+Rates!J7","v":2006},{"$f":"+Rates!K7","v":2007},{"$f":"+Rates!L7","v":2008},{"$f":"+Rates!M7","v":2009},{"$f":"+Rates!N7","v":2010},{"$f":"+Rates!O7","v":2011},{"$f":"+Rates!P7","v":2012},{"$f":"+Rates!Q7","v":2013},{"$f":"+Rates!R7","v":2014},{"$f":"+Rates!S7","v":2015},{"$f":"+Rates!T7","v":2016},{"$f":"+Rates!U7","v":2017},{"$f":"+Rates!V7","v":2018}]
{"$rows_left_out":359}
{"sheet":"Index - Data","index":17,"n_rows":16,"n_cols":3,"rows_kept":16,"cut":false,"hidden":false,"merged":[]}
[]
[]
[]
[null,"Olympic Pipe Line Company"]
[null,"Workpapers"]
[null,"Index"]
[]
[null,"Workpapers","Workpaper Descriptions"]
{"$rows_left_out":9}
{"sheet":"Annual Data","index":18,"n_rows":39,"n_cols":19,"rows_kept":39,"cut":false,"hidden":false,"merged":[]}
[{"$f":"'Index - Data'!Company_Name","v":"Olympic Pipe Line Company"},null,null,null,null,null,null,null,null,null,null,null,null,null,null,null,null,{"$f":"'Index - Data'!$B$10","v":"Workpaper 1"}]
[{"$f":"'Index - Data'!C10","v":"Summary of Carrier Property Activity, Depreciation Expense and Working Capital - 2017"}]
["$ 000's"]
[]
[null,"Data Item",null,"Source","Year 2004","Year 2005","Year 2006","Year 2007","Year 2008","Year 2009","Year 2010","Year 2011","Year 2012","Year 2013","Year 2014","Year 2015","Year 2016","Year 2017","Year 2018"]
[]
[]
[]
{"$rows_left_out":32}
{"sheet":"Monthly CWIP","index":19,"n_rows":22,"n_cols":19,"rows_kept":22,"cut":false,"hidden":false,"merged":[]}
[{"$f":"'Index - Data'!Company_Name","v":"Olympic Pipe Line Company"},null,null,null,null,null,null,null,null,null,null,null,null,null,null,null,null,{"$f":"'Index - Data'!B11","v":"Workpaper 2"}]
[{"$f":"'Index - Data'!C11","v":"Summary of Monthly CWIP - 2017"}]
["$ 000's"]
["No.","Description","Source",null,2004,2005,2006,2007,2008,2009,2010,2011,2012,2013,2014,2015,2016,2017,2018]
[]
[null,"Monthly Inputs"]
[]
[]
{"$rows_left_out":15}
{"sheet":"Tariff Year Data","index":20,"n_rows":68,"n_cols":6,"rows_kept":68,"cut":false,"hidden":false,"merged":[]}
[{"$f":"'Monthly CWIP'!A1","v":"Olympic Pipe Line Company"},null,null,null,null,{"$f":"'Index - Data'!B12","v":"Workpaper 3"}]
[{"$f":"'Index - Data'!C12","v":"Summary of Tariff Year Data: Operating Expenses, Revenues, and Project Expenses - 2017"}]
["$ 000's"]
[]
[null,null,null,null,null,"Page 1 of 2"]
[]
[null,"Data Item",null,"Source",null,2017]
[]
{"$rows_left_out":61}
{"sheet":"TransitionCosts","index":21,"n_rows":12,"n_cols":21,"rows_kept":12,"cut":false,"hidden":false,"merged":[]}
[{"$f":"'Monthly CWIP'!A1","v":"Olympic Pipe Line Company"},null,null,null,null,null,null,null,null,null,null,null,null,null,null,null,null,null,null,{"$f":"'Index - Data'!B13","v":"Workpaper 4"}]
["Transition Costs"]
["$ 000's"]
[]
[null,"Data Item",null,"Source",null,2003,2004,2005,2006,2007,2008,2009,2010,2011,2012,2013,2014,2015,2016,2017,2018]
[]
[]
[]
{"$rows_left_out":5}
{"sheet":"2017 opex","index":22,"n_rows":37,"n_cols":26,"rows_kept":37,"cut":false,"hidden":false,"merged":[]}
[]
[null,{"$f":"TransitionCosts!A1","v":"Olympic Pipe Line Company"},null,null,null,null,null,null,null,null,null,null,null,null,null,null,null,null,null,null,null,null,null,null,null,{"$f":"'Index - Data'!B14","v":"Workpaper 5"}]
[null,{"$f":"'Index - Data'!C14","v":"Operating Expenses - 2017"},null,null,null,null,null,null,null,null,null,null,null,null,null,null,null,null,null,null,null,null,null,null,null,"Page 1 of 1"]
[null," Excluding Project Expenses, Transition Costs, Bankruptcy Costs and Whatcom Creek"]
[]
[]
[null,"Operating Expenses by FERC Account",null,610]
[null," Excluding Transition Costs, Bankruptcy Costs and Whatcom Creek"]
{"$rows_left_out":30}
{"sheet":"2017 project exp","index":23,"n_rows":35,"n_cols":21,"rows_kept":35,"cut":false,"hidden":false,"merged":[]}
[]
[null,null,{"$f":"'2017 opex'!B2","v":"Olympic Pipe Line Company"},null,null,null,null,null,null,null,null,null,null,null,null,null,null,null,null,null,{"$f":"'Index - Data'!B15","v":"Workpaper 6"}]
[null,null,{"$f":"'Index - Data'!C15","v":"Project Expenses - 2017"},null,null,null,null,null,null,null,null,null,null,null,null,null,null,null,null,null,"Page 1 of 1"]
[null,null,"Excluding Transition Costs, Bankruptcy Costs and Whatcom Creek"]
[]
[]
[]
[null,null,"Project Expenses by FERC Account 610"]
{"$rows_left_out":28}
{"sheet":"Revenue","index":24,"n_rows":19,"n_cols":17,"rows_kept":19,"cut":false,"hidden":false,"merged":[]}
[{"$f":"'2017 project exp'!C2","v":"Olympic Pipe Line Company"},null,null,null,null,null,null,null,null,null,null,null,null,null,null,{"$f":"'Index - Data'!B16","v":"Workpaper 7"}]
[{"$f":"'Index - Data'!C16","v":"Revenues "}]
[]
[]
[]
[null,"Data Item",null,"FERC Account",null,2007,2008,2009,2010,2011,2012,2013,2014,2015,2016,2017,2018]
[]
[]
{"$rows_left_out":11}