{"text_format":"1","workbook":"xlsx","n_sheets":12,"sheets":["Pres & Prop Rev","Page 1, Exh1","Page 2, Exh2","Page 3-5, Crossover","Rate Design","ROR","BFG","Exh3","Bill Determ","Big Schedules","Rev Runs CY","Rev Run LY"],"not_rendered":{"charts":0,"images":0,"macros":1,"external_links":5,"defined_names":34,"comments":7,"pivot_tables":0},"unopened":[],"bounds":{"document_bytes":16777216,"sheet_cells":100000,"rows_first":2000,"rows_last":500,"rows_between":2000,"halvings":0,"cell_chars":16384,"cell_head_chars":4096},"cells_cut":0,"cells_raw":0,"read":"whole","date_system":"1900"}

{"sheet":"Pres & Prop Rev","index":0,"n_rows":257,"n_cols":17,"rows_kept":257,"cut":false,"hidden":true,"merged":[[5,16,10,18]]}
[]
[]
[null,null,null,null,null,null,null,null,null,"ANN. MINIMUM"]
["WORK PAPER",null," ","GEN SERVICE","LRG GEN SVC","EX LRG GEN SVC","INTERRUPTIBLE","TRANSPORT","TRANSPORT","TRANSPORT"]
["REFERENCE",null,"TOTAL","SCHEDULE 101","SCH. 111&112","SCH. 121&122","SCH. 131&132","SCHEDULE 146","SCHEDULE 148","SCH 148 - WSU",null,null,null,null,null,null,"Print Header for all printed pages on this worksheet:"]
[null,"PRESENT BILL DETERMINANTS",null,null,null,null,null,null,null,null,null,null,"Calculate all revenue exhibits using  ____ rates:",null,null,null,{"$f":"\"AVISTA UTILITIES\nWASHINGTON GAS\nPRO FORMA REVENUE UNDER PRESENT AND PROPOSED \"&O9&\" RATES\n12 MONTHS ENDED DECEMBER 31, 2011\"","v":"AVISTA UTILITIES\nWASHINGTON GAS\nPRO FORMA REVENUE UNDER PRESENT AND PROPOSED BASE TARIFF RATES\n12 MONTHS ENDED DECEMBER 31, 2011"}]
[null,"THERMS",null,null,null,null,null,null,null,null,null,"1)","BASE TARIFF"]
["PDE-G-7","BLOCK 1",null,{"$f":"'Bill Determ'!B7","v":123192356},{"$f":"'Bill Determ'!B17","v":5231053},{"$f":"'Bill Determ'!B26","v":156000},{"$f":"'Bill Determ'!B30","v":120000},{"$f":"'Bill Determ'!B34","v":7725697.2696134569},{"$f":"'Bill Determ'!B40","v":20176537},{"$f":"'Bill Determ'!B46","v":9679278},null,null,"or",null,1]
["PDE-G-7","BLOCK 2",null,null,{"$f":"'Bill Determ'!C17","v":14581420},{"$f":"'Bill Determ'!C26","v":156000},{"$f":"'Bill Determ'!C30","v":175338},{"$f":"'Bill Determ'!C34","v":7336427.7303829659},{"$f":"'Bill Determ'!B41","v":7301077},null,null,"2)","BILLING",null,{"$f":"CHOOSE(Base1_Billing2,M7,M9)","v":"BASE TARIFF"}]
["PDE-G-7","BLOCK 3",null,null,{"$f":"'Bill Determ'!D17","v":27796563},{"$f":"'Bill Determ'!D26","v":2638873},{"$f":"'Bill Determ'!D30","v":211422},{"$f":"'Bill Determ'!D34","v":11915987},{"$f":"'Bill Determ'!B42","v":1613790},null,null,null,null,null,{"$f":"CHOOSE(Base1_Billing2,\"Base\",\"Billing\")","v":"Base"}]
{"$rows_left_out":248}
{"sheet":"Page 1, Exh1","index":1,"n_rows":35,"n_cols":14,"rows_kept":35,"cut":false,"hidden":false,"merged":[[0,13,2,14],[8,13,10,14]]}
["AVISTA UTILITIES"]
["WASHINGTON NATURAL GAS"]
["PROPOSED INCREASE BY SERVICE SCHEDULE"]
["12 MONTHS ENDED DECEMBER 31, 2011"]
["(000s of Dollars)"]
[]
[]
[null,null,null,"Base Tariff",null,"Base Tariff","Base","Total Billed",null,null,"Percent "]
[null,null,null,"Revenue","Proposed","Revenue","Tariff","Revenue","Sch. 191","Proposed","Increase",null,null,"This worksheet pulls data from 'Pres & Prop Rev' tab."]
["Line","Type of","Schedule","Under Present","General","Under Proposed","Percent","at Present","LIRAP/DSM","General","on Billed"]
{"$rows_left_out":26}
{"sheet":"Page 2, Exh2","index":2,"n_rows":60,"n_cols":21,"rows_kept":60,"cut":false,"hidden":false,"merged":[[8,0,8,2]]}
["AVISTA UTILITIES"]
["WASHINGTON NATURAL GAS",null,null,null,null,null,null,null,null,null,null,null,null,null,"This worksheet uses Base & Billing rates from 'Rate Design' tab."]
["PRESENT AND PROPOSED RATE COMPONENTS BY SCHEDULE"]
[]
[]
[]
[null,null,null,null,"Sch. 150","Base Rate","Present",null,null,"General ","Sch. 191","Proposed ","Proposed "]
[null,null,null,"Base","PGA","including","Billing","Present ",null,"Rate ","LIRAP/DSM","Billing ","Base"]
["Type of Service",null,null,"Rate","Rate Adj","Schedule 150","Rate Adj.","Billing Rate (2)",null,"Increase","Increase","Rate(2)","Rate(1)"]
[null,"(a)",null,"(b)","(c)","(d)","(e)","(f)",null,"(g)","(f)","(h)","(i)"]
{"$rows_left_out":51}
{"sheet":"Page 3-5, Crossover","index":3,"n_rows":134,"n_cols":24,"rows_kept":134,"cut":false,"hidden":false,"merged":[[129,12,129,13],[130,12,130,13],[131,12,131,13],[132,12,132,13],[133,12,133,13],[2,11,2,13],[120,12,120,13],[121,12,121,13],[122,12,122,13],[123,12,123,13],[124,12,124,13],[125,12,125,13],[126,12,126,13],[127,12,127,13],[128,12,128,13],[111,12,111,13],[112,12,112,13],[113,12,113,13],[114,12,114,13],[115,12,115,13],[116,12,116,13],[117,12,117,13],[118,12,118,13],[119,12,119,13],[102,12,102,13],[103,12,103,13],[104,12,104,13],[105,12,105,13],[106,12,106,13],[107,12,107,13],[108,12,108,13],[109,12,109,13],[110,12,110,13],[93,12,93,13],[94,12,94,13],[95,12,95,13],[96,12,96,13],[97,12,97,13],[98,12,98,13],[99,12,99,13],[100,12,100,13],[101,12,101,13],[84,12,84,13],[85,12,85,13],[86,12,86,13],[87,12,87,13],[88,12,88,13],[89,12,89,13],[90,12,90,13],[91,12,91,13],[92,12,92,13],[75,12,75,13],[76,12,76,13],[77,12,77,13],[78,12,78,13],[79,12,79,13],[80,12,80,13],[81,12,81,13],[82,12,82,13],[83,12,83,13],[66,12,66,13],[67,12,67,13],[68,12,68,13],[69,12,69,13],[70,12,70,13],[71,12,71,13],[72,12,72,13],[73,12,73,13],[74,12,74,13],[57,12,57,13],[58,12,58,13],[59,12,59,13],[60,12,60,13],[61,12,61,13],[62,12,62,13],[63,12,63,13],[64,12,64,13],[65,12,65,13],[48,12,48,13],[49,12,49,13],[50,12,50,13],[51,12,51,13],[52,12,52,13],[53,12,53,13],[54,12,54,13],[55,12,55,13],[56,12,56,13],[39,12,39,13],[40,12,40,13],[41,12,41,13],[42,12,42,13],[43,12,43,13],[44,12,44,13],[45,12,45,13],[46,12,46,13],[47,12,47,13],[30,12,30,13],[31,12,31,13],[32,12,32,13],[33,12,33,13],[34,12,34,13],[35,12,35,13],[36,12,36,13],[37,12,37,13],[38,12,38,13],[21,12,21,13],[22,12,22,13],[23,12,23,13],[24,12,24,13],[25,12,25,13],[26,12,26,13],[27,12,27,13],[28,12,28,13],[29,12,29,13],[16,12,16,13],[17,12,17,13],[18,12,18,13],[19,12,19,13],[20,12,20,13],[4,2,4,4],[4,5,4,7],[4,8,4,10],[5,2,5,4],[5,5,5,7],[5,8,5,10],[9,2,9,4],[9,5,9,7],[9,8,9,10],[12,2,12,4],[12,5,12,7],[12,8,12,10],[13,2,13,4],[13,5,13,7],[13,8,13,10],[10,2,10,4],[10,5,10,7],[10,8,10,10],[11,2,11,4],[0,3,0,4],[0,6,0,7],[0,9,0,10],[1,1,1,10],[2,1,2,10],[3,2,3,4],[3,5,3,7],[3,8,3,10],[8,2,8,4],[8,5,8,7],[8,8,8,10],[6,2,6,4],[6,5,6,7],[6,8,6,10],[7,2,7,4],[7,5,7,7],[7,8,7,10],[11,5,11,7],[11,8,11,10],[17,3,17,4],[17,6,17,7],[17,9,17,10],[18,3,18,4],[18,6,18,7],[18,9,18,10],[14,1,14,10],[15,3,15,4],[15,6,15,7],[15,9,15,10],[16,3,16,4],[16,6,16,7],[16,9,16,10],[21,3,21,4],[21,6,21,7],[21,9,21,10],[22,3,22,4],[22,6,22,7],[22,9,22,10],[19,3,19,4],[19,6,19,7],[19,9,19,10],[20,3,20,4],[20,6,20,7],[20,9,20,10],[25,3,25,4],[25,6,25,7],[25,9,25,10],[26,3,26,4],[26,6,26,7],[26,9,26,10],[23,3,23,4],[23,6,23,7],[23,9,23,10],[24,3,24,4],[24,6,24,7],[24,9,24,10],[29,3,29,4],[29,6,29,7],[29,9,29,10],[30,3,30,4],[30,6,30,7],[30,9,30,10],[27,3,27,4],[27,6,27,7],[27,9,27,10],[28,3,28,4],[28,6,28,7],[28,9,28,10],[33,3,33,4],[33,6,33,7],[33,9,33,10],[34,3,34,4],[34,6,34,7],[34,9,34,10],[31,3,31,4],[31,6,31,7],[31,9,31,10],[32,3,32,4],[32,6,32,7],[32,9,32,10],[37,3,37,4],[37,6,37,7],[37,9,37,10],[38,3,38,4],[38,6,38,7],[38,9,38,10],[35,3,35,4],[35,6,35,7],[35,9,35,10],[36,3,36,4],[36,6,36,7],[36,9,36,10],[41,3,41,4],[41,6,41,7],[41,9,41,10],[42,3,42,4],[42,6,42,7],[42,9,42,10],[39,3,39,4],[39,6,39,7],[39,9,39,10],[40,3,40,4],[40,6,40,7],[40,9,40,10],[45,3,45,4],[45,6,45,7],[45,9,45,10],[46,3,46,4],[46,6,46,7],[46,9,46,10],[43,3,43,4],[43,6,43,7],[43,9,43,10],[44,3,44,4],[44,6,44,7],[44,9,44,10],[49,3,49,4],[49,6,49,7],[49,9,49,10],[50,3,50,4],[50,6,50,7],[50,9,50,10],[47,3,47,4],[47,6,47,7],[47,9,47,10],[48,3,48,4],[48,6,48,7],[48,9,48,10],[53,3,53,4],[53,6,53,7],[53,9,53,10],[54,3,54,4],[54,6,54,7],[54,9,54,10],[51,3,51,4],[51,6,51,7],[51,9,51,10],[52,3,52,4],[52,6,52,7],[52,9,52,10],[57,3,57,4],[57,6,57,7],[57,9,57,10],[58,3,58,4],[58,6,58,7],[58,9,58,10],[55,3,55,4],[55,6,55,7],[55,9,55,10],[56,3,56,4],[56,6,56,7],[56,9,56,10],[61,3,61,4],[61,6,61,7],[61,9,61,10],[62,3,62,4],[62,6,62,7],[62,9,62,10],[59,3,59,4],[59,6,59,7],[59,9,59,10],[60,3,60,4],[60,6,60,7],[60,9,60,10],[65,3,65,4],[65,6,65,7],[65,9,65,10],[66,3,66,4],[66,6,66,7],[66,9,66,10],[63,3,63,4],[63,6,63,7],[63,9,63,10],[64,3,64,4],[64,6,64,7],[64,9,64,10],[69,3,69,4],[69,6,69,7],[69,9,69,10],[70,3,70,4],[70,6,70,7],[70,9,70,10],[67,3,67,4],[67,6,67,7],[67,9,67,10],[68,3,68,4],[68,6,68,7],[68,9,68,10],[73,3,73,4],[73,6,73,7],[73,9,73,10],[74,3,74,4],[74,6,74,7],[74,9,74,10],[71,3,71,4],[71,6,71,7],[71,9,71,10],[72,3,72,4],[72,6,72,7],[72,9,72,10],[77,3,77,4],[77,6,77,7],[77,9,77,10],[78,3,78,4],[78,6,78,7],[78,9,78,10],[75,3,75,4],[75,6,75,7],[75,9,75,10],[76,3,76,4],[76,6,76,7],[76,9,76,10],[81,3,81,4],[81,6,81,7],[81,9,81,10],[82,3,82,4],[82,6,82,7],[82,9,82,10],[79,3,79,4],[79,6,79,7],[79,9,79,10],[80,3,80,4],[80,6,80,7],[80,9,80,10],[85,3,85,4],[85,6,85,7],[85,9,85,10],[86,3,86,4],[86,6,86,7],[86,9,86,10],[83,3,83,4],[83,6,83,7],[83,9,83,10],[84,3,84,4],[84,6,84,7],[84,9,84,10],[89,3,89,4],[89,6,89,7],[89,9,89,10],[90,3,90,4],[90,6,90,7],[90,9,90,10],[87,3,87,4],[87,6,87,7],[87,9,87,10],[88,3,88,4],[88,6,88,7],[88,9,88,10],[93,3,93,4],[93,6,93,7],[93,9,93,10],[94,3,94,4],[94,6,94,7],[94,9,94,10],[91,3,91,4],[91,6,91,7],[91,9,91,10],[92,3,92,4],[92,6,92,7],[92,9,92,10],[97,3,97,4],[97,6,97,7],[97,9,97,10],[98,3,98,4],[98,6,98,7],[98,9,98,10],[95,3,95,4],[95,6,95,7],[95,9,95,10],[96,3,96,4],[96,6,96,7],[96,9,96,10],[101,3,101,4],[101,6,101,7],[101,9,101,10],[102,3,102,4],[102,6,102,7],[102,9,102,10],[99,3,99,4],[99,6,99,7],[99,9,99,10],[100,3,100,4],[100,6,100,7],[100,9,100,10],[105,3,105,4],[105,6,105,7],[105,9,105,10],[106,3,106,4],[106,6,106,7],[106,9,106,10],[103,3,103,4],[103,6,103,7],[103,9,103,10],[104,3,104,4],[104,6,104,7],[104,9,104,10],[109,3,109,4],[109,6,109,7],[109,9,109,10],[110,3,110,4],[110,6,110,7],[110,9,110,10],[107,3,107,4],[107,6,107,7],[107,9,107,10],[108,3,108,4],[108,6,108,7],[108,9,108,10],[113,3,113,4],[113,6,113,7],[113,9,113,10],[114,3,114,4],[114,6,114,7],[114,9,114,10],[111,3,111,4],[111,6,111,7],[111,9,111,10],[112,3,112,4],[112,6,112,7],[112,9,112,10],[117,3,117,4],[117,6,117,7],[117,9,117,10],[118,3,118,4],[118,6,118,7],[118,9,118,10],[115,3,115,4],[115,6,115,7],[115,9,115,10],[116,3,116,4],[116,6,116,7],[116,9,116,10],[121,9,121,10],[122,3,122,4],[122,6,122,7],[122,9,122,10],[119,3,119,4],[119,6,119,7],[119,9,119,10],[120,3,120,4],[120,6,120,7],[120,9,120,10],[0,12,0,13],[3,11,3,13],[4,11,4,13],[5,11,5,13],[6,11,6,13],[7,11,7,13],[8,11,8,13],[131,3,131,4],[131,6,131,7],[131,9,131,10],[129,3,129,4],[129,6,129,7],[129,9,129,10],[130,3,130,4],[130,6,130,7],[130,9,130,10],[127,3,127,4],[127,6,127,7],[127,9,127,10],[128,3,128,4],[128,6,128,7],[128,9,128,10],[125,3,125,4],[125,6,125,7],[9,11,9,13],[10,11,10,13],[11,11,11,13],[12,11,12,13],[13,11,13,13],[15,12,15,13],[133,3,133,4],[133,6,133,7],[133,9,133,10],[132,3,132,4],[132,6,132,7],[132,9,132,10],[125,9,125,10],[126,3,126,4],[126,6,126,7],[126,9,126,10],[123,3,123,4],[123,6,123,7],[123,9,123,10],[124,3,124,4],[124,6,124,7],[124,9,124,10],[121,3,121,4],[121,6,121,7]]}
["Line No.","(a)","(b)","(c)",null,"(d)","(e)",null,"(f)","(g)",null,"(h)","(i)"]
[1,"Bill Comparison"]
[2,"Schedule 101 - General Service",null,null,null,null,null,null,null,null,null,"Compare"]
[3,null,"Current",null,null,"Proposed",null,null,"Revised",null,null,"Schedule 111/112",null,null,null,null,null,"3/4-inch",0.75]
[4,"Customer Count",{"$f":"'Bill Determ'!C7/12","v":145688},null,null,{"$f":"C5","v":145688},null,null,{"$f":"F5","v":145688},null,null,{"$f":"'Bill Determ'!F21","v":28782.999999999956},null,null,null,null,null,"1-inch",1]
[5,"Base",{"$f":"'Rate Design'!D4","v":6},null,null,10,null,null,{"$f":"'Rate Design'!D26","v":10.98},null,null,{"$f":"'Rate Design'!E63","v":152.01},null,null,null,null,null,"1 1/2-inch",1.5]
[6,"Allowance",0,null,null,0,null,null,0,null,null,0,null,null,null,null,null,"2-inch",2]
[7,"Rate 1",{"$f":"'Rate Design'!D16/100","v":0.81689999999999996},null,null,{"$f":"0.84576","v":0.84575999999999996},7.2759999999999998,7.2759999999999998,{"$f":"'Rate Design'!D39/100","v":0.73399999999999987},null,null,{"$f":"'Rate Design'!E38/100","v":7.6880000000000004E-2},null,null,null,null,null,"3-inch",3]
[8,"Rate 2",{"$f":"C8","v":0.81689999999999996},null,null,{"$f":"F8","v":0.84575999999999996},8.4059999999999988,8.4059999999999988,{"$f":"'Rate Design'!D39/100","v":0.73399999999999987},null,null,{"$f":"'Rate Design'!E39/100","v":0.74358000000000002},null,null,null,null,null,"4-inch",4]
[9,"Rate 3",{"$f":"C9","v":0.81689999999999996},null,null,{"$f":"F9","v":0.84575999999999996},9.7910000000000004,9.7910000000000004,{"$f":"'Rate Design'!D30/100","v":0.81125000000000003},null,null,{"$f":"'Rate Design'!E40/100","v":0.67205000000000004},null,null,null,null,null,"6-inch",6]
{"$rows_left_out":125}
{"sheet":"Rate Design","index":4,"n_rows":122,"n_cols":22,"rows_kept":122,"cut":false,"hidden":true,"merged":[]}
["PRESENT RATES",null,null,1,2,3,4,5,null,null,null,"Tiers - used for bill comparisons"]
[null,null,"TOTAL","SCH. 101","SCH. 111,112","SCH. 121,122","SCH. 132","SCH. 146",null,"Range Name",null,"SCH. 101","SCH. 111,112","SCH. 121,122","SCH. 131,132","SCH. 146"]
[null,"Base Tariff Rates"]
[1,"BASIC CHARGE",null,6,null,null,null,250]
[2,"MONTHLY MINIMUM",null,null,152.01,378.63]
[3,"BLOCK 1 PER THERM",null,{"$f":"91.808-11.893","v":79.915000000000006},{"$f":"18.802-11.952","v":6.85},{"$f":"17.349-12.088","v":5.261000000000001},{"$f":"73.315-12.381","v":60.933999999999997},8.1509999999999998,null,null,null,9999999,200,500,10000,20000]
[4,"BLOCK 2 PER THERM",null,null,{"$f":"84.033-11.952","v":72.081000000000003},{"$f":"83.966-12.088","v":71.878},{"$f":"69.005-12.381","v":56.623999999999995},7.2569999999999997,null,null,null,9999999,1000,1000,25000,50000]
[5,"BLOCK 3 PER THERM",null,null,{"$f":"77.02-11.952","v":65.067999999999998},{"$f":"76.802-12.088","v":64.714000000000013},{"$f":"67.948-12.381","v":55.566999999999993},6.548,null,"Rates_Base_Present",null,9999999,9999999,10000,50000,300000]
[6,"BLOCK 4 PER THERM",null,null,null,{"$f":"72.303-12.088","v":60.214999999999996},{"$f":"67.598-12.381","v":55.216999999999999},6.0590000000000002,null,null,null,9999999,9999999,25000,9999999,500000]
[7,"BLOCK 5 PER THERM",null,null,null,{"$f":"68.684-12.088","v":56.595999999999997},null,4.5650000000000004,null,null,null,9999999,9999999,9999999,9999999,9999999]
{"$rows_left_out":113}
{"sheet":"ROR","index":5,"n_rows":70,"n_cols":15,"rows_kept":70,"cut":false,"hidden":true,"merged":[]}
[null,"AVISTA UTILITIES"]
[null,"WASHINGTON GAS"]
[null,"PRESENT & PROPOSED RATE OF RETURN BY RATE SCHEDULE"]
[null,"12 MONTHS ENDED DECEMBER 31, 2011"]
[]
[]
[null,null,"Total","Sch 101","Sch 111","Sch 121","Sch 131","Sch 146"]
[null,"Total Rate Base",{"$f":"SUM(D8:H8)","v":189089000},145155168.17892998,31871255.882638671,2839833.9106529956,394552.0613787208,8828189.9663996529,"from COS"]
[]
[null,"Revenue From Retail Rates",{"$f":"SUM(D10:H10)","v":144082999.99999997},105607336.82815644,32015273.799189311,3894069.7031445685,365057.53474746284,2201262.1347622056,"from COS"]
{"$rows_left_out":61}
{"sheet":"BFG","index":6,"n_rows":24,"n_cols":6,"rows_kept":24,"cut":false,"hidden":true,"merged":[]}
["AVISTA UTILITIES"]
["GAS ANNUAL MINIMUM DEFICIENCY FOR B.F. GOODRICH"]
["STATE OF WASHINGTON"]
["BASED ON 2007 ANNUAL MINIMUM"]
[]
[null,null,null,null,null,"Gas"]
["Annual Minimum Usage Requirement(1)",null,null,null,null,10500000]
["Less: Jan 09 - Dec 09 Usage(2)",null,null,null,null,{"$f":"SUMIF('Big Schedules'!$A$4:$A$43,\"BF Goodrich\",'Big Schedules'!$N$4:$N$43)","v":5275291}]
["Usage Deficiency",null,null,null,null,{"$f":"F7-F8","v":5224709}]
["Deficiency Charge per therm(3)",null,null,null,null,0]
{"$rows_left_out":15}
{"sheet":"Exh3","index":7,"n_rows":20,"n_cols":12,"rows_kept":20,"cut":false,"hidden":true,"merged":[]}
["AVISTA UTILITIES",null,null,null,null,null,null,null,null,null,null,"This worksheet pulls data from 'ROR' tab."]
["WASHINGTON NATURAL GAS"]
["PRESENT & PROPOSED RATES OF RETURN BY RATE SCHEDULE"]
["12 MONTHS ENDED DECEMBER 31, 2011"]
[]
[]
[]
[]
[null,null,null,"Present Rates",null,null,"Base",null,"Proposed Rates"]
[null,null,null,"Present","Present",null,"Tariff",null,"Proposed","Proposed"]
{"$rows_left_out":11}
{"sheet":"Bill Determ","index":8,"n_rows":92,"n_cols":11,"rows_kept":92,"cut":false,"hidden":true,"merged":[]}
["AVISTA UTILITIES"]
["WASHINGTON GAS"]
["USAGE & BILLINGS BY RATE SCHEDULE"]
["12 MONTHS ENDED DECEMBER 31, 2011"]
[null,"Present",null,null,"Proposed"]
["Schedule 101","Total therms","Total Billings",null,"0-30","31-70",">70","Total Therms"]
["therms per Revenue Run(1)",{"$f":"'Rev Runs CY'!J59","v":123192356},{"$f":"'Rev Runs CY'!I59*12","v":1748256},null,{"$f":"40503629+420615","v":40924244},34570303,47697809,{"$f":"SUM(E7:G7)","v":123192356},null,null,{"$f":"G7/H7","v":0.38718156344051086}]
["Revenue Runs",null,null,null,null,null,null,{"$f":"'Rev Runs CY'!J59","v":123192356},null,null,{"$f":"100%-K7","v":0.61281843655948909}]
["Adjust. To Actual",null,null,null,null,null,null,{"$f":"H8-H7","v":0}]
[]
{"$rows_left_out":83}
{"sheet":"Big Schedules","index":9,"n_rows":132,"n_cols":21,"rows_kept":132,"cut":false,"hidden":true,"merged":[]}
["Washington Gas Billing Determinants by Customer"]
[null,null,null,null,null,null,null,null,null,null,null,null,null,null,null,"1st",{"$f":"P3","v":20000},{"$f":"Q3","v":50000},{"$f":"R3","v":300000},{"$f":"S3","v":500000}]
["ANNUAL USAGE, Sch 146",null,null,null,null,null,null,null,null,null,null,null,null,"12-mo ended",null,20000,50000,300000,500000,99999999]
["Washington","2011-01-01","2011-02-01","2011-03-01","2011-04-01","2011-05-01","2011-06-01","2011-07-01","2011-08-01","2011-09-01","2011-10-01","2011-11-01","2011-12-01","Total",null,"thms/mo","thms/mo","thms/mo","thms/mo","thms/mo"]
["American Linen",32782,31652,30921,36602,32346,24451,31969,27529,29950,27491,29058,29839,{"$f":"SUM(B5:M5)","v":364590},null,{"$f":"P$3*12-SUMPRODUCT(--($B5:$M5<=P$3),P$3-$B5:$M5)","v":240000},{"$f":"Q$3*12-SUM($P5:P5)-SUMPRODUCT(--($B5:$M5<=Q$3),Q$3-$B5:$M5)","v":124590},{"$f":"R$3*12-SUM($P5:Q5)-SUMPRODUCT(--($B5:$M5<=R$3),R$3-$B5:$M5)","v":0},{"$f":"S$3*12-SUM($P5:R5)-SUMPRODUCT(--($B5:$M5<=S$3),S$3-$B5:$M5)","v":0},{"$f":"T$3*12-SUM($P5:S5)-SUMPRODUCT(--($B5:$M5<=T$3),T$3-$B5:$M5)","v":0}]
["Baker Commodities ",86780,91286,75763,73389,21970,24671,35026,20522,38937,60903,68688,78705,676640,null,240000,{"$f":"Q$3*12-SUM($P6:P6)-SUMPRODUCT(--($B6:$M6<=Q$3),Q$3-$B6:$M6)","v":251126},{"$f":"R$3*12-SUM($P6:Q6)-SUMPRODUCT(--($B6:$M6<=R$3),R$3-$B6:$M6)","v":185514},{"$f":"S$3*12-SUM($P6:R6)-SUMPRODUCT(--($B6:$M6<=S$3),S$3-$B6:$M6)","v":0},{"$f":"T$3*12-SUM($P6:S6)-SUMPRODUCT(--($B6:$M6<=T$3),T$3-$B6:$M6)","v":0}]
["BF Goodrich",396323,422825,403945,426380,365026,444676,515821,435106,362940,488893,499421,513935,5275291,null,240000,{"$f":"Q$3*12-SUM($P7:P7)-SUMPRODUCT(--($B7:$M7<=Q$3),Q$3-$B7:$M7)","v":360000},{"$f":"R$3*12-SUM($P7:Q7)-SUMPRODUCT(--($B7:$M7<=R$3),R$3-$B7:$M7)","v":3000000},{"$f":"S$3*12-SUM($P7:R7)-SUMPRODUCT(--($B7:$M7<=S$3),S$3-$B7:$M7)","v":1645535},{"$f":"T$3*12-SUM($P7:S7)-SUMPRODUCT(--($B7:$M7<=T$3),T$3-$B7:$M7)","v":29756}]
["Boise Cascade ",22666,26949,29973,32726,32229,31575,28245,49120,30063,26509,30397,27969,368421,null,240000,{"$f":"Q$3*12-SUM($P8:P8)-SUMPRODUCT(--($B8:$M8<=Q$3),Q$3-$B8:$M8)","v":128421},{"$f":"R$3*12-SUM($P8:Q8)-SUMPRODUCT(--($B8:$M8<=R$3),R$3-$B8:$M8)","v":0},{"$f":"S$3*12-SUM($P8:R8)-SUMPRODUCT(--($B8:$M8<=S$3),S$3-$B8:$M8)","v":0},{"$f":"T$3*12-SUM($P8:S8)-SUMPRODUCT(--($B8:$M8<=T$3),T$3-$B8:$M8)","v":0}]
["Boise Cascade (Stimson Plant)",{"$f":"-B50*0.59522817476","v":23850.792962633201},{"$f":"-C50*0.59522817476","v":14139.05006324904},29062.015632657,28592.380602771362,13078.94868400148,21514.522376700199,16919.360867553001,10077.80822686156,17790.774915401642,4674.3268563902802,44861.157075311683,25438.861732892881,{"$f":"SUM(B9:M9)","v":249999.99999642331},null,196680.269613457,{"$f":"Q$3*12-SUM($P9:P9)-SUMPRODUCT(--($B9:$M9<=Q$3),Q$3-$B9:$M9)","v":53319.730382966285},{"$f":"R$3*12-SUM($P9:Q9)-SUMPRODUCT(--($B9:$M9<=R$3),R$3-$B9:$M9)","v":0},{"$f":"S$3*12-SUM($P9:R9)-SUMPRODUCT(--($B9:$M9<=S$3),S$3-$B9:$M9)","v":0},{"$f":"T$3*12-SUM($P9:S9)-SUMPRODUCT(--($B9:$M9<=T$3),T$3-$B9:$M9)","v":0}]
["Central Premix",45587,36484,31021,34177,38302,38777,29950,21518,20009,18524,20420,31037,{"$f":"SUM(B10:M10)","v":365806},null,238524,{"$f":"Q$3*12-SUM($P10:P10)-SUMPRODUCT(--($B10:$M10<=Q$3),Q$3-$B10:$M10)","v":127282},{"$f":"R$3*12-SUM($P10:Q10)-SUMPRODUCT(--($B10:$M10<=R$3),R$3-$B10:$M10)","v":0},{"$f":"S$3*12-SUM($P10:R10)-SUMPRODUCT(--($B10:$M10<=S$3),S$3-$B10:$M10)","v":0},{"$f":"T$3*12-SUM($P10:S10)-SUMPRODUCT(--($B10:$M10<=T$3),T$3-$B10:$M10)","v":0}]
{"$rows_left_out":123}
{"sheet":"Rev Runs CY","index":10,"n_rows":82,"n_cols":22,"rows_kept":82,"cut":false,"hidden":true,"merged":[]}
["Revenue Report Twelve Months Ended  for Report Date : '12/31/2011'"]
[]
[]
[null,null,null,null,null,201112,null,null,"TME"]
["Service","State Cde","Rate Schedule Num","Rate Schedule Desc","RevClsDesc","Meters","Usage","Revenue","Avg Meters","Usage","Revenue",null,null,null,null,null,null,null,null,"Meters","Usage","Revenue"]
["Gas","WA","101","101 FIRM AND GENERAL SERVICE","01 RESIDENTIAL",134611,14935586,13491857.43,133686.25,104729043,99176326.849999994,null,"G","WA","101","01","GWA10101",{"$f":"M6&N6&O6","v":"GWA101"},{"$f":"N6&P6","v":"WA01"},{"$f":"F6/$F$10","v":0.91810691729528437},{"$f":"G6/$G$10","v":0.84177784395758826},{"$f":"H6/$H$10","v":0.84605142367684882}]
[null,null,null,null,"21 FIRM COMMERCIAL",11890,2765262,2418610.0699999998,11887.75,18193151,16410682.359999999,null,"G","WA","101","21","GWA10121","GWA101","WA21",{"$f":"F7/$F$10","v":8.1095090643713591E-2},{"$f":"G7/$G$10","v":0.15585168766313209},{"$f":"H7/$H$10","v":0.15166692233885123}]
[null,null,null,null,"31 FIRM- INDUSTRIAL",88,31991,27678.850000000002,84,185938,164990.31,null,"G","WA","101","31","GWA10131","GWA101","WA31",6.0019915699300219E-4,1.803030360244801E-3,1.7356935892434752E-3]
[null,null,null,null,"80 INTERDEPARTMENT REVENUE",29,10068,8706.35,30,84224,74166,null,"G","WA","101","80","GWA10180","GWA101","WA80",1.9779290400905755E-4,5.6743801903487402E-4,5.4596039505651177E-4]
[null,null,null,null,"Sum",146618,17742907,15946852.699999999,145688,123192356,115826165.52,null,"G","WA","101",null,"GWA101","GWA101","WA",1,1,1]
{"$rows_left_out":73}
{"sheet":"Rev Run LY","index":11,"n_rows":84,"n_cols":26,"rows_kept":84,"cut":false,"hidden":true,"merged":[]}
["Revenue Report Twelve Months Ended  for Report Date : '12/31/2010'"]
[]
[]
[null,null,null,null,null,201012,null,null,"TME"]
["Service","State Cde","Rate Schedule Num","Rate Schedule Desc","RevClsDesc","Meters","Usage","Revenue","Avg Meters","Usage","Revenue"]
["Gas","WA","101","101 FIRM AND GENERAL SERVICE","01 RESIDENTIAL",133761,15593513,13834590.48,132657.16666666701,97371891,85897166.939999998,null,"G","WA","101","01","GWA10101",{"$f":"M6&N6&O6","v":"GWA101"},{"$f":"N6&P6","v":"WA01"}]
[null,null,null,null,"21 FIRM COMMERCIAL",11965,3044387,2618847.9700000002,11906.333333333299,16705670,13951123.02,null,"G","WA","101","21","GWA10121","GWA101","WA21"]
[null,null,null,null,"31 FIRM- INDUSTRIAL",83,34989,29889.89,84.4166666666667,174018,142630.15,null,"G","WA","101","31","GWA10131","GWA101","WA31"]
[null,null,null,null,"80 INTERDEPARTMENT REVENUE",28,12763,10812.52,27.0833333333333,66457,53955.83,null,"G","WA","101","80","GWA10180","GWA101","WA80"]
[null,null,null,null,"Sum",145837,18685652,16494140.859999999,144674.99999999997,114318036,100044875.94,null,"G","WA","101",null,"GWA101","GWA101","WA"]
{"$rows_left_out":74}