{"text_format":"1","workbook":"xlsx","n_sheets":16,"sheets":["Pres & Prop Rev","Page 1, Exh 1","Page 2, Exh 2","Page 3, Revenue Stability","Page 4-6, Crossover","Rate Design","ROR","Exh 3","ERM","Bill Determ","WA Sch 25","Lighting summary","St Lts","Area Lts","Rev Runs CY","Rev Runs LY"],"not_rendered":{"charts":0,"images":0,"macros":1,"external_links":5,"defined_names":58,"comments":8,"pivot_tables":0},"unopened":[],"bounds":{"document_bytes":16777216,"sheet_cells":100000,"rows_first":2000,"rows_last":500,"rows_between":2000,"halvings":0,"cell_chars":16384,"cell_head_chars":4096},"cells_cut":0,"cells_raw":0,"read":"whole","date_system":"1900"}

{"sheet":"Pres & Prop Rev","index":0,"n_rows":300,"n_cols":21,"rows_kept":300,"cut":false,"hidden":true,"merged":[[5,15,10,17],[94,1,95,7]]}
[]
[null,{"$f":"IF(Base1_Billing2=2,\"BILLED\",\"\")","v":""}]
[]
["WORK PAPER",null," ","RESIDENTIAL","GENERAL SVC. ","LG. GEN. SVC.","EX LG GEN SVC","PUMPING","ST & AREA LTG"]
["REFERENCE",null,"TOTAL","SCHEDULE 1","SCH. 11,12","SCH. 21,22","SCHEDULE 25","SCH. 30, 31, 32","SCH. 41-48",null,null,null,null,null,null,"Print Header for all printed pages on this worksheet:"]
[null,"PRESENT BILL DETERMINANTS",null,null,null,null,null,null,null,null,null,"Calculate all revenue exhibits using  ____ rates:",null,null,null,{"$f":"\"AVISTA UTILITIES\nWASHINGTON ELECTRIC\nPRO FORMA REVENUE UNDER PRESENT AND PROPOSED \"&N9&\" RATES\n12 MONTHS ENDED DECEMBER 31, 2011\"","v":"AVISTA UTILITIES\nWASHINGTON ELECTRIC\nPRO FORMA REVENUE UNDER PRESENT AND PROPOSED BASE TARIFF RATES\n12 MONTHS ENDED DECEMBER 31, 2011"}]
{"$rows_left_out":295}
{"sheet":"Page 1, Exh 1","index":1,"n_rows":52,"n_cols":18,"rows_kept":52,"cut":false,"hidden":false,"merged":[[4,0,4,12],[0,15,2,16],[0,0,0,12],[1,0,1,12],[2,0,2,12],[3,0,3,12]]}
["AVISTA UTILITIES",null,null,null,null,null,null,null,null,null,null,null,null,null,null,"This worksheet pulls data from 'Pres & Prop Rev' tab."]
["WASHINGTON ELECTRIC"]
["PROPOSED INCREASE BY SERVICE SCHEDULE"]
["12 MONTHS ENDED DECEMBER 31, 2011"]
["(000s of Dollars)"]
[]
{"$rows_left_out":47}
{"sheet":"Page 2, Exh 2","index":2,"n_rows":61,"n_cols":24,"rows_kept":61,"cut":false,"hidden":false,"merged":[[8,0,8,2]]}
["AVISTA UTILITIES",null,null,null,null,null,null,null,null,null,null,null,null,null,"This worksheet uses Base & Billing rates from 'Rate Design' tab."]
["WASHINGTON ELECTRIC"]
["PRESENT AND PROPOSED RATE COMPONENTS BY SCHEDULE"]
[]
[]
[]
{"$rows_left_out":56}
{"sheet":"Page 3, Revenue Stability","index":3,"n_rows":26,"n_cols":10,"rows_kept":26,"cut":false,"hidden":false,"merged":[[18,7,18,9],[14,2,14,4],[5,2,5,4],[5,7,5,9],[0,1,0,9],[1,1,1,9],[2,1,2,9],[3,1,3,9]]}
[null,"AVISTA UTILITIES"]
[null,"WASHINGTON ELECTRIC"]
[null,"COLLECTION OF REVENUE AND DIFFERENCE IN RATES"]
[null,"12 MONTHS ENDED DECEMBER 31, 2011"]
["Line No.","A","B","C","D","E","F","G","H","I"]
[1,null,"Rates",null,null,null,null,"Revenues Collected by Rate Design (Sch. 1)"]
{"$rows_left_out":21}
{"sheet":"Page 4-6, Crossover","index":4,"n_rows":134,"n_cols":22,"rows_kept":134,"cut":false,"hidden":false,"merged":[[1,1,1,10],[2,1,2,10],[3,2,3,4],[3,5,3,7],[3,8,3,10],[4,2,4,4],[4,5,4,7],[4,8,4,10],[9,2,9,4],[9,5,9,7],[9,8,9,10],[7,2,7,4],[7,5,7,7],[7,8,7,10],[5,2,5,4],[5,5,5,7],[5,8,5,10],[6,2,6,4],[6,5,6,7],[6,8,6,10],[10,2,10,4],[10,5,10,7],[10,8,10,10],[8,2,8,4],[8,5,8,7],[8,8,8,10],[13,2,13,4],[13,5,13,7],[13,8,13,10],[14,1,14,10],[15,3,15,4],[15,6,15,7],[15,9,15,10],[11,2,11,4],[11,5,11,7],[11,8,11,10],[12,2,12,4],[12,5,12,7],[12,8,12,10],[18,3,18,4],[18,6,18,7],[18,9,18,10],[19,3,19,4],[19,6,19,7],[19,9,19,10],[16,3,16,4],[16,6,16,7],[16,9,16,10],[17,3,17,4],[17,6,17,7],[17,9,17,10],[22,3,22,4],[22,6,22,7],[22,9,22,10],[23,3,23,4],[23,6,23,7],[23,9,23,10],[20,3,20,4],[20,6,20,7],[20,9,20,10],[21,3,21,4],[21,6,21,7],[21,9,21,10],[26,3,26,4],[26,6,26,7],[26,9,26,10],[27,3,27,4],[27,6,27,7],[27,9,27,10],[24,3,24,4],[24,6,24,7],[24,9,24,10],[25,3,25,4],[25,6,25,7],[25,9,25,10],[30,3,30,4],[30,6,30,7],[30,9,30,10],[31,3,31,4],[31,6,31,7],[31,9,31,10],[28,3,28,4],[28,6,28,7],[28,9,28,10],[29,3,29,4],[29,6,29,7],[29,9,29,10],[34,3,34,4],[34,6,34,7],[34,9,34,10],[35,3,35,4],[35,6,35,7],[35,9,35,10],[32,3,32,4],[32,6,32,7],[32,9,32,10],[33,3,33,4],[33,6,33,7],[33,9,33,10],[38,3,38,4],[38,6,38,7],[38,9,38,10],[39,3,39,4],[39,6,39,7],[39,9,39,10],[36,3,36,4],[36,6,36,7],[36,9,36,10],[37,3,37,4],[37,6,37,7],[37,9,37,10],[42,3,42,4],[42,6,42,7],[42,9,42,10],[43,3,43,4],[43,6,43,7],[43,9,43,10],[40,3,40,4],[40,6,40,7],[40,9,40,10],[41,3,41,4],[41,6,41,7],[41,9,41,10],[46,3,46,4],[46,6,46,7],[46,9,46,10],[47,3,47,4],[47,6,47,7],[47,9,47,10],[44,3,44,4],[44,6,44,7],[44,9,44,10],[45,3,45,4],[45,6,45,7],[45,9,45,10],[50,3,50,4],[50,6,50,7],[50,9,50,10],[51,3,51,4],[51,6,51,7],[51,9,51,10],[48,3,48,4],[48,6,48,7],[48,9,48,10],[49,3,49,4],[49,6,49,7],[49,9,49,10],[54,3,54,4],[54,6,54,7],[54,9,54,10],[55,3,55,4],[55,6,55,7],[55,9,55,10],[52,3,52,4],[52,6,52,7],[52,9,52,10],[53,3,53,4],[53,6,53,7],[53,9,53,10],[58,3,58,4],[58,6,58,7],[58,9,58,10],[59,3,59,4],[59,6,59,7],[59,9,59,10],[56,3,56,4],[56,6,56,7],[56,9,56,10],[57,3,57,4],[57,6,57,7],[57,9,57,10],[62,3,62,4],[62,6,62,7],[62,9,62,10],[63,3,63,4],[63,6,63,7],[63,9,63,10],[60,3,60,4],[60,6,60,7],[60,9,60,10],[61,3,61,4],[61,6,61,7],[61,9,61,10],[66,3,66,4],[66,6,66,7],[66,9,66,10],[67,3,67,4],[67,6,67,7],[67,9,67,10],[64,3,64,4],[64,6,64,7],[64,9,64,10],[65,3,65,4],[65,6,65,7],[65,9,65,10],[70,3,70,4],[70,6,70,7],[70,9,70,10],[71,3,71,4],[71,6,71,7],[71,9,71,10],[68,3,68,4],[68,6,68,7],[68,9,68,10],[69,3,69,4],[69,6,69,7],[69,9,69,10],[74,3,74,4],[74,6,74,7],[74,9,74,10],[75,3,75,4],[75,6,75,7],[75,9,75,10],[72,3,72,4],[72,6,72,7],[72,9,72,10],[73,3,73,4],[73,6,73,7],[73,9,73,10],[78,3,78,4],[78,6,78,7],[78,9,78,10],[79,3,79,4],[79,6,79,7],[79,9,79,10],[76,3,76,4],[76,6,76,7],[76,9,76,10],[77,3,77,4],[77,6,77,7],[77,9,77,10],[82,3,82,4],[82,6,82,7],[82,9,82,10],[83,3,83,4],[83,6,83,7],[83,9,83,10],[80,3,80,4],[80,6,80,7],[80,9,80,10],[81,3,81,4],[81,6,81,7],[81,9,81,10],[86,3,86,4],[86,6,86,7],[86,9,86,10],[87,3,87,4],[87,6,87,7],[87,9,87,10],[84,3,84,4],[84,6,84,7],[84,9,84,10],[85,3,85,4],[85,6,85,7],[85,9,85,10],[90,3,90,4],[90,6,90,7],[90,9,90,10],[91,3,91,4],[91,6,91,7],[91,9,91,10],[88,3,88,4],[88,6,88,7],[88,9,88,10],[89,3,89,4],[89,6,89,7],[89,9,89,10],[94,3,94,4],[94,6,94,7],[94,9,94,10],[95,3,95,4],[95,6,95,7],[95,9,95,10],[92,3,92,4],[92,6,92,7],[92,9,92,10],[93,3,93,4],[93,6,93,7],[93,9,93,10],[98,3,98,4],[98,6,98,7],[98,9,98,10],[99,3,99,4],[99,6,99,7],[99,9,99,10],[96,3,96,4],[96,6,96,7],[96,9,96,10],[97,3,97,4],[97,6,97,7],[97,9,97,10],[102,3,102,4],[102,6,102,7],[102,9,102,10],[103,3,103,4],[103,6,103,7],[103,9,103,10],[100,3,100,4],[100,6,100,7],[100,9,100,10],[101,3,101,4],[101,6,101,7],[101,9,101,10],[106,3,106,4],[106,6,106,7],[106,9,106,10],[107,3,107,4],[107,6,107,7],[107,9,107,10],[104,3,104,4],[104,6,104,7],[104,9,104,10],[105,3,105,4],[105,6,105,7],[105,9,105,10],[110,3,110,4],[110,6,110,7],[110,9,110,10],[111,3,111,4],[111,6,111,7],[111,9,111,10],[108,3,108,4],[108,6,108,7],[108,9,108,10],[109,3,109,4],[109,6,109,7],[109,9,109,10],[114,3,114,4],[114,6,114,7],[114,9,114,10],[115,3,115,4],[115,6,115,7],[115,9,115,10],[112,3,112,4],[112,6,112,7],[112,9,112,10],[113,3,113,4],[113,6,113,7],[113,9,113,10],[118,3,118,4],[118,6,118,7],[118,9,118,10],[119,3,119,4],[119,6,119,7],[119,9,119,10],[116,3,116,4],[116,6,116,7],[116,9,116,10],[117,3,117,4],[117,6,117,7],[117,9,117,10],[122,3,122,4],[122,6,122,7],[122,9,122,10],[123,3,123,4],[123,6,123,7],[123,9,123,10],[120,3,120,4],[120,6,120,7],[120,9,120,10],[121,3,121,4],[121,6,121,7],[121,9,121,10],[127,3,127,4],[127,6,127,7],[127,9,127,10],[124,3,124,4],[124,6,124,7],[124,9,124,10],[125,3,125,4],[125,6,125,7],[125,9,125,10],[0,3,0,4],[0,6,0,7],[0,9,0,10],[132,3,132,4],[132,6,132,7],[132,9,132,10],[133,3,133,4],[133,6,133,7],[133,9,133,10],[130,3,130,4],[130,6,130,7],[130,9,130,10],[131,3,131,4],[131,6,131,7],[131,9,131,10],[128,3,128,4],[128,6,128,7],[128,9,128,10],[129,3,129,4],[129,6,129,7],[129,9,129,10],[126,3,126,4],[126,6,126,7],[126,9,126,10]]}
["Line No.","(a)","(b)","(c)",null,"(d)","(e)",null,"(f)","(g)"]
[1,"Bill Comparison"]
[2,"Schedule 1 - Residential"]
[3,null,"Current",null,null,"Proposed",null,null,"Revised",null,null,null,null,null,"3/4-inch",0.75]
[4,"Customer Count",{"$f":"'Bill Determ'!F9/12","v":201447.58333333302},null,null,{"$f":"C5","v":201447.58333333302},null,null,{"$f":"F5","v":201447.58333333302},null,null,null,null,null,"1-inch",1]
[5,"Base",{"$f":"'Rate Design'!D4","v":6},null,null,10,null,null,{"$f":"'Rate Design'!D26","v":7.34},null,null,null,null,null,"1 1/2-inch",1.5]
{"$rows_left_out":129}
{"sheet":"Rate Design","index":5,"n_rows":127,"n_cols":23,"rows_kept":127,"cut":false,"hidden":true,"merged":[]}
["PRESENT RATES",null,null,1,2,3,4,5,6,null,null,null,null,"Tiers - used for bill comparisons"]
[null,null,"TOTAL","SCH. 1","SCH. 11,12","SCH. 21,22","SCH. 25","SCH. 30, 31, 32",null,null,null,"Range Name",null,"SCHEDULE 1","SCH. 11,12","SCH. 21,22","SCHEDULE 25","SCH. 30, 31, 32"]
[null,"Base Tariff Rates"]
[1,"BASIC CHARGE",null,6,12,0,0,10]
[2,"BLOCK 1 PER KWH",null,6.9139999999999997,10.891,6.819,5.3730000000000002,9.1140000000000008,null,null,null,null,null,600,3650,250000,500000]
[3,"BLOCK 2 PER KWH",null,8.0440000000000005,8.0020000000000007,6.0970000000000004,4.8339999999999996,6.5110000000000001,null,null,null,null,null,1300,9999999,9999999,9999999]
{"$rows_left_out":122}
{"sheet":"ROR","index":6,"n_rows":65,"n_cols":12,"rows_kept":65,"cut":false,"hidden":true,"merged":[]}
[null,"AVISTA UTILITIES"]
[null,"WASHINGTON ELECTRIC"]
[null,"PRESENT & PROPOSED RATE OF RETURN BY RATE SCHEDULE"]
[null,"12 MONTHS ENDED DECEMBER 31, 2011"]
[]
[]
{"$rows_left_out":60}
{"sheet":"Exh 3","index":7,"n_rows":20,"n_cols":12,"rows_kept":20,"cut":false,"hidden":true,"merged":[]}
["AVISTA UTILITIES",null,null,null,null,null,null,null,null,null,null,"This worksheet pulls data from 'ROR' tab."]
["WASHINGTON ELECTRIC"]
["PRESENT & PROPOSED RATES OF RETURN BY RATE SCHEDULE"]
["12 MONTHS ENDED DECEMBER 31, 2011"]
[]
[]
{"$rows_left_out":15}
{"sheet":"ERM","index":8,"n_rows":23,"n_cols":8,"rows_kept":23,"cut":false,"hidden":true,"merged":[[0,0,0,7],[1,0,1,7],[2,0,2,7],[3,0,3,7],[4,0,4,7]]}
["AVISTA UTILITIES"]
["WASHINGTON ELECTRIC"]
["PROPOSED ERM DECREASE BY SERVICE SCHEDULE"]
["12 MONTHS ENDED DECEMBER 31, 2011"]
["(000s of Dollars)"]
[]
{"$rows_left_out":18}
{"sheet":"Bill Determ","index":9,"n_rows":86,"n_cols":21,"rows_kept":86,"cut":false,"hidden":true,"merged":[]}
["AVISTA UTILITIES"]
["WASHINGTON ELECTRIC"]
["ACTUAL / PRO FORMA BILLING DETERMINANTS BY RATE SCHEDULE"]
["12 MONTHS ENDED DECEMBER 31, 2011"]
[]
["Present",null,null,0,null,null,null,null,"Proposed",null,null,null,null,null,null,"Proposed"]
{"$rows_left_out":81}
{"sheet":"WA Sch 25","index":10,"n_rows":171,"n_cols":19,"rows_kept":171,"cut":false,"hidden":true,"merged":[]}
["Washington Schedule 25 Billing Determinants",null,null,null,null,null,null,null,null,null,null,null,null,null,null,null,"1st",{"$f":"Q2","v":500000},{"$f":"R2","v":6000000}]
[null,null,null,null,null,null,null,null,null,null,null,null,null,null,null,"12-mo Ended",500000,6000000,99999999]
[null,"KWHs","Acct No.","2011-01-01","2011-02-01","2011-03-01","2011-04-01","2011-05-01","2011-06-01","2011-07-01","2011-08-01","2011-09-01","2011-10-01","2011-11-01","2011-12-01","Total","kwhs/mo","kwhs/mo","kwhs/mo"]
[1,"BF Goodrich",770037736,3808627,3753763,4253588,3819085,4680921,5224187,4726982,4284815,5079488,5089606,4978063,5523869,{"$f":"SUM(D4:O4)","v":55222994},{"$f":"Q$2*12-SUMPRODUCT(--($D4:$O4<=Q$2),Q$2-$D4:$O4)","v":6000000},{"$f":"R$2*12-SUM($Q4:Q4)-SUMPRODUCT(--($D4:$O4<=R$2),R$2-$D4:$O4)","v":49222994},{"$f":"S$2*12-SUM($Q4:R4)-SUMPRODUCT(--($D4:$O4<=S$2),S$2-$D4:$O4)","v":0}]
[2,"Boise Cascade Plywood",500017,3001425,3160004,3471363,3323930,3270439,3358841,3356501,3551117,3367795,3703568,3265731,3060271,39890985,{"$f":"Q$2*12-SUMPRODUCT(--($D5:$O5<=Q$2),Q$2-$D5:$O5)","v":6000000},{"$f":"R$2*12-SUM($Q5:Q5)-SUMPRODUCT(--($D5:$O5<=R$2),R$2-$D5:$O5)","v":33890985},{"$f":"S$2*12-SUM($Q5:R5)-SUMPRODUCT(--($D5:$O5<=S$2),S$2-$D5:$O5)","v":0}]
[3,"Boise Cascade Sawmill",500018,1237491,1126556,1216452,1130891,1085836,1087957,1035857,1110990,1058347,1116412,976569,1099981,13283339,6000000,{"$f":"R$2*12-SUM($Q6:Q6)-SUMPRODUCT(--($D6:$O6<=R$2),R$2-$D6:$O6)","v":7283339},{"$f":"S$2*12-SUM($Q6:R6)-SUMPRODUCT(--($D6:$O6<=S$2),S$2-$D6:$O6)","v":0}]
{"$rows_left_out":166}
{"sheet":"Lighting summary","index":11,"n_rows":41,"n_cols":13,"rows_kept":41,"cut":false,"hidden":true,"merged":[[6,2,6,3],[6,5,6,6]]}
[null,"AVISTA UTILITIES"]
[null,"WASHINGTON ELECTRIC"]
[null,"STREET & AREA LIGHT REVENUE UNDER PRESENT & PROPOSED RATES"]
[null,"12 MONTHS ENDED DECEMBER 31, 2011"]
[]
[]
{"$rows_left_out":36}
{"sheet":"St Lts","index":12,"n_rows":84,"n_cols":90,"rows_kept":84,"cut":false,"hidden":true,"merged":[]}
["Street Light Summary",null,null,null,null,null,null,null,"WASHINGTON Street Lights",null,null,null,null,null,null,null,null,null,null,null,null,null,null,null,null,null,null,null,null,null,null,null,null,null,null,null,null,null,null,null,null,null,null,null,null,null,null,null,null,null,null,null,null,"% rate increase -->",{"$f":"'Lighting summary'!L11","v":-6.9101138695587538E-3},{"$f":"'Lighting summary'!L12","v":-6.9101138695587538E-3},{"$f":"'Lighting summary'!L13","v":-6.9101138695587538E-3},{"$f":"'Lighting summary'!L14","v":-6.9101138695587538E-3},{"$f":"'Lighting summary'!L15","v":-6.9101138695587538E-3},null,null,null,null,null,null,null,null,null,null,null,null,null,"compare input Present Billing Rates to calculated Present Billing Rates",null,null,null,null,null,null,{"$f":"1+'Lighting summary'!K36","v":1.0502472139701617}]
["DWWPAOAE Report, as of 01/10/12",null,null,null,null,null,null,null,null,null,null,null,"Number of Lights(1)",null,null,null,null,null,"Present Rates",null,null,null,null,null,"Monthly Revenue at Present Rates",null,null,null,null,null,"Number of Lights(1)",null,null,null,null,null,"Revised Present Rates",null,null,null,null,null,"Monthly Revenue at Revised Present Rates",null,null,null,null,null,"Number of Lights",null,null,null,null,null,"Proposed Rates",null,null,null,null,null,"Monthly Revenue at Proposed Rates",null,null,null,null,null,"Present Billing Rates",null,null,null,null,null,{"$f":"1+'Lighting summary'!I36","v":1.0499000000000001},"Sch 91 & 93",null,null,null,null,null,"New Billing Rates",null,null,null,null,null,"Increase"]
[null,null,null,null,null,null,null,null,"Fixture Type","Pole Facility","Size","Sched","041","042","044","045","046",null,"041","042","044","045","046",null,"041","042","044","045","046",null,"041","042","044","045","046",null,"041","042","044","045","046",null,"041","042","044","045","046",null,"041","042","044","045","046",null,"041","042","044","045","046",null,"041","042","044","045","046",null,"041","042","044","045","046",null,"041","042","044","045","046",null,null,"041","042","044","045","046",null,"041","042","044","045","046"]
[null,null,null,null,null,null,null,null,"Single Mercury Vapor","Direct Burial",4000,214,{"$f":"SUMIF($G:$G,TEXT(M$3,\"000\")&TEXT($L4,\"000\"),$E:$E)","v":75},0,0,0,0,{"$f":"IF(SUM(M4:Q4)>0,0,1)","v":0},13.06,0,0,0,0,null,{"$f":"IF(AND(M4<>0,S4=0),#VALUE!,M4*S4)","v":979.5},{"$f":"IF(AND(N4<>0,T4=0),#VALUE!,N4*T4)","v":0},{"$f":"IF(AND(O4<>0,U4=0),#VALUE!,O4*U4)","v":0},{"$f":"IF(AND(P4<>0,V4=0),#VALUE!,P4*V4)","v":0},{"$f":"IF(AND(Q4<>0,W4=0),#VALUE!,Q4*W4)","v":0},null,{"$f":"SUMIF($G:$G,TEXT(AE$3,\"000\")&TEXT($L4,\"000\"),$E:$E)","v":75},0,0,0,0,{"$f":"IF(SUM(AE4:AI4)>0,0,1)","v":0},13.06,0,0,0,0,null,{"$f":"IF(AND(AE4<>0,AK4=0),#VALUE!,AE4*AK4)","v":979.5},{"$f":"IF(AND(AF4<>0,AL4=0),#VALUE!,AF4*AL4)","v":0},{"$f":"IF(AND(AG4<>0,AM4=0),#VALUE!,AG4*AM4)","v":0},{"$f":"IF(AND(AH4<>0,AN4=0),#VALUE!,AH4*AN4)","v":0},{"$f":"IF(AND(AI4<>0,AO4=0),#VALUE!,AI4*AO4)","v":0},null,{"$f":"M4","v":75},{"$f":"N4","v":0},0,0,0,null,{"$f":"ROUND(AK4*(1+BC$1),2)","v":12.97},{"$f":"ROUND(AL4*(1+BD$1),2)","v":0},{"$f":"ROUND(AM4*(1+BE$1),2)","v":0},{"$f":"ROUND(AN4*(1+BF$1),2)","v":0},{"$f":"ROUND(AO4*(1+BG$1),2)","v":0},null,{"$f":"IF(AND(AW4<>0,BC4=0),#VALUE!,AW4*BC4)","v":972.75},{"$f":"IF(AND(AX4<>0,BD4=0),#VALUE!,AX4*BD4)","v":0},{"$f":"IF(AND(AY4<>0,BE4=0),#VALUE!,AY4*BE4)","v":0},{"$f":"IF(AND(AZ4<>0,BF4=0),#VALUE!,AZ4*BF4)","v":0},{"$f":"IF(AND(BA4<>0,BG4=0),#VALUE!,BA4*BG4)","v":0},{"$f":"SUM(BI4:BM4)-SUM(Y4:AC4)","v":-6.75},13.71,null,null,null,null,null,{"$f":"ROUND(S4*$BU$2-BO4,2)","v":0},{"$f":"ROUND(T4*$BU$2-BP4,2)","v":0},{"$f":"ROUND(U4*$BU$2-BQ4,2)","v":0},{"$f":"ROUND(V4*$BU$2-BR4,2)","v":0},{"$f":"ROUND(W4*$BU$2-BS4,2)","v":0},null,null,{"$f":"BC4*$CB$1","v":13.621706365192999},{"$f":"BD4*$CB$1","v":0},0,0,0,null,{"$f":"CB4-BO4","v":-8.8293634807001808E-2},{"$f":"CC4-BP4","v":0},0,0,0]
[null,"State","Sched","Rate Sub","# of Lights",null,null,null,"Single High-Pressure Sodium Vapor","Direct Burial","50W",234,0,130,0,0,0,0,0,12.26,0,0,0,null,{"$f":"IF(AND(M5<>0,S5=0),#VALUE!,M5*S5)","v":0},{"$f":"IF(AND(N5<>0,T5=0),#VALUE!,N5*T5)","v":1593.8},{"$f":"IF(AND(O5<>0,U5=0),#VALUE!,O5*U5)","v":0},{"$f":"IF(AND(P5<>0,V5=0),#VALUE!,P5*V5)","v":0},{"$f":"IF(AND(Q5<>0,W5=0),#VALUE!,Q5*W5)","v":0},null,0,130,0,0,0,0,0,12.26,0,0,0,null,{"$f":"IF(AND(AE5<>0,AK5=0),#VALUE!,AE5*AK5)","v":0},{"$f":"IF(AND(AF5<>0,AL5=0),#VALUE!,AF5*AL5)","v":1593.8},{"$f":"IF(AND(AG5<>0,AM5=0),#VALUE!,AG5*AM5)","v":0},{"$f":"IF(AND(AH5<>0,AN5=0),#VALUE!,AH5*AN5)","v":0},{"$f":"IF(AND(AI5<>0,AO5=0),#VALUE!,AI5*AO5)","v":0},null,{"$f":"M5","v":0},130,0,0,0,null,{"$f":"ROUND(AK5*(1+BC$1),2)","v":0},{"$f":"ROUND(AL5*(1+BD$1),2)","v":12.18},{"$f":"ROUND(AM5*(1+BE$1),2)","v":0},{"$f":"ROUND(AN5*(1+BF$1),2)","v":0},{"$f":"ROUND(AO5*(1+BG$1),2)","v":0},null,{"$f":"IF(AND(AW5<>0,BC5=0),#VALUE!,AW5*BC5)","v":0},{"$f":"IF(AND(AX5<>0,BD5=0),#VALUE!,AX5*BD5)","v":1583.3999999999999},0,0,0,-10.400000000000091,null,12.87,null,null,null,null,0,0,0,0,0,null,null,{"$f":"BC5*$CB$1","v":0},{"$f":"BD5*$CB$1","v":12.79201106615657},{"$f":"BE5*$CB$1","v":0},{"$f":"BF5*$CB$1","v":0},{"$f":"BG5*$CB$1","v":0},null,{"$f":"CB5-BO5","v":0},{"$f":"CC5-BP5","v":-7.7988933843428754E-2},{"$f":"CD5-BQ5","v":0},{"$f":"CE5-BR5","v":0},{"$f":"CF5-BS5","v":0}]
[null,null,null,null,null,null,null,null,"High-Pressure Sodium Vapor","Dusk to Dawn","70W",335,0,0,0,0,41,0,0,0,0,0,3.16,null,0,0,0,0,129.56,null,0,0,0,0,41,0,0,0,0,0,3.16,null,0,0,0,0,129.56,null,0,0,0,0,41,null,0,0,0,0,3.14,null,0,0,0,0,128.74,-0.81999999999999318,null,null,null,null,3.32,null,0,0,0,0,0,null,null,0,0,0,0,3.2977762518663081,null,0,0,0,0,-2.2223748133691767E-2]
{"$rows_left_out":79}
{"sheet":"Area Lts","index":13,"n_rows":63,"n_cols":52,"rows_kept":63,"cut":false,"hidden":true,"merged":[]}
["Area Light Summary",null,null,null,null,null,null,null,"WASHINGTON Area Lights",null,null,null,null,null,null,null,null,null,"Monthly Rev.",null,null,null,null,null,null,null,null,"Monthly Rev.",null,null,{"$f":"SL_RateIncr","v":0},null,null,"% rate increase -->",{"$f":"'Lighting summary'!L16","v":-6.9101138695587538E-3},null,null,"Monthly Rev.",null,null,-3.64E-3,null,null,null,"compare input Present Billing Rates to calculated Present Billing Rates"]
["DWWPWMS.AREA_LIGHT_ASMBLY1, as of 2/10/11",null,null,null,null,null,null,null,null,null,null,null,"# of Lights(1)",null,null,"Pres. Rates",null,null,"at Pres. Rates",null,null,"# of Lights(1)",null,null,"Pres. Revised Rates",null,null,"at Pres. Revised Rates",null,null,null,"# of Lights",null,null,"Prop. Rates",null,null,"at Prop. Rates",null,null,null,"Pres. Billing Rates",null,null,{"$f":"'St Lts'!BU2","v":1.0499000000000001},{"$f":"'St Lts'!BV2","v":"Sch 91 & 93"},null,"New Billing Rates",null,{"$f":"1+'Lighting summary'!K36","v":1.0502472139701617},"Increase"]
[null,null,null,null,null,null,null,null,"Fixture Type","Pole Facility","Size","Sched","047","048",null,"047","048",null,"047","048",null,"047","048",null,"047","048",null,"047","048",null,null,"047","048",null,"047","048",null,"047","048",null,"kwh","047","048","Sch 59","047","048",null,"047","048",null,"047","048"]
[null,null,null,null,null,null,null,null,"Sodium Vapor","Granville w/16' decorative pole","100W","HAG",{"$f":"SUMIF($G:$G,TEXT(M$3,\"000\")&TEXT($L4,\"000\"),$E:$E)","v":0},0,null,27.39,{"$f":"P4","v":27.39},null,{"$f":"IF(AND(M4<>0,P4=0),#VALUE!,M4*P4)","v":0},{"$f":"IF(AND(N4<>0,Q4=0),#VALUE!,N4*Q4)","v":0},null,{"$f":"SUMIF($G:$G,TEXT(V$3,\"000\")&TEXT($L4,\"000\"),$E:$E)","v":0},0,null,27.39,{"$f":"Y4","v":27.39},null,{"$f":"IF(AND(V4<>0,Y4=0),#VALUE!,V4*Y4)","v":0},{"$f":"IF(AND(W4<>0,Z4=0),#VALUE!,W4*Z4)","v":0},null,null,{"$f":"M4","v":0},{"$f":"N4","v":0},null,{"$f":"ROUND(Y4*(1+AI$1),2)","v":27.2},{"$f":"AI4","v":27.2},null,{"$f":"IF(AND(AF4<>0,AI4=0),#VALUE!,AF4*AI4)","v":0},{"$f":"IF(AND(AG4<>0,AJ4=0),#VALUE!,AG4*AJ4)","v":0},null,40,28.76,28.61,{"$f":"ROUND($AO$1*$AO4,2)","v":-0.15},{"$f":"ROUND(P4*$AS$2-AP4,2)","v":0},{"$f":"ROUND(Q4*$AS$2-AQ4+AR4,2)","v":0},null,{"$f":"AI4*$AX$2","v":28.566724219988398},{"$f":"AJ4*$AX$2+AR4","v":28.416724219988399},null,{"$f":"AV4-AP4","v":-0.19327578001160362},{"$f":"AW4-AQ4","v":-0.19327578001160006}]
[null,"State","Sched","Rate Sub","# of Lights",null,null,null,"Sodium Vapor","Floodlight on existing standard","250W","HAH",93,7,null,20.260000000000002,{"$f":"P5","v":20.260000000000002},null,1884.18,141.82000000000002,null,93,7,null,20.260000000000002,{"$f":"Y5","v":20.260000000000002},null,1884.18,141.82000000000002,null,null,{"$f":"M5","v":93},7,null,{"$f":"ROUND(Y5*(1+AI$1),2)","v":20.12},{"$f":"AI5","v":20.12},null,1871.16,140.84,null,107,21.27,20.88,{"$f":"ROUND($AO$1*$AO5,2)","v":-0.39},{"$f":"ROUND(P5*$AS$2-AP5,2)","v":0},{"$f":"ROUND(Q5*$AS$2-AQ5+AR5,2)","v":0},null,{"$f":"AI5*$AX$2","v":21.130973945079656},{"$f":"AJ5*$AX$2+AR5","v":20.740973945079656},null,{"$f":"AV5-AP5","v":-0.13902605492034326},{"$f":"AW5-AQ5","v":-0.13902605492034326}]
[null,null,null,null,null,null,null,null,"Sodium Vapor","Kim light w/25' fiberglass pole","100W","HAI",15,3,null,26.45,26.45,null,396.75,79.349999999999994,null,15,3,null,26.45,26.45,null,396.75,79.349999999999994,null,null,15,3,null,26.27,{"$f":"AI6","v":26.27},null,394.05,78.81,null,40,27.77,27.62,-0.15,0,0,null,27.589994310996147,27.439994310996148,null,-0.18000568900385261,-0.18000568900385261]
{"$rows_left_out":58}
{"sheet":"Rev Runs CY","index":14,"n_rows":126,"n_cols":19,"rows_kept":126,"cut":false,"hidden":true,"merged":[]}
["Revenue Meters Report by Location  Twelve Months Ended  for Report Date : '12/31/2011'"]
[]
[]
[null,null,null,null,null,201112,null,null,"TME"]
["Service","State Cde","Rate Schedule Num","Rate Schedule Desc","RevClsDesc","Meters","Usage","Revenue","Avg Meters","Usage","Revenue"]
[null,"WA","001","001 RESIDENTIAL SERVICE","01 RESIDENTIAL",202660,254046107,20500169.879999999,201444.83333333302,2425015942,198556496.47,null,"E","WA","001","01","EWA00101",{"$f":"M6&N6&O6","v":"EWA001"},{"$f":"N6&P6","v":"WA01"}]
{"$rows_left_out":121}
{"sheet":"Rev Runs LY","index":15,"n_rows":136,"n_cols":21,"rows_kept":136,"cut":false,"hidden":true,"merged":[]}
["Revenue Meters Report by Location  Twelve Months Ended  for Report Date : '12/31/2010'"]
[]
[]
[null,null,null,null,null,201012,null,null,"TME"]
["Service","State Cde","Rate Schedule Num","Rate Schedule Desc","RevClsDesc","Meters","Usage","Revenue","Avg Meters","Usage","Revenue"]
[null,"WA","001","001 RESIDENTIAL SERVICE","01 RESIDENTIAL",202149,260391499,20455263.010000002,200673.75,2369426282,181091861.87,null,"E","WA","001","01","EWA00101",{"$f":"M6&N6&O6","v":"EWA001"},{"$f":"N6&P6","v":"WA01"}]
{"$rows_left_out":130}