{"text_format":"1","workbook":"xlsx","n_sheets":17,"sheets":["Page 1","Page 2","Pres & Prop Rev","Rate Design","Exh 2","Adder Schedule","ERM","ROR","Bill Determ","Bill Impact","WA Sch 25","Lighting summary","St Lts","Area Lts","Capital Recovery Factor Calc","Block Data","Rev Runs 12MESEPT2014"],"not_rendered":{"charts":0,"images":0,"macros":1,"external_links":1,"defined_names":42,"comments":7,"pivot_tables":0},"unopened":[],"bounds":{"document_bytes":16777216,"sheet_cells":100000,"rows_first":2000,"rows_last":500,"rows_between":2000,"halvings":0,"cell_chars":16384,"cell_head_chars":4096},"cells_cut":0,"cells_raw":0,"read":"whole","date_system":"1900"}

{"sheet":"Page 1","index":0,"n_rows":56,"n_cols":24,"rows_kept":56,"cut":false,"hidden":false,"merged":[[4,0,4,15],[0,18,2,19],[0,0,0,15],[1,0,1,15],[2,0,2,15],[3,0,3,15]]}
["AVISTA UTILITIES",null,null,null,null,null,null,null,null,null,null,null,null,null,null,null,null,null,"This worksheet pulls data from 'Pres & Prop Rev' tab."]
["WASHINGTON ELECTRIC"]
["PROPOSED INCREASE BY SERVICE SCHEDULE"]
["12 MONTHS ENDED SEPTEMBER 30, 2014"]
["(000s of Dollars)"]
[]
[]
[null,null,null,"Base Tariff",null,"Base Tariff","Base","Total Billed",null,null,null,"Percent",null,null,null,"Percent ",null,null,null,"Percent ","Total Billed"]
{"$rows_left_out":49}
{"sheet":"Page 2","index":1,"n_rows":61,"n_cols":21,"rows_kept":61,"cut":false,"hidden":false,"merged":[[8,0,8,2]]}
["AVISTA UTILITIES",null,null,null,null,null,null,null,null,null,null,null,null,null,null,null,"This worksheet uses Base & Billing rates from 'Rate Design' tab."]
["WASHINGTON ELECTRIC"]
["PRESENT AND PROPOSED RATE COMPONENTS BY SCHEDULE"]
[]
[]
[]
[null,null,null,null,null,null,null,"General ","Sch. 92","Sch. 93","Proposed ","Proposed ","Sch. 98","Sch. 93/94","Proposed Billing"]
[null,null,null,"Base Tariff","Present","Present ",null,"Rate ","LIRAP Revenue","PCRA","Billing ","Base Tariff","REC Revenue","ERM/BPA","Rate With"]
{"$rows_left_out":54}
{"sheet":"Pres & Prop Rev","index":2,"n_rows":302,"n_cols":16,"rows_kept":302,"cut":false,"hidden":false,"merged":[[5,15,10,17],[94,1,95,7]]}
[]
[null,{"$f":"IF(Base1_Billing2=2,\"BILLED\",\"\")","v":""}]
[]
["WORK PAPER",null," ","RESIDENTIAL","GENERAL SVC. ","LG. GEN. SVC.","EX LG GEN SVC","PUMPING","ST & AREA LTG"]
["REFERENCE",null,"TOTAL","SCHEDULE 1","SCH. 11,12","SCH. 21,22","SCHEDULE 25","SCH. 30, 31, 32","SCH. 41-48",null,null,null,null,null,null,"Print Header for all printed pages on this worksheet:"]
[null,"PRESENT BILL DETERMINANTS",null,null,null,null,null,null,null,null,null,"Calculate all revenue exhibits using  ____ rates:",null,null,null,{"$f":"\"AVISTA UTILITIES\nWASHINGTON ELECTRIC\nPRO FORMA REVENUE UNDER PRESENT AND PROPOSED \"&N9&\" RATES\n12 MONTHS ENDED SEPTEMBER 30, 2014\"","v":"AVISTA UTILITIES\nWASHINGTON ELECTRIC\nPRO FORMA REVENUE UNDER PRESENT AND PROPOSED BASE TARIFF RATES\n12 MONTHS ENDED SEPTEMBER 30, 2014"}]
[null,"KILOWATT HOURS (KWHS)",null,null,null,null,null,null,null,null,"1)","BASE TARIFF"]
["PDE-E-10","BLOCK 1",null,{"$f":"'Bill Determ'!$B$9","v":1562090323.9480615},{"$f":"'Bill Determ'!$B$17","v":411760124.95869529},{"$f":"'Bill Determ'!$B$28","v":1262061453.0310712},{"$f":"'Bill Determ'!$B$37","v":126000000},{"$f":"SUM('Bill Determ'!$B$41:$C$41)","v":51176200.546248734},null,null,null,"or",null,1]
{"$rows_left_out":295}
{"sheet":"Rate Design","index":3,"n_rows":127,"n_cols":23,"rows_kept":127,"cut":false,"hidden":false,"merged":[]}
["PRESENT RATES",null,null,1,2,3,4,5,6,null,null,null,null,"Tiers - used for bill comparisons"]
[null,null,"TOTAL","SCH. 1","SCH. 11,12","SCH. 21,22","SCH. 25","SCH. 30, 31, 32",null,null,null,"Range Name",null,"SCHEDULE 1","SCH. 11,12","SCH. 21,22","SCHEDULE 25","SCH. 30, 31, 32"]
[null,"Base Tariff Rates"]
[1,"BASIC CHARGE",null,8.5,18,0,0,18]
[2,"BLOCK 1 PER KWH",null,7.39,11.292999999999999,7.0890000000000004,5.5049999999999999,9.5459999999999994,null,null,null,null,null,800,3650,250000,500000]
[3,"BLOCK 2 PER KWH",null,8.5980000000000008,8.298,6.34,4.9530000000000003,6.8179999999999996,null,null,null,null,null,1500,9999999,9999999,9999999]
[4,"BLOCK 3 PER KWH",null,10.08,0,0,4.2350000000000003,0,null,null,null,"Rates_Base_Present",null,9999999,9999999,9999999,9999999]
[5,"BLOCK 4 PER KWH"]
{"$rows_left_out":120}
{"sheet":"Exh 2","index":4,"n_rows":20,"n_cols":12,"rows_kept":20,"cut":false,"hidden":true,"merged":[]}
["AVISTA UTILITIES",null,null,null,null,null,null,null,null,null,null,"This worksheet pulls data from 'ROR' tab."]
["WASHINGTON ELECTRIC"]
["PRESENT & PROPOSED RATES OF RETURN BY RATE SCHEDULE"]
["12 MONTHS ENDED SEPTEMBER 30, 2014"]
[]
[]
[]
[]
{"$rows_left_out":13}
{"sheet":"Adder Schedule","index":5,"n_rows":37,"n_cols":8,"rows_kept":37,"cut":false,"hidden":true,"merged":[[0,0,0,7],[1,0,1,7],[2,0,2,7],[3,0,3,7],[4,0,4,7]]}
["AVISTA UTILITIES"]
["WASHINGTON ELECTRIC"]
["PROPOSED REC REVENUE DECREASE BY SERVICE SCHEDULE"]
["12 MONTHS ENDED JUNE 30, 2013"]
["(000s of Dollars)"]
[]
[]
[]
{"$rows_left_out":30}
{"sheet":"ERM","index":6,"n_rows":20,"n_cols":6,"rows_kept":20,"cut":false,"hidden":false,"merged":[]}
[]
[]
[null,null,null,null,"Present","Present "]
[null,"Type of","Schedule","Billing","ERM","ERM"]
[null,"Service","Number","Determinants","Rate","Revenue"]
[null,"(a)","(b)","(c)","(d)","(e)"]
[]
[null,"Residential",1,{"$f":"'Pres & Prop Rev'!D23","v":2378478031},-1.49E-3,{"$f":"D8*E8","v":-3543932.2661899999}]
{"$rows_left_out":13}
{"sheet":"ROR","index":7,"n_rows":83,"n_cols":11,"rows_kept":83,"cut":false,"hidden":false,"merged":[]}
[null,"AVISTA UTILITIES"]
[null,"WASHINGTON ELECTRIC"]
[null,"PRESENT & PROPOSED RATE OF RETURN BY RATE SCHEDULE"]
[null,"12 MONTHS ENDED SEPTEMBER 30, 2014"]
[]
[]
[null,null,"Total","Sch 1","Sch 11","Sch 21","Sch 25","Sch 31","Schs 41-48"]
[null,"Total Rate Base",{"$f":"SUM(D8:I8)","v":1464296000},720595927,165553693,344478226,167975026,35523080,30170048,"from COS"]
{"$rows_left_out":76}
{"sheet":"Bill Determ","index":8,"n_rows":85,"n_cols":7,"rows_kept":85,"cut":false,"hidden":false,"merged":[]}
["AVISTA UTILITIES"]
["WASHINGTON ELECTRIC"]
["ACTUAL / PRO FORMA BILLING DETERMINANTS BY RATE SCHEDULE"]
["12 MONTHS ENDED SEPTEMBER 30, 2014"]
[]
[]
[]
["Schedule 1","0-800 kwhs","801-1500 kwhs","over 1500 kwhs","Total kwhs","Total Billings(2)"]
{"$rows_left_out":78}
{"sheet":"Bill Impact","index":9,"n_rows":24,"n_cols":13,"rows_kept":24,"cut":false,"hidden":false,"merged":[]}
[]
[]
["Schedule 001 Bill Impact"]
[]
[]
[]
["Schedule 001 Present",null,null,null,null,null,"Schedule 001 Proposed"]
[null,"Basic Charge","Block 1","Block 2","Total Bill",null,"Basic Charge","Block 1","Block 2","Total Bill",null,"Bill Impact","% Change"]
{"$rows_left_out":17}
{"sheet":"WA Sch 25","index":10,"n_rows":194,"n_cols":19,"rows_kept":194,"cut":false,"hidden":false,"merged":[]}
["Washington Schedule 25 Billing Determinants",null,null,null,null,null,null,null,null,null,null,null,null,null,null,null,"1st",{"$f":"Q2","v":500000},{"$f":"R2","v":6000000}]
[null,null,null,null,null,null,null,null,null,null,null,null,null,null,null,"12-mo Ended",500000,6000000,99999999]
["KWHs",null,"Acct No.","2013-10-01","2013-11-01","2013-12-01","2014-01-01","2014-02-01","2014-03-01","2014-04-01","2014-05-01","2014-06-01","2014-07-01","2014-08-01","2014-09-01","Total","kwhs/mo","kwhs/mo","kwhs/mo"]
[1,"BF Goodrich",770037736,4298263,4939355,5252512,5003666,5142014,5585572,5291105,5742085,5130640,5548221,5068140,5737595,{"$f":"SUM(D4:O4)","v":62739168},{"$f":"Q$2*12-SUMPRODUCT(--($D4:$O4<=Q$2),Q$2-$D4:$O4)","v":6000000},{"$f":"R$2*12-SUM($Q4:Q4)-SUMPRODUCT(--($D4:$O4<=R$2),R$2-$D4:$O4)","v":56739168},{"$f":"S$2*12-SUM($Q4:R4)-SUMPRODUCT(--($D4:$O4<=S$2),S$2-$D4:$O4)","v":0}]
[2,"Boise Cascade Plywood",500017,3441942,3185935,2807255,3022123,3149362,3389341,3302817,3245936,3132003,3212152,3276412,3177657,38342935,{"$f":"Q$2*12-SUMPRODUCT(--($D5:$O5<=Q$2),Q$2-$D5:$O5)","v":6000000},{"$f":"R$2*12-SUM($Q5:Q5)-SUMPRODUCT(--($D5:$O5<=R$2),R$2-$D5:$O5)","v":32342935},{"$f":"S$2*12-SUM($Q5:R5)-SUMPRODUCT(--($D5:$O5<=S$2),S$2-$D5:$O5)","v":0}]
[3,"Boise Cascade Sawmill",500018,1490478,1344666,1427467,1507426,1391380,1468131,1414812,1343626,1285155,1389185,1377793,1340464,16780583,6000000,{"$f":"R$2*12-SUM($Q6:Q6)-SUMPRODUCT(--($D6:$O6<=R$2),R$2-$D6:$O6)","v":10780583},{"$f":"S$2*12-SUM($Q6:R6)-SUMPRODUCT(--($D6:$O6<=S$2),S$2-$D6:$O6)","v":0}]
[4,"City of Spokane Sewage Treatment Plt",1900002,1326433,1407945,1520566,1454695,1321418,1451591,1336505,1377450,1353208,1410226,1356961,1323317,16640315,6000000,{"$f":"R$2*12-SUM($Q7:Q7)-SUMPRODUCT(--($D7:$O7<=R$2),R$2-$D7:$O7)","v":10640315},{"$f":"S$2*12-SUM($Q7:R7)-SUMPRODUCT(--($D7:$O7<=S$2),S$2-$D7:$O7)","v":0}]
[5,"Deaconess Medical Center",1900011,1741083,1670632,1757337,1799152,1605608,1731135,1677375,1860709,1865157,2247046,2168542,1851413,21975189,6000000,{"$f":"R$2*12-SUM($Q8:Q8)-SUMPRODUCT(--($D8:$O8<=R$2),R$2-$D8:$O8)","v":15975189},{"$f":"S$2*12-SUM($Q8:R8)-SUMPRODUCT(--($D8:$O8<=S$2),S$2-$D8:$O8)","v":0}]
{"$rows_left_out":187}
{"sheet":"Lighting summary","index":11,"n_rows":44,"n_cols":16,"rows_kept":44,"cut":false,"hidden":false,"merged":[[6,2,6,3],[6,5,6,6]]}
[null,"AVISTA UTILITIES"]
[null,"WASHINGTON ELECTRIC"]
[null,"STREET & AREA LIGHT REVENUE UNDER PRESENT & PROPOSED RATES"]
[null,"12 MONTHS ENDED SEPTEMBER 30, 2014"]
[]
[]
[null,null,{"$f":"\"Present \"&IF(Base1_Billing2=2,\"Billing \",\"\")&\"Rates(1)\"","v":"Present Rates(1)"},{"$f":"\"Present \"&IF(Base1_Billing2=2,\"Billing\",\"\")&\" Rates\"","v":"Present  Rates"},null,{"$f":"\"Proposed \"&IF(Base1_Billing2=2,\"Billing \",\"\")&\"Rates(2)\"","v":"Proposed Rates(2)"},{"$f":"\"Proposed \"&IF(Base1_Billing2=2,\"Billing \",\"\")&\"Rates\"","v":"Proposed Rates"},null,"% Revenue Change"]
[null,null,"Monthly ","Annual",null,"Monthly ","Annual",null,null,null,null,"Target Base",null,"Annual","Present","Proposed"]
{"$rows_left_out":37}
{"sheet":"St Lts","index":12,"n_rows":101,"n_cols":74,"rows_kept":101,"cut":false,"hidden":false,"merged":[]}
["Street Light Summary",null,null,null,null,null,null,null,"WASHINGTON Street Lights",null,null,null,null,null,null,null,null,null,null,null,null,null,null,null,null,null,null,null,null,null,null,null,null,null,null,"% rate increase -->",{"$f":"'Lighting summary'!L11","v":0},{"$f":"'Lighting summary'!L12","v":0},{"$f":"'Lighting summary'!L13","v":0},{"$f":"'Lighting summary'!L14","v":0},{"$f":"'Lighting summary'!L15","v":0},null,null,null,null,null,null,null,null,null,null,null,null,null,null,{"$f":"-0.00105","v":-1.0499999999999999E-3},"compare input Present Billing Rates to calculated Present Billing Rates",null,null,null,null,null,null,{"$f":"BE2","v":1.0121}]
["DWWPAOAE Report, as of 10/22/14",null,null,null,null,null,null,null,null,null,null,null,"Number of Lights(1)",null,null,null,null,null,"Present Rates",null,null,null,null,null,"Monthly Revenue at Present Rates",null,null,null,null,null,"Number of Lights",null,null,null,null,null,"Proposed Rates",null,null,null,null,null,"Monthly Revenue at Proposed Rates",null,null,null,null,null,null,"Present Billing Rates",null,null,null,null,null,{"$f":"-0.00458","v":-4.5799999999999999E-3},{"$f":"1+'Lighting summary'!I39","v":1.0121},"Sch 91 & 93",null,null,null,null,null,"New Billing Rates",null,null,null,null,null,"Increase"]
[null,null,null,null,null,null,null,null,"Fixture Type","Pole Facility","Size","Sched","041","042","044","045","046",null,"041","042","044","045","046",null,"041","042","044","045","046",null,"041","042","044","045","046",null,"041","042","044","045","046",null,"041","042","044","045","046",null,"kwh","041","042","044","045","046",null,"Sch 93/94","041","042","044","045","046",null,null,"041","042","044","045","046",null,"041","042","044","045","046"]
[null,null,null,null,null,null,null,null,"Single Mercury Vapor","Direct Burial",4000,214,{"$f":"SUMIF($G:$G,TEXT(M$3,\"000\")&TEXT($L4,\"000\"),$E:$E)","v":75},0,0,0,0,null,13.99,0,0,0,0,null,{"$f":"IF(AND(M4<>0,S4=0),#VALUE!,M4*S4)","v":1049.25},{"$f":"IF(AND(N4<>0,T4=0),#VALUE!,N4*T4)","v":0},{"$f":"IF(AND(O4<>0,U4=0),#VALUE!,O4*U4)","v":0},{"$f":"IF(AND(P4<>0,V4=0),#VALUE!,P4*V4)","v":0},{"$f":"IF(AND(Q4<>0,W4=0),#VALUE!,Q4*W4)","v":0},null,{"$f":"M4","v":75},{"$f":"N4","v":0},0,0,0,null,{"$f":"ROUND(S4*(1+AK$1),2)","v":13.99},0,0,0,0,null,{"$f":"IF(AND(AE4<>0,AK4=0),#VALUE!,AE4*AK4)","v":1049.25},{"$f":"IF(AND(AF4<>0,AL4=0),#VALUE!,AF4*AL4)","v":0},{"$f":"IF(AND(AG4<>0,AM4=0),#VALUE!,AG4*AM4)","v":0},{"$f":"IF(AND(AH4<>0,AN4=0),#VALUE!,AH4*AN4)","v":0},{"$f":"IF(AND(AI4<>0,AO4=0),#VALUE!,AI4*AO4)","v":0},{"$f":"SUM(AQ4:AU4)-SUM(Y4:AC4)","v":0},42,14.58,null,null,null,null,null,{"$f":"ROUND(AW4*$BD$2,2)+ROUND(AW4*$BD$1,2)","v":-0.23},{"$f":"ROUND((S4*$BE$2)+$BD4-AX4,2)","v":-0.65},null,null,null,null,null,null,{"$f":"AK4*$BL$1","v":14.159279},{"$f":"AL4*$BL$1","v":0},0,0,0,null,{"$f":"BL4-AX4","v":-0.42072100000000034},{"$f":"BM4-AY4","v":0},{"$f":"BN4-AZ4","v":0},{"$f":"BO4-BA4","v":0},{"$f":"BP4-BB4","v":0}]
[null,"State","Sched","Rate Sub","# of Lights",null,null,null,"Single High-Pressure Sodium Vapor","Direct Burial","50W",234,0,129,0,0,0,null,0,13.14,0,0,0,null,{"$f":"IF(AND(M5<>0,S5=0),#VALUE!,M5*S5)","v":0},{"$f":"IF(AND(N5<>0,T5=0),#VALUE!,N5*T5)","v":1695.0600000000002},{"$f":"IF(AND(O5<>0,U5=0),#VALUE!,O5*U5)","v":0},{"$f":"IF(AND(P5<>0,V5=0),#VALUE!,P5*V5)","v":0},{"$f":"IF(AND(Q5<>0,W5=0),#VALUE!,Q5*W5)","v":0},null,{"$f":"M5","v":0},129,0,0,0,null,0,13.14,0,0,0,null,{"$f":"IF(AND(AE5<>0,AK5=0),#VALUE!,AE5*AK5)","v":0},{"$f":"IF(AND(AF5<>0,AL5=0),#VALUE!,AF5*AL5)","v":1695.0600000000002},0,0,0,{"$f":"SUM(AQ5:AU5)-SUM(Y5:AC5)","v":0},20,null,13.79,null,null,null,null,-0.11,null,{"$f":"ROUND((T5*$BE$2)+$BD5-AY5,2)","v":-0.6},null,null,null,null,null,{"$f":"AK5*$BL$1","v":0},{"$f":"AL5*$BL$1","v":13.298994},{"$f":"AM5*$BL$1","v":0},{"$f":"AN5*$BL$1","v":0},{"$f":"AO5*$BL$1","v":0},null,{"$f":"BL5-AX5","v":0},{"$f":"BM5-AY5","v":-0.49100599999999872},{"$f":"BN5-AZ5","v":0},{"$f":"BO5-BA5","v":0},{"$f":"BP5-BB5","v":0}]
[null,null,null,null,null,null,null,null,"High-Pressure Sodium Vapor","Dusk to Dawn","70W",335,0,0,0,0,41,null,0,0,0,0,3.38,null,0,0,0,0,138.57999999999998,null,0,0,0,0,41,null,0,0,0,0,3.38,null,0,0,0,0,138.57999999999998,0,25,null,null,null,null,3.44,null,-0.14000000000000001,null,null,null,null,-0.16,null,null,0,0,0,0,3.4208979999999998,null,0,0,0,0,-1.9102000000000174E-2]
[null,2,"041",214,{"$f":"75","v":75},null,{"$f":"IF(OR(ISBLANK(C7),ISBLANK(D7)),\"\",TEXT(C7,\"000\")&TEXT(D7,\"000\"))","v":"041214"},null,"Single Mercury Vapor","Wood Pole",7000,411,32,0,0,0,0,null,15.17,0,0,0,0,null,485.44,0,0,0,0,null,32,0,0,0,0,null,15.17,0,0,0,0,null,485.44,0,0,0,0,0,80,15.6,null,null,null,null,null,-0.45,{"$f":"ROUND((S7*$BE$2)+$BD7-AX7,2)","v":-0.7},null,null,null,null,null,null,15.353557,0,0,0,0,null,-0.2464429999999993,0,0,0,0]
[null,2,"041",411,32,null,"041411",null,"Mercury Vapor","Dusk to Dawn",7000,415,0,0,0,73,0,null,0,0,0,6.66,0,null,0,0,0,486.18,0,null,0,0,0,73,0,null,0,0,0,6.66,0,null,0,0,0,486.18,0,0,80,null,null,null,6.6,null,null,-0.45,null,null,null,-0.31,null,null,null,0,0,0,6.7405860000000004,0,null,0,0,0,0.14058600000000077,0]
{"$rows_left_out":94}
{"sheet":"Area Lts","index":13,"n_rows":65,"n_cols":49,"rows_kept":65,"cut":false,"hidden":false,"merged":[]}
["Area Light Summary",null,null,null,null,null,null,null,"WASHINGTON Area Lights",null,null,null,null,null,null,null,null,null,"Monthly Rev.",null,null,null,null,null,null,{"$f":"SL_RateIncr","v":0},null,null,"% rate increase -->",{"$f":"'Lighting summary'!L16","v":0},null,null,"Monthly Rev.",null,null,-2.7E-4,{"$f":"-0.00458","v":-4.5799999999999999E-3},{"$f":"-0.00105","v":-1.0499999999999999E-3},null,null,null,"compare input Present Billing Rates to calculated Present Billing Rates"]
["DWWPWMS.AREA_LIGHT_ASMBLY1, as of 10/22/14",null,null,null,null,null,null,null,null,null,null,null,"# of Lights(1)",null,null,"Pres. Rates",null,null,"at Pres. Rates",null,null,"# of Lights(1)",null,null,null,null,"# of Lights",null,null,"Prop. Rates",null,null,"at Prop. Rates",null,null,null,"Pres. Billing Rates",null,null,null,null,{"$f":"'St Lts'!BE2","v":1.0121},{"$f":"'St Lts'!BF2","v":"Sch 91 & 93"},null,"New Billing Rates",null,{"$f":"'Lighting summary'!I39","v":1.21E-2},"Increase"]
[null,null,null,null,null,null,null,null,"Fixture Type","Pole Facility","Size","Sched","047","048",null,"047","048",null,"047","048",null,"047","048",null,null,null,"047","048",null,"047","048",null,"047","048",null,"kwh","047","048","Sch 59","Sch 93","Sch 94","047","048",null,"047","048",null,"047","048"]
[null,null,null,null,null,null,null,"Monthly","Sodium Vapor","Granville w/16' decorative pole","100W","HAG",{"$f":"SUMIF($G:$G,TEXT(M$3,\"000\")&TEXT($L4,\"000\"),$E:$E)","v":0},0,null,29.35,{"$f":"P4","v":29.35},null,{"$f":"IF(AND(M4<>0,P4=0),#VALUE!,M4*P4)","v":0},{"$f":"IF(AND(N4<>0,Q4=0),#VALUE!,N4*Q4)","v":0},null,{"$f":"SUMIF($G:$G,TEXT(V$3,\"000\")&TEXT($L4,\"000\"),$E:$E)","v":0},0,null,null,null,{"$f":"M4","v":0},{"$f":"N4","v":0},null,{"$f":"ROUND(P4*(1+AD$1),2)","v":29.35},{"$f":"AD4","v":29.35},null,{"$f":"IF(AND(AA4<>0,AD4=0),#VALUE!,AA4*AD4)","v":0},{"$f":"IF(AND(AB4<>0,AE4=0),#VALUE!,AB4*AE4)","v":0},null,40,30.84,30.72,{"$f":"ROUND($AJ$1*$AJ4,2)","v":-0.01},{"$f":"ROUND($AK$1*$AJ4,2)","v":-0.18},{"$f":"ROUND($AL$1*$AJ4,2)","v":-0.04},{"$f":"ROUND(P4*$AP$2-AK4+AN4+AO4,2)","v":-1.35},{"$f":"ROUND(Q4*$AP$2-AL4+AM4+AN4+AO4,2)","v":-1.24},null,{"$f":"AD4*$AU$2","v":0.35513500000000003},{"$f":"AE4*$AU$2+AM4","v":0.34513500000000003},null,{"$f":"AS4-AK4","v":-30.484864999999999},{"$f":"AT4-AL4","v":-30.374865}]
[null,"State","Sched","Rate Sub","# of Lights",null,null,"kWh's","Sodium Vapor","Floodlight on existing standard","250W","HAH",105,10,null,21.72,{"$f":"P5","v":21.72},null,2280.6,217.2,null,105,10,null,null,null,{"$f":"M5","v":105},10,null,21.72,{"$f":"AD5","v":21.72},null,2280.6,217.2,null,107,22.38,22.05,{"$f":"ROUND($AJ$1*$AJ5,2)","v":-0.03},{"$f":"ROUND($AK$1*$AJ5,2)","v":-0.49},{"$f":"ROUND($AL$1*$AJ5,2)","v":-0.11},{"$f":"ROUND(P5*$AP$2-AK5+AN5+AO5,2)","v":-1},{"$f":"ROUND(Q5*$AP$2-AL5+AM5+AN5+AO5,2)","v":-0.7},null,{"$f":"AD5*$AU$2","v":0.26281199999999999},{"$f":"AE5*$AU$2+AM5","v":0.23281199999999999},null,{"$f":"AS5-AK5","v":-22.117187999999999},{"$f":"AT5-AL5","v":-21.817188000000002}]
[null,null,null,null,null,null,null,null,"Sodium Vapor","Kim light w/25' fiberglass pole","100W","HAI",18,3,null,28.35,28.35,null,510.3,85.050000000000011,null,18,3,null,null,null,18,3,null,28.35,{"$f":"AD6","v":28.35},null,510.3,85.050000000000011,null,40,29.78,29.66,-0.01,-0.18,-0.04,-1.31,-1.2,null,{"$f":"AD6*$AU$2","v":0.34303500000000003},0.33303500000000003,null,-29.436965000000001,-29.326965000000001]
[null,"WA","047","HAH",105,null,{"$f":"IF(OR(ISBLANK(C7),ISBLANK(D7)),\"\",TEXT(C7,\"000\")&TEXT(D7,\"000\"))","v":"047HAH"},{"$f":"E7*AJ5","v":11235},"Sodium Vapor","Post Top w/16' decorative pole","100W","HAP",0,0,null,27.99,27.99,null,0,0,null,0,0,null,null,null,0,0,null,27.99,27.99,null,0,0,null,40,29.4,29.28,-0.01,-0.18,-0.04,-1.29,-1.18,null,0.33867899999999995,0.32867899999999994,null,-29.061321,-28.951321]
[null,"WA","047","HAI",18,null,{"$f":"IF(OR(ISBLANK(C8),ISBLANK(D8)),\"\",TEXT(C8,\"000\")&TEXT(D8,\"000\"))","v":"047HAI"},{"$f":"E8*AJ6","v":720},"Sodium Vapor","on existing standard","100W","HPA",635,950,null,13.46,13.46,null,8547.1,12787,null,635,950,null,null,null,635,950,null,13.46,13.46,null,8547.1,12787,null,40,14.03,13.91,-0.01,-0.18,-0.04,{"$f":"ROUND(P8*$AP$2,2)-AK8+AN8+AO8","v":-0.63000000000000012},-0.52,null,0.16286600000000001,0.152866,null,-13.867134,-13.757134000000001]
{"$rows_left_out":58}
{"sheet":"Capital Recovery Factor Calc","index":14,"n_rows":40,"n_cols":17,"rows_kept":40,"cut":false,"hidden":false,"merged":[[29,12,29,15]]}
[]
[]
[]
[]
["Avista",null,null,null,null,"Avista",null,null,null,null,null,null,"Avista"]
["Capital Recovery Factor Calculation",null,null,null,null,"Capital Recovery Factor Calculation",null,null,null,null,null,null,"Capital Recovery Factor Calculation"]
["Present - UE-120436",null,null,null,null,"Proposed - UE-150204",null,null,null,null,null,null,"Present - UE-140188"]
[]
{"$rows_left_out":33}
{"sheet":"Block Data","index":15,"n_rows":101,"n_cols":21,"rows_kept":101,"cut":false,"hidden":false,"merged":[]}
[]
[null,null,null,null,null,null,null,null,null,null,null,null,null,null,null,null,null,null,null,null,"Rate Design"]
["WASHINGTON ELECTRIC SYSTEM"]
[null,null,"October","November","December","January","February","March","April","May","June","July","August","September","Annual Total",null,null,null,null,null,"May"]
["Rate Design Program Monthly Results"]
["Block ID 900","Schedule 001"]
[null,"Block 1",125323490,127488013,141275603,144260498,141384451,138518799,128754929,124040417,114284975,117294243,126903830,126213835,{"$f":"SUM(C7:N7)","v":1555743083},null,null,0,{"$f":"R7/$R$10","v":{"$error":"#DIV/0!"}},null,14978538]
[null,"Block 2",33893076,37102573,63168569,72113480,63933665,57894956,38874456,30640801,21598043,27826942,43193601,39264809,{"$f":"SUM(C8:N8)","v":529504971},null,null,0,{"$f":"R8/$R$10","v":{"$error":"#DIV/0!"}},null,3538501]
{"$rows_left_out":94}
{"sheet":"Rev Runs 12MESEPT2014","index":16,"n_rows":109,"n_cols":19,"rows_kept":109,"cut":false,"hidden":false,"merged":[]}
[]
[]
[]
[null,"Electric Revenue Meters Report by Location  Twelve Months Ended  for Report Date : '09/30/2014'"]
[]
[null,"State Cde:WA"]
[]
[null,null,null,"Meters"]
{"$rows_left_out":101}