{"text_format":"1","workbook":"xlsx","n_sheets":15,"sheets":["WA Gas - Sched 162","Rate Impact Summary","Forecast","Sch 146 - Load Forecast","Cost Amtz Calc - Sch 101-146","Ben Amtz Calc - Sch 101","Ben Amtz Calc - Sch 111","Ben Amtz Calc - Sch 112-116","Ben Amtz Calc - Sch 131-132","Ben Amtz Calc - Sch 146","Conversion Factor","Revenue - current rates","DSM Balance","Base Revenue","RCF"],"not_rendered":{"charts":0,"images":0,"macros":0,"external_links":21,"defined_names":182,"comments":2,"pivot_tables":0},"unopened":[],"bounds":{"document_bytes":16777216,"sheet_cells":100000,"rows_first":2000,"rows_last":500,"rows_between":2000,"halvings":0,"cell_chars":16384,"cell_head_chars":4096},"cells_cut":0,"cells_raw":0,"read":"whole","date_system":"1900"}

{"sheet":"WA Gas - Sched 162","index":0,"n_rows":73,"n_cols":23,"rows_kept":73,"cut":false,"hidden":false,"merged":[]}
["Avista Utilities",null,null,null,null,"% of Sch 101 Res:"]
["State of Washington",null,null,null,null,0.17249999999999999]
["Rate Change Summary - Schedule 162"]
[null,null,"CCA Costs?","Yes",null,"Yes",null,"Yes",null,"Yes",null,"Yes",null,"Yes",null,"Yes",null,"Yes",null,"Yes","Yes",null,"Yes"]
[null,null,"CCA Benefits?","Yes",null,"Yes",null,"No",null,"Yes",null,"No",null,"Yes",null,"No",null,"Yes",null,"No","Yes",null,"No"]
[null,null," ","GEN SERVICE",null,"GEN SERVICE",null,"GEN SERVICE",null,"LRG GEN SVC",null,"LRG GEN SVC",null,"LRG GEN SVC",null,"LRG GEN SVC",null,"INTERRUPTIBLE",null,"INTERRUPTIBLE","TRANSPORT",null,"TRANSPORT"]
["Source",null,"TOTAL","SCH. 101 Pre 7/2021",null,"SCH. 101 Res Fixed/Low Income",null,"SCH. 101  Post 7/2021",null,"SCH. 111",null,"SCH. 111 Post 7/21",null,"SCH. 112, 116",null,"SCH. 112, 116 Post 7/21",null,"SCH. 131&132",null," SCH. 131/132\n Post 7/21","SCH. 146",null," SCH. 146\n Post 7/21"]
["SCHEDULE 162 - CCA Costs"]
["Forecast","Total Annual Therms (Subject to Cost)",{"$f":"SUM(D9:W9)","v":220376850.72049859},{"$f":"IF(D4=\"Yes\",SUM(Forecast!C57:N59),0)","v":133751645.87927376},null,"Incl in 101",null,"Incl in 101",null,{"$f":"IF(J4=\"Yes\",SUM(Forecast!$C$60:$N$61),0)","v":61340851.431824826},null,"Incl in 111",null,{"$f":"IF(N4=\"Yes\",SUM(Forecast!$C$62:$N$63),0)","v":137984.55499999999},null,"Incl in 112, 116",null,{"$f":"IF(R4=\"Yes\",SUM(Forecast!$C$64:$N$64),0)","v":2628936.4739999999},null,"Incl in 131/132",{"$f":"IF(U4=\"Yes\",SUM(Forecast!$C$65:$N$66),0)","v":22517432.380399998},null,"Incl in 146"]
[]
{"$rows_left_out":64}
{"sheet":"Rate Impact Summary","index":1,"n_rows":15,"n_cols":9,"rows_kept":15,"cut":false,"hidden":false,"merged":[[6,8,7,8],[6,7,7,7],[6,2,7,2],[6,3,7,3],[2,2,3,2],[2,3,3,3],[2,7,3,7],[2,8,3,8]]}
[]
["Schedule No.","Rate Schedule","# of Customers","Average Monthly Therm Usage to Calculate Impact","Monthly Schedule 162 (CCA Costs) Fee","Monthly Schedule 162 (CCA Benefit) Credit","Total Net Monthly Bill Amount","Annual Net Bill Amount","% Change in Billed Revenue "]
[101,"General Service pre 7/2021 (Apr - Oct)",{"$f":"'WA Gas - Sched 162'!D19","v":140126},{"$f":"Forecast!O57/Forecast!O41/12","v":64.014691824099842},{"$f":"SUM(Forecast!C57:I57)/SUM(Forecast!C41:I41)*'WA Gas - Sched 162'!J22","v":6.3709905993139895},{"$f":"'Ben Amtz Calc - Sch 101'!E36","v":-5.04},{"$f":"(E3+F3)","v":1.3309905993139894},{"$f":"'WA Gas - Sched 162'!D37*12","v":36.72278612794566},{"$f":"'WA Gas - Sched 162'!D43","v":3.2647003526524249E-2}]
[101,"General Service pre 7/2021 (Nov - Mar)",null,null,{"$f":"SUM(Forecast!J57:N57)/SUM(Forecast!J41:N41)*'WA Gas - Sched 162'!J22","v":25.676201092842337},{"$f":"'Ben Amtz Calc - Sch 101'!E50","v":-20.23},{"$f":"(E4+F4)","v":5.4462010928423368}]
[101,"Low-Income Residential",{"$f":"'WA Gas - Sched 162'!F19","v":30005},{"$f":"Forecast!O58/Forecast!O42/12","v":64.079315058140153},{"$f":"'WA Gas - Sched 162'!F22*D5","v":14.429380164791999},{"$f":"'WA Gas - Sched 162'!F35*D5","v":-14.429380164791999},{"$f":"(E5+F5)","v":0},{"$f":"G5*12","v":0},{"$f":"'WA Gas - Sched 162'!F43","v":0}]
[101,"General Service After 7/2021",{"$f":"'WA Gas - Sched 162'!H19","v":3809},{"$f":"Forecast!O59/Forecast!O43/12","v":66.456482966800252},{"$f":"'WA Gas - Sched 162'!H22*D6","v":14.96467083446408},{"$f":"'WA Gas - Sched 162'!H35*D6","v":0},{"$f":"(E6+F6)","v":14.96467083446408},{"$f":"G6*12","v":179.57605001356896},{"$f":"'WA Gas - Sched 162'!H43","v":0.16054340922093788}]
[111,"Large General Service - Firm pre 7/2021 (Apr - Oct)",{"$f":"'WA Gas - Sched 162'!J19","v":3427},{"$f":"Forecast!O60/Forecast!O44/12","v":1460.1588016102576},{"$f":"SUM(Forecast!C60:I60)/SUM(Forecast!C44:I44)*'WA Gas - Sched 162'!J22","v":186.43453310069054},{"$f":"'Ben Amtz Calc - Sch 111'!E36","v":-147.52000000000001},{"$f":"E7+F7","v":38.914533100690534},{"$f":"'WA Gas - Sched 162'!J37*12","v":833.05512154808889},{"$f":"'WA Gas - Sched 162'!J43","v":3.8294120614432305E-2}]
[111,"Large General Service - Firm pre 7/2021 (Nov - mar)",null,null,{"$f":"SUM(Forecast!J60:N60)/SUM(Forecast!J44:N44)*'WA Gas - Sched 162'!J22","v":528.1081951308679},{"$f":"'Ben Amtz Calc - Sch 111'!E50","v":-416.16},111.94819513086787]
[111,"Large General Service - Firm after 7/2021",{"$f":"'WA Gas - Sched 162'!L19","v":73},{"$f":"Forecast!O61/Forecast!O45/12","v":1480.1609769747809},{"$f":"'WA Gas - Sched 162'!L37","v":328.87459346234078},{"$f":"'WA Gas - Sched 162'!L35","v":0},{"$f":"E9+F9","v":328.87459346234078},{"$f":"G9*12","v":3946.4951215480896},{"$f":"'WA Gas - Sched 162'!L43","v":0.18134903444470432}]
["112/116","Large General Service - Firm (Former Transport) pre 7/2021",{"$f":"'WA Gas - Sched 162'!N19","v":0},"n/a",{"$f":"'WA Gas - Sched 162'!N22*'WA Gas - Sched 162'!N9/12","v":2589.2801745749998},"n/a","n/a","n/a","n/a"]
{"$rows_left_out":6}
{"sheet":"Forecast","index":2,"n_rows":69,"n_cols":15,"rows_kept":69,"cut":false,"hidden":false,"merged":[]}
["Avista Utilities"]
["State of Washington"]
["Forecasted Billing Determ - Schedule 162"]
[null,null,"2024-04-30",{"$f":"EOMONTH(C4,1)","v":"2024-05-31"},{"$f":"EOMONTH(D4,1)","v":"2024-06-30"},{"$f":"EOMONTH(E4,1)","v":"2024-07-31"},{"$f":"EOMONTH(F4,1)","v":"2024-08-31"},{"$f":"EOMONTH(G4,1)","v":"2024-09-30"},{"$f":"EOMONTH(H4,1)","v":"2024-10-31"},{"$f":"EOMONTH(I4,1)","v":"2024-11-30"},{"$f":"EOMONTH(J4,1)","v":"2024-12-31"},{"$f":"EOMONTH(K4,1)","v":"2025-01-31"},{"$f":"EOMONTH(L4,1)","v":"2025-02-28"},{"$f":"EOMONTH(M4,1)","v":"2025-03-31"}]
[null,"Loads by Schedule"]
[null,"Total"]
[null,"WA101",9499682.7239622697,5016514.4672501832,3135852.5097496635,2272841.1016540774,2316389.9863451943,3415987.8876927826,8775642.8846403863,16621413.948530352,25026063.172614612,22656909.175218843,19849602.889217008,15164745.132398369]
[null,"WA111",4348827.3615205763,2709142.8793267882,2087159.7133220758,1746817.7686037498,1922964.2557926795,2425888.2833625982,5048312.1238102727,7775814.0376365269,9889776.0357673876,9069853.3055666778,7924640.9734425247,6391654.6936729671]
[null,"WA112",43.2,13047.877,14626.32,13714.83,5963.5280000000002,30861.5,48088,11639.3,0,0,0,0]
[null,"WA121",0,0,0,0,0,0,0,0,0,0,0,0]
{"$rows_left_out":60}
{"sheet":"Sch 146 - Load Forecast","index":3,"n_rows":15,"n_cols":24,"rows_kept":15,"cut":false,"hidden":false,"merged":[]}
["Avista Utilities"]
["State of Washington"]
["Forecasted Schedule 146 Billing Determ - Schedule 162 (from current GRC loads)"]
[]
[null,"Washington Gas Billing Determinants by Customer"]
[]
[null,"ANNUAL USAGE, Sch 146"]
[null,"Washington","2024-04-30",{"$f":"EOMONTH(C8,1)","v":"2024-05-31"},{"$f":"EOMONTH(D8,1)","v":"2024-06-30"},"2024-07-31","2024-08-31","2024-09-30","2024-10-31","2024-11-30","2024-12-31","2025-01-31","2025-02-28","2025-03-31","Total"]
[null,"Forecasted Load",2878601.3785999999,2520984.7999999998,2231816.3220000002,2063729.855,1976312.05,1902718.0471999999,2051878.6868,2488242.1568,2909124.6264,3060969.412,3209173.8615999999,2996149.1839999999,{"$f":"SUM(C9:N9)","v":30289700.380400006}]
[null,"Less Exempt Schedule 146 Customer",679458,634483,556982,690859,624231,603399,632717,622416,744303,526285,758355,698780,{"$f":"SUM(C10:N10)","v":7772268},null,{"$f":"Q$7*12-SUMPRODUCT(--($G10:$N10<=Q$7),Q$7-$G10:$N10)","v":0},{"$f":"R$7*12-SUM($Q10:Q10)-SUMPRODUCT(--($G10:$N10<=R$7),R$7-$G10:$N10)","v":0},{"$f":"S$7*12-SUM($Q10:R10)-SUMPRODUCT(--($G10:$N10<=S$7),S$7-$G10:$N10)","v":0},{"$f":"T$7*12-SUM($Q10:S10)-SUMPRODUCT(--($G10:$N10<=T$7),T$7-$G10:$N10)","v":0},{"$f":"U$7*12-SUM($Q10:T10)-SUMPRODUCT(--($G10:$N10<=U$7),U$7-$G10:$N10)","v":0},null,{"$f":"IF(O10<250000,(250000-O10)*[20]RD!$E$56,0)","v":0},{"$f":"IF(O10<250000,(250000-O10)*[20]RD!$K$56,0)","v":0}]
{"$rows_left_out":6}
{"sheet":"Cost Amtz Calc - Sch 101-146","index":4,"n_rows":29,"n_cols":6,"rows_kept":29,"cut":false,"hidden":false,"merged":[[5,1,5,6],[7,2,7,5]]}
["Avista Utilities"]
["State of Washington",null,null,null,"RCF",{"$f":"'Conversion Factor'!E28","v":1.045717}]
["Development of Amortization Rate"]
[]
[]
[null,"AMORTIZATION RATE CALCULATION"]
[]
[null,null,"Schedule 101-146  - Costs to All Customers"]
[null,null,"Customers","Amortization & Deferral","Interest","Balance"]
[null,null,null,null,4.8000000000000001E-2]
{"$rows_left_out":20}
{"sheet":"Ben Amtz Calc - Sch 101","index":5,"n_rows":50,"n_cols":16,"rows_kept":50,"cut":false,"hidden":false,"merged":[[17,1,17,6],[19,2,19,5]]}
["Avista Utilities"]
["State of Washington",null,null,null,"RCF",{"$f":"'Conversion Factor'!E28","v":1.045717}]
["Development of Amortization Rate"]
[]
[null,null,null,"2024-04-30",{"$f":"EOMONTH(D5,1)","v":"2024-05-31"},"2024-06-30","2024-07-31","2024-08-31","2024-09-30","2024-10-31","2024-11-30","2024-12-31","2025-01-31","2025-02-28","2025-03-31","Total"]
[null,null,"WA101",{"$f":"Forecast!C57","v":7661241.2774384357},{"$f":"Forecast!D57","v":4051737.0102401152},{"$f":"Forecast!E57","v":2531550.661005273},{"$f":"Forecast!F57","v":1834269.5949953934},{"$f":"Forecast!G57","v":1866910.5475179574},{"$f":"Forecast!H57","v":2754860.7030943856},{"$f":"Forecast!I57","v":7051447.9519627849},{"$f":"Forecast!J57","v":13373766.757822603},{"$f":"Forecast!K57","v":20054748.399876595},{"$f":"Forecast!L57","v":18253402.260226235},{"$f":"Forecast!M57","v":15991159.101265227},{"$f":"Forecast!N57","v":12216539.352844222},{"$f":"SUM(D6:O6)","v":107641633.61828922}]
[]
[null,null,null,"Volumes","% of Annual"]
[null,null,"Apr- Oct",{"$f":"SUM(D6:J6)","v":27752017.746254347},{"$f":"D9/$D$11","v":0.25781862290074947}]
[null,null,"Nov - Mar",{"$f":"SUM(K6:O6)","v":79889615.872034878},{"$f":"D10/$D$11","v":0.74218137709925047}]
{"$rows_left_out":41}
{"sheet":"Ben Amtz Calc - Sch 111","index":6,"n_rows":50,"n_cols":16,"rows_kept":50,"cut":false,"hidden":false,"merged":[[17,1,17,6],[19,2,19,5]]}
["Avista Utilities"]
["State of Washington",null,null,null,"RCF",{"$f":"'Conversion Factor'!E28","v":1.045717}]
["Development of Amortization Rate"]
[]
[null,null,null,"2024-04-30",{"$f":"EOMONTH(D5,1)","v":"2024-05-31"},"2024-06-30","2024-07-31","2024-08-31","2024-09-30","2024-10-31","2024-11-30","2024-12-31","2025-01-31","2025-02-28","2025-03-31","Total"]
[null,null,"WA111",{"$f":"Forecast!C60","v":4256901.9835784268},{"$f":"Forecast!D60","v":2651877.1011344986},{"$f":"Forecast!E60","v":2043041.3960095958},{"$f":"Forecast!F60","v":1709893.5887671846},{"$f":"Forecast!G60","v":1882316.6969709429},{"$f":"Forecast!H60","v":2374609.9320381242},{"$f":"Forecast!I60","v":4941601.0586488061},{"$f":"Forecast!J60","v":7611449.1215807013},{"$f":"Forecast!K60","v":9680726.2565337401},{"$f":"Forecast!L60","v":8878135.0275841411},{"$f":"Forecast!M60","v":7757130.1582316784},{"$f":"Forecast!N60","v":6256548.0949170766},{"$f":"SUM(D6:O6)","v":60044230.415994912}]
[]
[null,null,null,"Volumes","% of Annual"]
[null,null,"Apr- Oct",{"$f":"SUM(D6:J6)","v":19860241.75714758},{"$f":"D9/$D$11","v":0.33076020159727287}]
[null,null,"Nov - Mar",{"$f":"SUM(K6:O6)","v":40183988.658847332},{"$f":"D10/$D$11","v":0.66923979840272718}]
{"$rows_left_out":41}
{"sheet":"Ben Amtz Calc - Sch 112-116","index":7,"n_rows":29,"n_cols":6,"rows_kept":29,"cut":false,"hidden":false,"merged":[[5,1,5,6],[7,2,7,5]]}
["Avista Utilities"]
["State of Washington",null,null,null,"RCF",{"$f":"'Conversion Factor'!E28","v":1.045717}]
["Development of Amortization Rate"]
[]
[]
[null,"AMORTIZATION RATE CALCULATION"]
[]
[null,null,"Schedule 112/116 - Benefits to Pre 7/2021 Customers"]
[null,null,"Customers","Amortization & Deferral","Interest","Balance"]
[null,null,null,null,4.8000000000000001E-2]
{"$rows_left_out":20}
{"sheet":"Ben Amtz Calc - Sch 131-132","index":8,"n_rows":29,"n_cols":6,"rows_kept":29,"cut":false,"hidden":false,"merged":[[5,1,5,6],[7,2,7,5]]}
["Avista Utilities"]
["State of Washington",null,null,null,"RCF",{"$f":"'Conversion Factor'!E28","v":1.045717}]
["Development of Amortization Rate"]
[]
[]
[null,"AMORTIZATION RATE CALCULATION"]
[]
[null,null,"Schedule 131/132 - Benefits to Pre 7/2021 Customers"]
[null,null,"Customers","Amortization & Deferral","Interest","Balance"]
[null,null,null,null,4.8000000000000001E-2]
{"$rows_left_out":20}
{"sheet":"Ben Amtz Calc - Sch 146","index":9,"n_rows":29,"n_cols":6,"rows_kept":29,"cut":false,"hidden":false,"merged":[[5,1,5,6],[7,2,7,5]]}
["Avista Utilities"]
["State of Washington",null,null,null,"RCF",{"$f":"'Conversion Factor'!E28","v":1.045717}]
["Development of Amortization Rate"]
[]
[]
[null,"AMORTIZATION RATE CALCULATION"]
[]
[null,null,"Schedule 146 - Benefits to Pre 7/2021 Customers"]
[null,null,"Customers","Amortization & Deferral","Interest","Balance"]
[null,null,null,null,4.8000000000000001E-2]
{"$rows_left_out":20}
{"sheet":"Conversion Factor","index":10,"n_rows":30,"n_cols":5,"rows_kept":30,"cut":false,"hidden":false,"merged":[[4,0,4,4]]}
["AVISTA UTILITIES"]
["Revenue Conversion Factor"]
["Washington - Natural Gas System"]
["TWELVE MONTHS ENDED SEPTEMBER 30, 2021"]
[]
["Line "]
["No.",null,"Description",null,"Factor"]
[]
[1,null,"Revenues",null,1]
[]
{"$rows_left_out":21}
{"sheet":"Revenue - current rates","index":11,"n_rows":47,"n_cols":38,"rows_kept":47,"cut":false,"hidden":true,"merged":[]}
[]
[]
["Forecasted Usage",null,null,"2023-01-31",{"$f":"EOMONTH(D3,1)","v":"2023-02-28"},"2022-03-01","2022-04-01","2022-05-01","2022-06-01","2022-07-01","2022-08-01","2022-09-01","2022-10-01","2022-11-01","2022-12-01","2023-01-01","2023-02-01","2023-03-01","2023-04-01","2023-05-01","2023-06-01","2023-07-01","2023-08-01","2023-09-01","2023-10-01","2023-11-01","2023-12-01","2024-01-01","2024-02-01","2024-03-01","2024-04-01","2024-05-01","2024-06-01","2024-07-01",null,"2022-2023","2023-2024"]
[null,"Small Service Schedule 101",null,null,null,null,{"$f":"G38","v":0},{"$f":"H38","v":5070610.5531998109},3170130.372016375,1812771.8926424859,2073438.0843850782,2968240.5660654423,9254547.3455810752,17143580.537804507,26127031.462473758,23816315.706908848,20619339.573812734,16091512.440609436,9894923.2650398463,5199750.4931855202,2945533.4820336467,2102810.0767066558,1903280.0295206353,3089788.9015638665,8963927.3463242725,17127558.92009785,25959555.354015864,23947467.536230512,20801110.457976989,16397869.908349177,10115068.393056097,5223536.6227784296,3184810.3452011878,2109689.4224888245,null,{"$f":"SUM(K4:V4)","v":138237023.03460655},{"$f":"SUM(W4:AH4)","v":138823663.23760372}]
[null,"Large Service Schedule 111",null,null,null,null,{"$f":"G39+G40","v":0},{"$f":"H39+H40","v":2588626.5926134456},2011700.368299183,1683906.7702309897,1742851.7367864409,2322414.8692462118,4924835.8528578607,7252306.4993036538,9372326.1083555091,8698800.5669853613,7582269.9890039274,6291462.544827668,4212964.4749191692,2544237.5025430578,1995612.2801158165,1674561.4721210408,1758920.3538532169,2348799.1103350651,5019484.6365879467,7361177.0294063678,9522983.6002360694,8825720.9970562849,7695576.5673085898,6390946.6901884656,4285273.9040826699,2590001.9825783693,2037652.6902911412,1698383.8758142141,null,{"$f":"SUM(K5:V5)","v":58614643.897065707},{"$f":"SUM(W5:AH5)","v":59534921.437738404}]
[null,"Interrupt Service Schedule 131",null,null,null,null,{"$f":"G42","v":0},45178.592041924763,37951.0168820135,36160.191204956966,32707.676267293024,40862.345369953655,86622.768481211868,113518.487262,132358.85107130543,118703.33521448342,106925.79840659398,91577.374449217663,66054.928390878238,46918.899131297963,39004.301097719697,35314.218202961965,{"$f":"W42","v":31110.611434196442},36840.785682120222,81394.075281387049,109609.01177984949,131031.07356211923,120036.60083139922,110133.3260915823,92090.460079383294,67113.192613570282,47922.486123568306,40123.227880584709,35752.296166013504,null,910568.98334491695,903157.14752577385]
[null,"Transport Service Schedule 146",null,null,null,null,0,{"$f":"H43","v":2825661},2478607,2304662,2215419,2255889,2418396,2921288,3395034,3728560,3846569,3428664,3327185,2874605,2555500,2358850,{"$f":"W43","v":2223456},2315682,2366203,2988871,3335564,3705380,3829526,3438126,3350365,2875023,2538856,2329248]
[null,"Special Contract Transport",null,null,null,null,0,3408896,3127311,2936673,2793896,2920172,2996541,3546647,3884589,4299759,4338868,3850822,3830134,3428840,3134594,2964348,{"$f":"W44","v":2806056},2916767,3005728,3551884,3896302,4312962,4350528,3861329,3835979,3436820,3144062,2974418]
["Total Forecasted Usage",null,null,{"$f":"SUM(D4:D8)","v":0},0,0,0,13938972.737855181,10825699.757197572,8774173.8540784325,8858312.4974388126,10507578.780681608,19680942.966920145,30977340.52437016,42911339.42190057,40662138.609108694,36493972.361223251,29754038.359886318,21331261.668349892,14094351.894859876,10670244.063247183,9135883.7670306582,8722822.994808048,10707877.797581051,19436737.058193609,31139099.961284067,42845436.027814053,40911567.134118199,36786874.351377159,30180362.058617026,21653799.489752337,14173304.091480367,10945504.263372913,9147491.5944690518,null,{"$f":"SUM(AJ4:AJ8)","v":197762235.91501716},{"$f":"SUM(AK4:AK8)","v":199261741.82286793},{"$f":"(AK9-AJ9)/AJ9","v":7.58236728520375E-3}]
[null,null,null,null,null,null,null,null,null,null,null,null,null,null,null,null,null,null,null,null,null,null,null,null,null,null,null,null,null,null,null,null,null,null,null,{"$f":"'WA Gas - Sched 162'!C9","v":220376850.72049859}]
{"$rows_left_out":38}
{"sheet":"DSM Balance","index":12,"n_rows":16,"n_cols":37,"rows_kept":16,"cut":false,"hidden":true,"merged":[]}
["End of July 2022 Balance",{"$f":"M8","v":{"$error":"#REF!"}},"Surcharge/(Rebate)",null,null,null,null,null,null,null,null,null,2022,null,null,null,null,null,null,null,null,null,null,null,{"$f":"M1+1","v":2023},null,null,null,null,null,null,null,null,null,null,null,{"$f":"Y1+1","v":2024}]
["Aug 2022 - July 2024 Expenditure Budget",{"$f":"SUM(N4:AK4)","v":14417018.180712625},null,null,null,"End December","End January","End February","End March","End April","End May","End June","End July","End August","End September","End October","End November","End December","End January","End February","End March","End April","End May","End June","End July","End August","End September","End October","End November","End December","End January","End February","End March","End April","End May","End June","End July"]
["Total Projected DSM Balance + Expenditures",{"$f":"B1+B2","v":{"$error":"#REF!"}},null,null,"Expected gas tariff rider revenue",null,null,null,null,null,{"$f":"-'Revenue - current rates'!H35","v":{"$error":"#REF!"}},{"$f":"-'Revenue - current rates'!I35","v":{"$error":"#REF!"}},{"$f":"-'Revenue - current rates'!J35","v":{"$error":"#REF!"}},{"$f":"-'Revenue - current rates'!K35","v":{"$error":"#REF!"}},{"$f":"-'Revenue - current rates'!L35","v":{"$error":"#REF!"}},{"$f":"-'Revenue - current rates'!M35","v":{"$error":"#REF!"}},{"$f":"-'Revenue - current rates'!N35","v":{"$error":"#REF!"}},{"$f":"-'Revenue - current rates'!O35","v":{"$error":"#REF!"}},{"$f":"-'Revenue - current rates'!P35","v":{"$error":"#REF!"}},{"$f":"-'Revenue - current rates'!Q35","v":{"$error":"#REF!"}},{"$f":"-'Revenue - current rates'!R35","v":{"$error":"#REF!"}},{"$f":"-'Revenue - current rates'!S35","v":{"$error":"#REF!"}},{"$f":"-'Revenue - current rates'!T35","v":{"$error":"#REF!"}},{"$f":"-'Revenue - current rates'!U35","v":{"$error":"#REF!"}},{"$f":"-'Revenue - current rates'!V35","v":{"$error":"#REF!"}},{"$f":"-'Revenue - current rates'!W35","v":{"$error":"#REF!"}},{"$f":"-'Revenue - current rates'!X35","v":{"$error":"#REF!"}},{"$f":"-'Revenue - current rates'!Y35","v":{"$error":"#REF!"}},{"$f":"-'Revenue - current rates'!Z35","v":{"$error":"#REF!"}},{"$f":"-'Revenue - current rates'!AA35","v":{"$error":"#REF!"}},{"$f":"-'Revenue - current rates'!AB35","v":{"$error":"#REF!"}},{"$f":"-'Revenue - current rates'!AC35","v":{"$error":"#REF!"}},{"$f":"-'Revenue - current rates'!AD35","v":{"$error":"#REF!"}},{"$f":"-'Revenue - current rates'!AE35","v":{"$error":"#REF!"}},{"$f":"-'Revenue - current rates'!AF35","v":{"$error":"#REF!"}},{"$f":"-'Revenue - current rates'!AG35","v":{"$error":"#REF!"}},{"$f":"-'Revenue - current rates'!AH35","v":{"$error":"#REF!"}}]
[null,null,null,null,"Expected DSM cash expenditures",null,null,null,null,null,484214.82260583341,471091.15260583343,454553.10260583338,647281.9526058333,572621.89260583313,383058.23260583333,615456.64260583336,854927.39260583313,609493.06760583341,477237.08760583337,840961.73760583322,440910.80048400839,549061.11048400844,535937.4404840084,519399.39048400836,712128.24048400833,637468.18048400816,447904.5204840083,680302.93048400828,919773.68048400804,609539.6904840084,477283.71048400836,840961.73760583322,440910.80048400839,549061.11048400844,{"$f":"X4","v":535937.4404840084},{"$f":"Y4","v":519399.39048400836}]
["Net Revenue Projected to be Recovered ",{"$f":"SUM(N3:AK3)","v":{"$error":"#REF!"}},"Aug 2022 - July 2024",null,"Accounting Adjustment"]
[null,null,null,null,"Net change in balance",null,null,null,null,null,{"$f":"K3+K4","v":{"$error":"#REF!"}},{"$f":"L3+L4","v":{"$error":"#REF!"}},{"$f":"M3+M4","v":{"$error":"#REF!"}},{"$f":"N3+N4","v":{"$error":"#REF!"}},{"$error":"#REF!"},{"$error":"#REF!"},{"$error":"#REF!"},{"$error":"#REF!"},{"$error":"#REF!"},{"$error":"#REF!"},{"$error":"#REF!"},{"$error":"#REF!"},{"$error":"#REF!"},{"$error":"#REF!"},{"$error":"#REF!"},{"$f":"Z3+Z4","v":{"$error":"#REF!"}},{"$error":"#REF!"},{"$error":"#REF!"},{"$error":"#REF!"},{"$error":"#REF!"},{"$error":"#REF!"},{"$error":"#REF!"},{"$error":"#REF!"},{"$error":"#REF!"},{"$error":"#REF!"},{"$error":"#REF!"},{"$error":"#REF!"}]
["Total Projected DSM Balance (July 2024)",{"$f":"B3+B5","v":{"$error":"#REF!"}},"Underfunded (Surcharge)"]
[null,null,null,null,"Gas Tariff rider balance",null,null,null,null,1303878.4099999999,{"$f":"K6+J8","v":{"$error":"#REF!"}},{"$f":"L6+K8","v":{"$error":"#REF!"}},{"$f":"M6+L8","v":{"$error":"#REF!"}},{"$f":"N6+M8","v":{"$error":"#REF!"}},{"$f":"O6+N8","v":{"$error":"#REF!"}},{"$f":"P6+O8","v":{"$error":"#REF!"}},{"$f":"Q6+P8","v":{"$error":"#REF!"}},{"$f":"R6+Q8","v":{"$error":"#REF!"}},{"$f":"S6+R8","v":{"$error":"#REF!"}},{"$f":"T6+S8","v":{"$error":"#REF!"}},{"$f":"U6+T8","v":{"$error":"#REF!"}},{"$f":"V6+U8","v":{"$error":"#REF!"}},{"$f":"W6+V8","v":{"$error":"#REF!"}},{"$f":"X6+W8","v":{"$error":"#REF!"}},{"$f":"Y6+X8","v":{"$error":"#REF!"}},{"$f":"Z6+Y8","v":{"$error":"#REF!"}},{"$error":"#REF!"},{"$error":"#REF!"},{"$error":"#REF!"},{"$error":"#REF!"},{"$error":"#REF!"},{"$error":"#REF!"},{"$error":"#REF!"},{"$error":"#REF!"},{"$error":"#REF!"},{"$error":"#REF!"},{"$error":"#REF!"}]
[]
[]
{"$rows_left_out":7}
{"sheet":"Base Revenue","index":13,"n_rows":35,"n_cols":17,"rows_kept":35,"cut":false,"hidden":true,"merged":[[0,11,2,12]]}
["AVISTA UTILITIES",null,null,null,null,null,null,null,null,null,null,"This worksheet pulls data from 'Pres & Prop Rev' tab."]
["WASHINGTON NATURAL GAS"]
["PROPOSED INCREASE BY SERVICE SCHEDULE"]
["12 MONTHS ENDED DECEMBER 31, 2019"]
["(000s of Dollars)"]
["From UG-200901 Compliance Filing, Attachment 2, Page 1"]
[]
[null,null,null,"Base Tariff",null,"Base Tariff","Base","Total Billed",null,"Percent ",null,null,null,null,"Present "]
[null,null,null,"Revenue","Final","Revenue","Tariff","Revenue","Final","Increase","Gas",null,"Margin ",null,"Margin"]
["Line","Type of","Schedule","Under Present","General","Under Proposed","Percent","at Present","General","on Billed","Costs",null,"Increase",null,"Revenue"]
{"$rows_left_out":26}
{"sheet":"RCF","index":14,"n_rows":27,"n_cols":3,"rows_kept":27,"cut":false,"hidden":true,"merged":[]}
["AVISTA UTILITIES"]
["REVENUE CONVERSION FACTOR"]
["WASHINGTON NATURAL GAS"]
["TWELVE MONTHS ENDED DECEMBER 31, 2019"]
[]
[]
["From UG-200901"]
[]
[]
["Description",null,"Factor"]
{"$rows_left_out":17}