{"text_format":"1","workbook":"xlsx","n_sheets":19,"sheets":["Pres & Prop Rev","Rate Design","RY1 - Summary","Att A pg 2","Att A pg 4","LIRAP","Colstrip","Stlmt Spread","Rate Spread GRC","Bill Determ","Sp Cnt Exh B","Bill Impact","WA Sch 25","Lighting summary","St Lts","Area Lts","Capital Recovery Factor Calc","Block Data","REVRUNS 12ME0921"],"not_rendered":{"charts":0,"images":0,"macros":1,"external_links":4,"defined_names":45,"comments":9,"pivot_tables":0},"unopened":[],"bounds":{"document_bytes":16777216,"sheet_cells":100000,"rows_first":2000,"rows_last":500,"rows_between":2000,"halvings":0,"cell_chars":16384,"cell_head_chars":4096},"cells_cut":0,"cells_raw":0,"read":"whole","date_system":"1900"}

{"sheet":"Pres & Prop Rev","index":0,"n_rows":305,"n_cols":19,"rows_kept":305,"cut":false,"hidden":false,"merged":[[5,18,10,20],[94,1,95,10]]}
[]
[null,{"$f":"IF(Base1_Billing2=2,\"BILLED\",\"\")","v":""}]
[]
[null,null," ","RESIDENTIAL","GENERAL SVC. ","GENERAL SVC. ","LG. GEN. SVC.","LG. GEN. SVC.","EX LG GEN SVC","EX LG GEN SVC","PUMPING","ST & AREA LTG"]
[null,null,"TOTAL","SCHEDULE 1,2","SCH. 11,12","SCH. 13","SCH. 21,22","SCH. 23","SCHEDULE 25","SCHEDULE 25I","SCH. 30, 31, 32","SCH. 41-48",null,null,null,null,null,null,"Print Header for all printed pages on this worksheet:"]
[null,"PRESENT BILL DETERMINANTS",null,null,null,null,null,null,null,null,null,null,null,null,"Calculate all revenue exhibits using  ____ rates:",null,null,null,{"$f":"\"AVISTA UTILITIES\nWASHINGTON ELECTRIC\nPRO FORMA REVENUE UNDER PRESENT AND PROPOSED \"&Q9&\" RATES\n12 MONTHS ENDED SEPTEMBER 30, 2021\"","v":"AVISTA UTILITIES\nWASHINGTON ELECTRIC\nPRO FORMA REVENUE UNDER PRESENT AND PROPOSED BASE TARIFF RATES\n12 MONTHS ENDED SEPTEMBER 30, 2021"}]
{"$rows_left_out":300}
{"sheet":"Rate Design","index":1,"n_rows":127,"n_cols":29,"rows_kept":127,"cut":false,"hidden":false,"merged":[]}
["PRESENT RATES",null,null,1,2,3,4,5,6,7,8,9,null,null,null,null,"Tiers - used for bill comparisons"]
[null,null,"TOTAL","SCH. 1,2","SCH. 11,12","SCH. 13","SCH. 21,22","SCH. 23","SCH. 25","SCH. 25I","SCH. 30, 31, 32",null,null,null,"Range Name",null,"SCHEDULE 1,2","SCH. 11,12","SCH. 13","SCH. 21,22","SCH. 23","SCHEDULE 25","SCHEDULE 25I","SCH. 30, 31, 32"]
[null,"Base Tariff Rates"]
[1,"BASIC CHARGE",null,9,20,20,0,550,0,0,20]
[2,"BLOCK 1 PER KWH",null,8.5190000000000001,11.936,21.108000000000001,7.7140000000000004,16.332999999999998,5.7469999999999999,4.6619999999999999,10.646000000000001,null,null,null,null,null,800,3650,3650,250000,250000,500000,500000]
[3,"BLOCK 2 PER KWH",null,9.9109999999999996,8.7710000000000008,8.5879999999999992,6.9020000000000001,6.742,5.17,4.1950000000000003,7.6029999999999998,null,null,null,null,null,1500,9999999,9999999,9999999,9999999,9999999,9999999]
{"$rows_left_out":122}
{"sheet":"RY1 - Summary","index":2,"n_rows":85,"n_cols":28,"rows_kept":85,"cut":false,"hidden":false,"merged":[[4,0,4,18],[0,21,2,22],[0,0,0,18],[1,0,1,18],[2,0,2,18],[3,0,3,18]]}
["AVISTA UTILITIES",null,null,null,null,null,null,null,null,null,null,null,null,null,null,null,null,null,null,null,null,"This worksheet pulls data from 'Pres & Prop Rev' tab."]
["WASHINGTON ELECTRIC"]
["PROPOSED INCREASE BY SERVICE SCHEDULE"]
["12 MONTHS ENDED SEPTEMBER 30, 2021"]
["(000s of Dollars)"]
[]
{"$rows_left_out":80}
{"sheet":"Att A pg 2","index":3,"n_rows":90,"n_cols":23,"rows_kept":90,"cut":false,"hidden":false,"merged":[[8,0,8,2],[3,0,3,15]]}
["AVISTA UTILITIES",null,null,null,null,null,null,null,null,null,null,null,null,null,null,null,null,"This worksheet uses Base & Billing rates from 'Rate Design' tab."]
["WASHINGTON ELECTRIC"]
["PRESENT AND PROPOSED RATE COMPONENTS BY SCHEDULE"]
["RATE YEAR 1"]
[]
[]
{"$rows_left_out":85}
{"sheet":"Att A pg 4","index":4,"n_rows":65,"n_cols":27,"rows_kept":65,"cut":false,"hidden":false,"merged":[[10,28,14,43]]}
[]
[]
[]
[]
[]
[]
{"$rows_left_out":60}
{"sheet":"LIRAP","index":5,"n_rows":43,"n_cols":22,"rows_kept":43,"cut":false,"hidden":false,"merged":[]}
[]
[]
[null,"Schedule 92 - LIRAP"]
[]
[]
[null,null,null,null,null,null,null,null,null,null,"Total"]
{"$rows_left_out":38}
{"sheet":"Colstrip","index":6,"n_rows":48,"n_cols":18,"rows_kept":48,"cut":false,"hidden":false,"merged":[[47,1,47,9],[0,0,0,11],[1,0,1,11],[2,0,2,11],[3,0,3,11],[4,0,4,11]]}
["AVISTA UTILITIES"]
["WASHINGTON ELECTRIC"]
["PROPOSED INCREASE BY SERVICE SCHEDULE"]
["12 MONTHS ENDED SEPTEMBER 30, 2021"]
["(000s of Dollars)"]
[]
{"$rows_left_out":43}
{"sheet":"Stlmt Spread","index":7,"n_rows":55,"n_cols":22,"rows_kept":55,"cut":false,"hidden":false,"merged":[[8,11,8,14],[0,0,0,9],[1,0,1,9],[2,0,2,9],[3,0,3,9],[4,0,4,9]]}
["Settling Parties Rate Spread - Confidential, For Settlement Purposes Only"]
["WASHINGTON ELECTRIC"]
["PROPOSED INCREASE BY SERVICE SCHEDULE"]
["12 MONTHS ENDED SEPTEMBER 30, 2021"]
["(000s of Dollars)"]
[]
{"$rows_left_out":50}
{"sheet":"Rate Spread GRC","index":8,"n_rows":83,"n_cols":17,"rows_kept":83,"cut":false,"hidden":false,"merged":[[82,3,88,10]]}
[]
[]
["Avista"]
["Electric"]
["Rate Spread"]
[]
{"$rows_left_out":78}
{"sheet":"Bill Determ","index":9,"n_rows":111,"n_cols":7,"rows_kept":111,"cut":false,"hidden":false,"merged":[]}
["AVISTA UTILITIES"]
["WASHINGTON ELECTRIC"]
["ACTUAL / PRO FORMA BILLING DETERMINANTS BY RATE SCHEDULE"]
["12 MONTHS ENDED SEPTEMBER 30, 2021"]
[]
[]
{"$rows_left_out":106}
{"sheet":"Sp Cnt Exh B","index":10,"n_rows":24,"n_cols":24,"rows_kept":24,"cut":false,"hidden":false,"merged":[[4,3,4,5],[4,7,4,9],[25,0,25,6]]}
["Special Contract"]
["Exhibit B - Rate Design"]
[]
[]
[null,null,null,"Schedule 25",null,null,null,"Special Contract"]
[null,null,null,"Present",null,"Present ",null,"Proposed",null,"Proposed",null,null,null,null,"Revised Base"]
{"$rows_left_out":19}
{"sheet":"Bill Impact","index":11,"n_rows":28,"n_cols":21,"rows_kept":28,"cut":false,"hidden":false,"merged":[]}
[]
[]
["Schedule 001 Bill Impact"]
[]
[]
[]
{"$rows_left_out":23}
{"sheet":"WA Sch 25","index":12,"n_rows":189,"n_cols":23,"rows_kept":189,"cut":false,"hidden":false,"merged":[]}
["Washington Schedule 25 Billing Determinants",null,null,null,null,null,null,null,null,null,null,null,null,null,null,null,"1st",{"$f":"Q2","v":500000},{"$f":"R2","v":6000000}]
[null,null,null,null,null,null,null,null,null,null,null,null,null,null,null,"12-mo Ended",500000,6000000,99999999]
["KWHs",null,"Acct No.","2020-10-31",{"$f":"EOMONTH(D3,1)","v":"2020-11-30"},"2020-12-31","2021-01-31","2021-02-28","2021-03-31","2021-04-30","2021-05-31","2021-06-30","2021-07-31","2021-08-31","2021-09-30","Total","kwhs/mo","kwhs/mo","kwhs/mo"]
[1,"Goodrich - North 2311008572","2311008572",2458068.9,1544554.2,1189675.2,1511697.6,1882095.6,2261666.4,1799479.5,2309876.1,2695404.6,2647274.7000000002,2478096.6,3166680.3,{"$f":"SUM(D4:O4)","v":25944569.700000003},{"$f":"Q$2*12-SUMPRODUCT(--($D4:$O4<=Q$2),Q$2-$D4:$O4)","v":6000000},{"$f":"R$2*12-SUM($Q4:Q4)-SUMPRODUCT(--($D4:$O4<=R$2),R$2-$D4:$O4)","v":19944569.700000003},{"$f":"S$2*12-SUM($Q4:R4)-SUMPRODUCT(--($D4:$O4<=S$2),S$2-$D4:$O4)","v":0}]
[2,"Boise Cascade Plywood","8920023327",3024031.5,2843954.4,2473554.2999999998,2885658.3,2744878.5,2980838.7,2910555.9,2901796.8,2761634.4,2818435.2,2414878.2000000002,2830543.8,33590759.999999993,{"$f":"Q$2*12-SUMPRODUCT(--($D5:$O5<=Q$2),Q$2-$D5:$O5)","v":6000000},{"$f":"R$2*12-SUM($Q5:Q5)-SUMPRODUCT(--($D5:$O5<=R$2),R$2-$D5:$O5)","v":27590759.999999993},{"$f":"S$2*12-SUM($Q5:R5)-SUMPRODUCT(--($D5:$O5<=S$2),S$2-$D5:$O5)","v":0}]
[3,"Boise Cascade Sawmill","9920023116",1281416.5,1231090.7,1371597.5,1378001.1,1276487.1000000001,1360394,1246655.2,1204011.2,1244033.7,1159707.5,1143046.8,1107361.5,15003802.799999999,6000000,{"$f":"R$2*12-SUM($Q6:Q6)-SUMPRODUCT(--($D6:$O6<=R$2),R$2-$D6:$O6)","v":9003802.799999997},{"$f":"S$2*12-SUM($Q6:R6)-SUMPRODUCT(--($D6:$O6<=S$2),S$2-$D6:$O6)","v":0}]
{"$rows_left_out":184}
{"sheet":"Lighting summary","index":13,"n_rows":74,"n_cols":16,"rows_kept":74,"cut":false,"hidden":false,"merged":[[6,2,6,3],[6,5,6,6],[24,2,24,3],[24,5,24,6]]}
[null,"AVISTA UTILITIES"]
[null,"WASHINGTON ELECTRIC"]
[null,"STREET & AREA LIGHT REVENUE UNDER PRESENT & PROPOSED RATES"]
[null,"12 MONTHS ENDED SEPTEMBER 30, 2021"]
[]
[]
{"$rows_left_out":69}
{"sheet":"St Lts","index":14,"n_rows":160,"n_cols":95,"rows_kept":160,"cut":false,"hidden":false,"merged":[]}
["Street Light Summary",null,null,null,null,null,null,null,"WASHINGTON Street Lights (Schedule 41 - 46 Rates)",null,null,null,null,null,null,null,null,null,null,null,null,null,null,null,null,null,null,null,null,null,null,null,null,null,null,"% rate increase -->",{"$f":"'Lighting summary'!L11","v":0.1027},{"$f":"'Lighting summary'!L12","v":9.49591957210347E-2},{"$f":"'Lighting summary'!L13","v":0.1027},{"$f":"'Lighting summary'!L14","v":0.1027},{"$f":"'Lighting summary'!L15","v":0.1027},null,null,null,null,null,null,null,null,null,{"$f":"Colstrip!O28","v":-5.8469870264654805E-2},{"$f":"AY1","v":-5.8469870264654805E-2},{"$f":"AY1","v":-5.8469870264654805E-2},{"$f":"AY1","v":-5.8469870264654805E-2},{"$f":"AY1","v":-5.8469870264654805E-2},null,null,null,null,null,null,null,null,null,null,null,null,null,null,null,null,{"$f":"-0.00789-0.00045-0.00339","v":-1.1730000000000001E-2},"compare input Present Billing Rates to calculated Present Billing Rates",null,null,null,null,null,null,{"$f":"BU2","v":1.0150999999999999}]
["MDM-10069 Report as of 9/30/21",null,null,null,null,null,null,null,null,null,null,null,"Number of Lights(1)",null,null,null,null,null,"Present Rates",null,null,null,null,null,"Monthly Revenue at Present Rates",null,null,null,null,null,"Number of Lights",null,null,null,null,null,"Proposed Rates",null,null,null,null,null,"Monthly Revenue at Proposed Rates",null,null,null,null,null,null,null,"Proposed Rates Less Colstrip",null,null,null,null,null,"Monthly Revenue at Proposed Rates",null,null,null,null,null,null,null,null,"Present Billing Rates",null,null,null,null,null,1.3939999999999999E-2,{"$f":"1+0.0151","v":1.0150999999999999},"Sch 91 & 92",null,null,null,null,null,"New Billing Rates",null,null,null,null,null,"Increase"]
[null,null,null,null,null,null,null,null,"Fixture Type","Pole Facility","Size","Sched","041","042","044","045","046",null,"041","042","044","045","046",null,"041","042","044","045","046",null,"041","042","044","045","046",null,"041","042","044","045","046",null,"041","042","044","045","046",null,null,null,"041","042","044","045","046",null,"041","042","044","045","046",null,null,null,"kwh","041","042","044","045","046",null,"Sch 93/94","041","042","044","045","046",null,null,"041","042","044","045","046",null,"041","042","044","045","046"]
[null,null,null,null,null,null,null,null,"LED (Dusk to Dawn)","Dusk to Dawn","5W","005L",{"$f":"SUMIF($G:$G,TEXT(M$3,\"000\")&TEXT($L4,\"000\"),$E:$E)","v":0},0,0,0,0,{"$f":"IF(SUM(M4:Q4)>0,0,1)","v":1},0,0,0,0,0.22,null,{"$f":"IF(AND(M4<>0,S4=0),#VALUE!,M4*S4)","v":0},{"$f":"IF(AND(N4<>0,T4=0),#VALUE!,N4*T4)","v":0},{"$f":"IF(AND(O4<>0,U4=0),#VALUE!,O4*U4)","v":0},{"$f":"IF(AND(P4<>0,V4=0),#VALUE!,P4*V4)","v":0},{"$f":"IF(AND(Q4<>0,W4=0),#VALUE!,Q4*W4)","v":0},null,{"$f":"SUMIF($G:$G,TEXT(AE$3,\"000\")&TEXT($L4,\"000\"),$E:$E)","v":0},0,0,0,0,null,{"$f":"ROUND(S4*(1+AK$1),2)","v":0},null,{"$f":"ROUND(U4*(1+AM$1),2)","v":0},{"$f":"ROUND(V4*(1+AN$1),2)","v":0},{"$f":"ROUND(W4*(1+AO$1),2)","v":0.24},null,{"$f":"IF(AND(AE4<>0,AK4=0),#VALUE!,AE4*AK4)","v":0},{"$f":"IF(AND(AF4<>0,AL4=0),#VALUE!,AF4*AL4)","v":0},{"$f":"IF(AND(AG4<>0,AM4=0),#VALUE!,AG4*AM4)","v":0},{"$f":"IF(AND(AH4<>0,AN4=0),#VALUE!,AH4*AN4)","v":0},{"$f":"IF(AND(AI4<>0,AO4=0),#VALUE!,AI4*AO4)","v":0},null,null,null,{"$f":"ROUND(AK4*(1+AY$1),2)","v":0},null,{"$f":"ROUND(AM4*(1+BA$1),2)","v":0},{"$f":"ROUND(AN4*(1+BB$1),2)","v":0},{"$f":"ROUND(AO4*(1+BC$1),2)","v":0.23},null,{"$f":"IF(AND(AE4<>0,AY4=0),#VALUE!,AE4*AY4)","v":0},{"$f":"IF(AND(AF4<>0,AZ4=0),#VALUE!,AF4*AZ4)","v":0},{"$f":"IF(AND(AG4<>0,BA4=0),#VALUE!,AG4*BA4)","v":0},{"$f":"IF(AND(AH4<>0,BB4=0),#VALUE!,AH4*BB4)","v":0},{"$f":"IF(AND(AI4<>0,BC4=0),#VALUE!,AI4*BC4)","v":0},null,null,null,2,null,null,null,null,0.23347299999999999,null,{"$f":"ROUND(BM4*$BT$2,2)+ROUND(BM4*$BT$1,2)","v":9.9999999999999985E-3},null,null,null,null,{"$f":"ROUND((W4*$BU$2)+$BT4-BR4,2)","v":0},null,null,{"$f":"AK4*$CB$1","v":0},{"$f":"AL4*$CB$1","v":0},{"$f":"AM4*$CB$1","v":0},{"$f":"AN4*$CB$1","v":0},{"$f":"AO4*$CB$1","v":0.24362399999999995},null,{"$f":"CB4-BN4","v":0},{"$f":"CC4-BO4","v":0},{"$f":"CD4-BP4","v":0},{"$f":"CE4-BQ4","v":0},{"$f":"CF4-BR4","v":1.0150999999999966E-2}]
[null,"State","Sched","Rate Sub","# of Lights",null,null,null,"LED (Dusk to Dawn)","Dusk to Dawn","5W","015L",0,0,0,0,42,{"$f":"IF(SUM(M5:Q5)>0,0,1)","v":0},0,0,0,0,0.54,null,{"$f":"IF(AND(M5<>0,S5=0),#VALUE!,M5*S5)","v":0},{"$f":"IF(AND(N5<>0,T5=0),#VALUE!,N5*T5)","v":0},{"$f":"IF(AND(O5<>0,U5=0),#VALUE!,O5*U5)","v":0},{"$f":"IF(AND(P5<>0,V5=0),#VALUE!,P5*V5)","v":0},{"$f":"IF(AND(Q5<>0,W5=0),#VALUE!,Q5*W5)","v":22.68},null,0,0,0,0,42,null,{"$f":"ROUND(S5*(1+AK$1),2)","v":0},null,{"$f":"ROUND(U5*(1+AM$1),2)","v":0},{"$f":"ROUND(V5*(1+AN$1),2)","v":0},{"$f":"ROUND(W5*(1+AO$1),2)","v":0.6},null,{"$f":"IF(AND(AE5<>0,AK5=0),#VALUE!,AE5*AK5)","v":0},{"$f":"IF(AND(AF5<>0,AL5=0),#VALUE!,AF5*AL5)","v":0},{"$f":"IF(AND(AG5<>0,AM5=0),#VALUE!,AG5*AM5)","v":0},{"$f":"IF(AND(AH5<>0,AN5=0),#VALUE!,AH5*AN5)","v":0},{"$f":"IF(AND(AI5<>0,AO5=0),#VALUE!,AI5*AO5)","v":25.2},null,null,null,{"$f":"ROUND(AK5*(1+AY$1),2)","v":0},null,{"$f":"ROUND(AM5*(1+BA$1),2)","v":0},{"$f":"ROUND(AN5*(1+BB$1),2)","v":0},{"$f":"ROUND(AO5*(1+BC$1),2)","v":0.56000000000000005},null,{"$f":"IF(AND(AE5<>0,AY5=0),#VALUE!,AE5*AY5)","v":0},{"$f":"IF(AND(AF5<>0,AZ5=0),#VALUE!,AF5*AZ5)","v":0},{"$f":"IF(AND(AG5<>0,BA5=0),#VALUE!,AG5*BA5)","v":0},{"$f":"IF(AND(AH5<>0,BB5=0),#VALUE!,AH5*BB5)","v":0},{"$f":"IF(AND(AI5<>0,BC5=0),#VALUE!,AI5*BC5)","v":23.520000000000003},null,null,null,5,null,null,null,null,0.56845599999999996,null,{"$f":"ROUND(BM5*$BT$2,2)+ROUND(BM5*$BT$1,2)","v":1.0000000000000009E-2},null,null,null,null,{"$f":"ROUND((W5*$BU$2)+$BT5-BR5,2)","v":-0.01},null,null,{"$f":"AK5*$CB$1","v":0},{"$f":"AL5*$CB$1","v":0},{"$f":"AM5*$CB$1","v":0},{"$f":"AN5*$CB$1","v":0},{"$f":"AO5*$CB$1","v":0.60905999999999993},null,{"$f":"CB5-BN5","v":0},{"$f":"CC5-BO5","v":0},{"$f":"CD5-BP5","v":0},{"$f":"CE5-BQ5","v":0},{"$f":"CF5-BR5","v":4.0603999999999973E-2}]
[null,null,null,null,null,null,null,null,"LED (Dusk to Dawn)","Dusk to Dawn","5W","025L",0,0,0,0,45,0,0,0,0,0,0.98,null,0,0,0,0,{"$f":"IF(AND(Q6<>0,W6=0),#VALUE!,Q6*W6)","v":44.1},null,0,0,0,0,45,null,0,null,0,0,1.08,null,0,{"$f":"IF(AND(AF6<>0,AL6=0),#VALUE!,AF6*AL6)","v":0},0,0,{"$f":"IF(AND(AI6<>0,AO6=0),#VALUE!,AI6*AO6)","v":48.6},null,null,null,0,null,0,0,1.02,null,0,0,0,0,45.9,null,null,null,9,null,null,null,null,1.0252509999999999,null,2.0000000000000004E-2,null,null,null,null,{"$f":"ROUND((W6*$BU$2)+$BT6-BR6,2)","v":-0.01},null,null,0,0,0,0,1.0963080000000001,null,0,0,0,0,7.1057000000000148E-2]
{"$rows_left_out":155}
{"sheet":"Area Lts","index":15,"n_rows":104,"n_cols":40,"rows_kept":104,"cut":false,"hidden":false,"merged":[]}
["Area Light Summary",null,null,null,null,null,null,null,"WASHINGTON Area Lights (Schedule 47)",null,null,null,null,null,null,null,null,null,"Monthly Rev.",null,null,null,null,null,null,{"$f":"SL_RateIncr","v":0},null,null,"% rate increase -->",{"$f":"'Lighting summary'!L16","v":0.1027},null,null,"Monthly Rev.",null,null,{"$f":"Colstrip!O28","v":-5.8469870264654805E-2},"Colstrip Adj",null,"Monthly Rev."]
[{"$f":"'St Lts'!A2","v":"MDM-10069 Report as of 9/30/21"},null,null,null,null,null,null,null,null,null,null,null,"# of Lights(1)",null,null,"Pres. Rates",null,null,"at Pres. Rates",null,null,"# of Lights(1)",null,null,null,null,"# of Lights",null,null,"Prop. Rates",null,null,"at Prop. Rates",null,null,"Prop. Rates",null,null,"at Prop. Rates"]
[null,null,null,null,null,null,null,null,"Fixture Type","Pole Facility","Size","Sched","047","048",null,"047","048",null,"047","048",null,"047","048",null,null,null,"047","048",null,"047","048",null,"047","048",null,"047","048",null,"047","048"]
[null,null,null,null,null,null,null,null,"Sodium Vapor","Floodlight on existing standard","250W","HAH",{"$f":"SUMIF($G:$G,TEXT(M$3,\"000\")&TEXT($L4,\"000\"),$E:$E)","v":95},2,null,{"$f":"VLOOKUP(L4,'[4]AL''s For CCB'!$E$9:$I$56,5,FALSE)","v":23.53},{"$f":"P4","v":23.53},null,{"$f":"IF(AND(M4<>0,P4=0),#VALUE!,M4*P4)","v":2235.35},{"$f":"IF(AND(N4<>0,Q4=0),#VALUE!,N4*Q4)","v":47.06},null,{"$f":"SUMIF($G:$G,TEXT(V$3,\"000\")&TEXT($L4,\"000\"),$E:$E)","v":95},2,null,null,null,{"$f":"M4","v":95},2,null,{"$f":"ROUND(P4*(1+AD$1),2)","v":25.95},{"$f":"AD4","v":25.95},null,{"$f":"IF(AND(AA4<>0,AD4=0),#VALUE!,AA4*AD4)","v":2465.25},{"$f":"IF(AND(AB4<>0,AE4=0),#VALUE!,AB4*AE4)","v":51.9},null,{"$f":"ROUND(AD4*(1+AJ$1),2)","v":24.43},{"$f":"AJ4","v":24.43},null,{"$f":"IF(AND(AA4<>0,AJ4=0),#VALUE!,AA4*AJ4)","v":2320.85},{"$f":"IF(AND(AB4<>0,AK4=0),#VALUE!,AB4*AK4)","v":48.86}]
[null,"State","Sched","Rate Sub","# of Lights",null,null,null,"Sodium Vapor","Kim light w/25' fiberglass pole","100W","HAI",16,2,null,{"$f":"VLOOKUP(L5,'[4]AL''s For CCB'!$E$9:$I$56,5,FALSE)","v":30.73},30.73,null,{"$f":"IF(AND(M5<>0,P5=0),#VALUE!,M5*P5)","v":491.68},61.46,null,16,2,null,null,null,16,2,null,{"$f":"ROUND(P5*(1+AD$1),2)","v":33.89},{"$f":"AD5","v":33.89},null,542.24,67.78,null,{"$f":"ROUND(AD5*(1+AJ$1),2)","v":31.91},{"$f":"AJ5","v":31.91},null,{"$f":"IF(AND(AA5<>0,AJ5=0),#VALUE!,AA5*AJ5)","v":510.56},{"$f":"IF(AND(AB5<>0,AK5=0),#VALUE!,AB5*AK5)","v":63.82}]
[null,null,null,null,null,null,null,null,"Sodium Vapor","on existing standard","100W","HPA",330,367,null,{"$f":"VLOOKUP(L6,'[4]AL''s For CCB'!$E$9:$I$56,5,FALSE)","v":14.59},14.59,null,4814.7,{"$f":"IF(AND(N6<>0,Q6=0),#VALUE!,N6*Q6)","v":5354.53},null,330,367,null,null,null,330,367,null,16.09,16.09,null,5309.7,5905.03,null,15.15,15.15,null,4999.5,5560.05]
{"$rows_left_out":99}
{"sheet":"Capital Recovery Factor Calc","index":16,"n_rows":40,"n_cols":16,"rows_kept":40,"cut":false,"hidden":false,"merged":[]}
[]
[]
[]
[]
["Avista",null,null,null,null,"Avista",null,null,null,null,null,"Avista"]
["Capital Recovery Factor Calculation",null,null,null,null,"Capital Recovery Factor Calculation",null,null,null,null,null,"Capital Recovery Factor Calculation"]
{"$rows_left_out":35}
{"sheet":"Block Data","index":17,"n_rows":153,"n_cols":19,"rows_kept":153,"cut":false,"hidden":false,"merged":[]}
[]
[]
["WASHINGTON ELECTRIC SYSTEM"]
[null,null,"October","November","December","January","February","March","April","May","June","July","August","September","Annual Total"]
["Rate Design Program Monthly Results"]
[null,"Schedule 001/002"]
{"$rows_left_out":148}
{"sheet":"REVRUNS 12ME0921","index":18,"n_rows":485,"n_cols":17,"rows_kept":485,"cut":false,"hidden":false,"merged":[[388,1,389,1],[391,0,391,2],[352,0,389,0],[352,1,353,1],[355,1,356,1],[358,1,359,1],[361,1,362,1],[367,1,368,1],[370,1,371,1],[376,1,377,1],[382,1,383,1],[385,1,386,1],[364,1,365,1],[373,1,374,1],[379,1,380,1]]}
[]
[]
["\"Rev Norm Bill Determininant 12 ME Report\" for Report Date : '09/30/2021'"]
[]
["State Cde:WA"]
[]
{"$rows_left_out":479}