{"text_format":"1","workbook":"xlsx","n_sheets":14,"sheets":["Pres & Prop Rev","Rate Design","RS","RD","BFG","Rate Spread","Bill Impact","LIRAP","Bill Determ","Block Usage","Big Schedules","12MEDEC18","121 to 111","Sch 111 Rate Design"],"not_rendered":{"charts":0,"images":0,"macros":1,"external_links":0,"defined_names":19,"comments":8,"pivot_tables":0},"unopened":[],"bounds":{"document_bytes":16777216,"sheet_cells":100000,"rows_first":2000,"rows_last":500,"rows_between":2000,"halvings":0,"cell_chars":16384,"cell_head_chars":4096},"cells_cut":0,"cells_raw":0,"read":"whole","date_system":"1900"}

{"sheet":"Pres & Prop Rev","index":0,"n_rows":275,"n_cols":17,"rows_kept":275,"cut":false,"hidden":false,"merged":[[5,16,10,18]]}
[]
[]
[null,null,null,null,null,null,null,null,null,"TRANSPORT"]
["WORK PAPER",null," ","GEN SERVICE","LRG GEN SVC","EX LRG GEN SVC","INTERRUPTIBLE","TRANSPORT","TRANSPORT","SCH 148 - WSU"]
["REFERENCE",null,"TOTAL","SCH. 101 & 102","SCH. 111,112&116","SCH. 121,122&126","SCH. 131&132","SCHEDULE 146","SCHEDULE 148","ANN. MINIMUM",null,null,null,null,null,null,"Print Header for all printed pages on this worksheet:"]
[null,"PRESENT BILL DETERMINANTS",null,null,null,null,null,null,null,null,null,null,"Calculate all revenue exhibits using  ____ rates:",null,null,null,{"$f":"\"AVISTA UTILITIES\nWASHINGTON NATURAL GAS\nPRO FORMA REVENUE UNDER PRESENT AND PROPOSED \"&O9&\" RATES\n12 MONTHS ENDED DECEMBER 31, 2018\"","v":"AVISTA UTILITIES\nWASHINGTON NATURAL GAS\nPRO FORMA REVENUE UNDER PRESENT AND PROPOSED BASE TARIFF RATES\n12 MONTHS ENDED DECEMBER 31, 2018"}]
[null,"THERMS",null,null,null,null,null,null,null,null,null,"1)","BASE TARIFF"]
["JDM-G-8","BLOCK 1",null,{"$f":"'Bill Determ'!E7","v":78130536.427342966},{"$f":"'Bill Determ'!B12","v":6375094.2101864293},{"$f":"'Bill Determ'!B29","v":17999.891669999983},{"$f":"'Bill Determ'!B36","v":240000},{"$f":"'Bill Determ'!B40","v":8493795},{"$f":"'Bill Determ'!B46","v":24532118},{"$f":"'Bill Determ'!B52","v":10599458},null,null,"or",null,1]
["JDM-G-8","BLOCK 2",null,{"$f":"'Bill Determ'!F7","v":45837805.662867025},{"$f":"'Bill Determ'!C12","v":16565126.557450794},{"$f":"'Bill Determ'!C29","v":17999.666660000003},{"$f":"'Bill Determ'!C36","v":304980},{"$f":"'Bill Determ'!C40","v":8514233},{"$f":"'Bill Determ'!B47","v":6237208},null,null,"2)","BILLING",null,{"$f":"CHOOSE(Base1_Billing2,M7,M9)","v":"BASE TARIFF"}]
["JDM-G-8","BLOCK 3",null,null,{"$f":"'Bill Determ'!D12","v":29697691.912542783},{"$f":"'Bill Determ'!D29","v":324000.22331999964},{"$f":"'Bill Determ'!D36","v":342272},{"$f":"'Bill Determ'!D40","v":13953929},{"$f":"'Bill Determ'!B48","v":2090525},null,null,null,null,null,{"$f":"CHOOSE(Base1_Billing2,\"Base\",\"Billing\")","v":"Base"}]
["JDM-G-8","BLOCK 4",null,null,null,{"$f":"'Bill Determ'!E29","v":536304.60407},{"$f":"'Bill Determ'!E36","v":98015},{"$f":"'Bill Determ'!E40","v":2746588},{"$f":"'Bill Determ'!B49","v":5652763}]
["JDM-G-8","BLOCK 5",null,null,null,{"$f":"'Bill Determ'!F29","v":743507.61600003822},null,{"$f":"'Bill Determ'!F40","v":1899391},{"$f":"'Bill Determ'!B43","v":5405533}]
[]
[null,"SUBTOTAL",{"$f":"SUM(D14:J14)","v":269356874.77211004},{"$f":"SUM(D8:D12)","v":123968342.09020999},52637912.680180006,1639812.0017200378,985267,{"$f":"SUM(H8:H12)","v":35607936},{"$f":"SUM(I8:I12)","v":43918147},10599458]
[null,"LOAD ADJUSTMENT"]
[]
[null,"SUBTOTAL",{"$f":"SUM(D17:J17)","v":269356874.77211004},{"$f":"D14+D15","v":123968342.09020999},52637912.680180006,1639812.0017200378,985267,{"$f":"H14+H15","v":35607936},43918147,10599458]
[null,"ADJUSTMENT TO ACTUAL",{"$f":"SUM(D18:J18)","v":0},{"$f":"'Bill Determ'!G9","v":0},{"$f":"'Bill Determ'!E17","v":0}]
[]
[null,"TOTAL BEFORE ADJUSTMENT",{"$f":"SUM(D20:J20)","v":269356874.77211004},{"$f":"D17+D18","v":123968342.09020999},52637912.680180006,1639812.0017200378,985267,{"$f":"H17+I18","v":35607936},{"$f":"I17+I18","v":43918147},10599458]
["JDM-G-3","WEATHER & UNBILLED REV. ADJ.",{"$f":"SUM(D21:J21)","v":6624790},{"$f":"D134+D137","v":5017638},{"$f":"E134+E137","v":1691893},{"$f":"F134+F137","v":-84741},0,{"$f":"H134+H137","v":0},0,0]
[]
[null,"TOTAL PROFORMA THERMS",{"$f":"IF(ROUND(SUM(C20:C21),3)<>ROUND(SUM(D23:J23),3),#VALUE!,SUM(D23:J23))","v":275981664.77211004},{"$f":"SUM(D20:D21)","v":128985980.09020999},54329805.680180006,1555071.0017200378,985267,{"$f":"SUM(H20:H21)","v":35607936},43918147,10599458]
[]
["JDM-G-8","TOTAL BILLS",null,{"$f":"'Bill Determ'!C7","v":1941495},null,null,{"$f":"'Bill Determ'!G36","v":24},{"$f":"'Bill Determ'!H40","v":480},{"$f":"'Bill Determ'!C50","v":48},{"$f":"'Bill Determ'!C52","v":12}]
["JDM-G-8","TOTAL MINIMUM BILLS",null,null,{"$f":"'Bill Determ'!F16","v":36840},{"$f":"'Bill Determ'!H29","v":36}]
[]
[" "]
[null,"PROPOSED BILL DETERMINANTS"]
[null,"THERMS"]
[null,"BLOCK 1",null,{"$f":"'Bill Determ'!E7","v":78130536.427342966},{"$f":"'Bill Determ'!B23","v":6382294.2101864293},null,{"$f":"G8","v":240000},8493795,24532118,10599458]
[null,"BLOCK 2",null,{"$f":"'Bill Determ'!F7","v":45837805.662867025},{"$f":"'Bill Determ'!C23","v":16593926.557450794},null,{"$f":"G9","v":304980},8514233,6237208,0]
[null,"BLOCK 3",null,{"$f":"D10","v":0},{"$f":"'Bill Determ'!D23","v":29322405.148542784},null,{"$f":"G10","v":342272},13953929,2090525,0]
[null,"BLOCK 4",null,{"$f":"D11","v":0},{"$f":"'Bill Determ'!E23","v":1235591.594},null,{"$f":"G11","v":98015},2746588,5652763,0]
[null,"BLOCK 5",null,{"$f":"D12","v":0},{"$f":"'Bill Determ'!F29","v":743507.61600003822},null,{"$f":"G12","v":0},1899391,5405533,0]
[]
[null,"SUBTOTAL",{"$f":"SUM(D37:J37)","v":269356875.21639001},{"$f":"SUM(D31:D35)","v":123968342.09020999},{"$f":"SUM(E31:E35)","v":54277725.126180045},0,985267,{"$f":"SUM(H31:H35)","v":35607936},{"$f":"SUM(I31:I35)","v":43918147},10599458]
[null,"NET SHIFTING ADJUSTMENT",{"$f":"SUM(D38:J38)","v":0},{"$f":"D15","v":0},0,0,0,{"$f":"H15","v":0},0,0]
[]
[null,"SUBTOTAL",{"$f":"SUM(D40:J40)","v":269356875.21639001},{"$f":"D37+D38","v":123968342.09020999},54277725.126180045,0,985267,{"$f":"H37+H38","v":35607936},43918147,10599458]
[null,"ADJUSTMENT TO ACTUAL",{"$f":"SUM(D41:J41)","v":0},{"$f":"D18","v":0},0,0,0,0,0,0]
[]
[null,"TOTAL BEFORE ADJUSTMENT",{"$f":"SUM(D43:J43)","v":269356875.21639001},{"$f":"D40+D41","v":123968342.09020999},54277725.126180045,0,985267,{"$f":"H40+H41","v":35607936},{"$f":"I40+I41","v":43918147},10599458]
[null,"WEATHER & UNBILLED REV. ADJ.",{"$f":"SUM(D44:J44)","v":6624790},{"$f":"D21","v":5017638},{"$f":"E21+F21","v":1607152},null,0,{"$f":"H21","v":0},0,0]
[]
[null,"TOTAL PROFORMA THERMS",{"$f":"IF(ROUND(SUM(C43:C44),3)<>ROUND(SUM(D46:J46),3),#VALUE!,SUM(D46:J46))","v":275981665.21639001},{"$f":"D43+D44","v":128985980.09020999},55884877.126180045,0,985267,{"$f":"H43+H44","v":35607936},43918147,10599458]
[]
[null,"TOTAL BILLS",null,{"$f":"D25","v":1941495},0,0,{"$f":"G25","v":24},{"$f":"H25","v":480},{"$f":"I25","v":48},{"$f":"J25","v":12}]
[null,"TOTAL MINIMUM BILLS",null,0,{"$f":"'Bill Determ'!H23","v":36876}]
[null,null,null,null,2,3,4,5,6,7]
[]
[null,null,null,null,null,null,null,null,null,"TRANSPORT"]
["WORK PAPER",null," ","GEN SERVICE","LRG GEN SVC","EX LRG GEN SVC","INTERRUPTIBLE","TRANSPORT","TRANSPORT","SCH 148 - WSU",null,null,{"$f":"\"selected in cell \"&CELL(\"address\",Base1_Billing2)&\":\"","v":"selected in cell $O$8:"}]
["REFERENCE",null,"TOTAL","SCHEDULE 101","SCHEDULE 111","SCHEDULE 121","SCHEDULE 131","SCHEDULE 146","SCHEDULE 148","ANN. MINIMUM",null,null,{"$f":"O10","v":"Base"}]
[null,"PRESENT RATES",null,null,null,null,null,null,-1,-2,null,null,{"$f":"\"Rates_\"&$M$54&\"_Present\"","v":"Rates_Base_Present"},null,"- range name where Present Rates table can be found"]
["JDM-G-13/14","BASIC CHARGE",null,{"$f":"INDEX(INDIRECT($M$55),$K56,D$50)","v":9.5},{"$f":"INDEX(INDIRECT($M$55),$K56,E$50)","v":0},0,0,550,200,26332,1,null,{"$f":"\"Rates_\"&$M$54&\"_Proposed\"","v":"Rates_Base_Proposed"},null,"- range name where Proposed Rates table can be found"]
["JDM-G-13/14","MONTHLY/ANNUAL MINIMUM",null,0,97.25,240.44,0,null,0,0,2]
[]
["JDM-G-13/14","BLOCK 1 PER THERM",null,{"$f":"INDEX(INDIRECT($M$55),$K59,D$50)","v":36.722999999999999},{"$f":"INDEX(INDIRECT($M$55),$K59,E$50)","v":0},0,24.655000000000001,9.69,2.8,1,3]
["JDM-G-13/14","BLOCK 2 PER THERM",null,47.728999999999999,33.353999999999999,34.85,19.792000000000002,8.6210000000000004,4.5,0,4]
["JDM-G-13/14","BLOCK 3 PER THERM",null,0,25.423999999999999,26.766999999999999,18.597999999999999,7.774,3.1680000000000001,0,5]
["JDM-G-13/14","BLOCK 4 PER THERM",null,0,0,21.692,18.202999999999999,7.1890000000000001,2.5,0,6]
["JDM-G-13/14","BLOCK 5 PER THERM",null,0,0,14.387,0,5.4029999999999996,2.0910000000000002,0,7]
[]
[null,"ADJUST TO ACTUAL PER THERM",null,{"$f":"(D118-D106-D107)/D17*100","v":40.792513876809842},{"$f":"(E118-E106-E107)/E17*100","v":24.840410332082502},{"$f":"(F118-F106-F107)/F17*100","v":19.2888971216349},{"$f":"(G118-G106-G107)/G17*100","v":20.403713917141243}]
[]
[]
[]
[]
[]
[]
[]
[null,"PROPOSED RATES"]
[null,"BASIC CHARGE",null,{"$f":"INDEX(INDIRECT($M$56),$K74,D$50)","v":9.5},{"$f":"INDEX(INDIRECT($M$56),$K74,E$50)","v":0},0,0,625,200,26332,1]
[null,"MONTHLY MINIMUM",null,0,107.56,0,0,0,0,0,2]
[]
[null,"BLOCK 1 PER THERM",null,{"$f":"INDEX(INDIRECT($M$56),$K77,D$50)","v":41.034999999999997},{"$f":"INDEX(INDIRECT($M$56),$K77,E$50)","v":0},0,27.007999999999999,10.494,2.8,1,3]
[null,"BLOCK 2 PER THERM",null,{"$f":"INDEX(INDIRECT($M$56),$K78,D$50)","v":53.332999999999998},36.158999999999999,0,21.681000000000001,9.3360000000000003,4.5,0,4]
[null,"BLOCK 3 PER THERM",null,0,27.562000000000001,0,20.373000000000001,8.4190000000000005,3.1680000000000001,0,5]
[null,"BLOCK 4 PER THERM",null,0,23.516999999999999,0,18.202999999999999,7.7850000000000001,2.5,0,6]
[null,"BLOCK 5 PER THERM",null,0,16.497,0,0,5.851,2.0910000000000002,0,7]
[]
[null,"ADJUST TO ACTUAL PER THERM",null,{"$f":"(D167-D155-D156)/D40*100","v":45.582236204207902},{"$f":"(E167-E155-E156)/E40*100","v":26.705742929171549},null,{"$f":"(G167-G155-G156)/G40*100","v":22.178216666142276}]
[]
[]
[]
[null,"(1) Block 1 - Kaiser-Trentwood - workpaper JDM-G-19"]
[null,"Block 2 - Lamb-Weston - workpaper JDM-G-21"]
[null,"Block 3 - Mutual Materials - workpaper JDM-G-25"]
[null,"Block 4 - Washington Potato - workpaper JDM-G-23"]
[null,"Block 5 - Avista Electric generating facilities billed at 2.091 cents/therm (Sch. 148 floor)"]
[]
[null,"(2) Monthly minimum / rate per therm - workpaper JDM-G-27"]
[]
[]
[]
[null,{"$f":"\"Note: Rates exclude Sch. 150 (Purch. Gas Cost Adj.)\"&IF(Base1_Billing2=2,\"Sch. 150 (Purch. Gas Cost Adj.), Sch. 155 (Gas Rate Adj.), and Sch. 191 (Public Purp. Rider Adj.)\",\"\")","v":"Note: Rates exclude Sch. 150 (Purch. Gas Cost Adj.)"}]
[]
[]
[]
[null,null,null,null,null,null,null,null,null,"TRANSPORT"]
["WORK PAPER",null," ","GEN SERVICE","LRG GEN SVC","EX LRG GEN SVC","INTERRUPTIBLE","TRANSPORT","TRANSPORT","SCH 148 - WSU"]
["REFERENCE",null,"TOTAL","SCHEDULE 101","SCHEDULE 111","SCHEDULE 121","SCHEDULE 131","SCHEDULE 146","SCHEDULE 148","ANN. MINIMUM"]
[null,"PRESENT REVENUE"]
[null,{"$f":"UPPER(CHOOSE(Base1_Billing2,$O$9,$O$10))&\" REVENUE\"","v":"BASE TARIFF REVENUE"}]
[null,"BASIC CHARGE",{"$f":"SUM(D106:J106)","v":19033786.5},{"$f":"D25*D56","v":18444202.5},0,0,0,{"$f":"H25*H56","v":264000},{"$f":"I25*I56","v":9600},{"$f":"J25*J56","v":315984}]
[null,"MONTHLY/ANNUAL MINIMUM",3621043.3026000001,{"$f":"D26*D57","v":0},{"$f":"E26*E57","v":3582690},{"$f":"F26*F57","v":8655.84},0,{"$f":"'Big Schedules'!W48","v":29697.462599999999},0,0]
[null,"BLOCK 1",30366991.509999998,{"$f":"ROUND(D8*D59/100,2)","v":28691876.890000001},{"$f":"ROUND(E8*E59/100,2)","v":0},0,59172,823048.74,{"$f":"ROUND(I8*I59/100,2)","v":686899.3},{"$f":"ROUND(J8*J59/100,2)","v":105994.58}]
[null,"BLOCK 2",28484379.48,21877926.260000002,5525132.3099999996,6272.88,60361.64,734012.03,280674.36,0]
[null,"BLOCK 3",8851728.3499999996,0,7550341.1900000004,86725.14,63655.75,1084778.44,{"$f":"ROUND(I10*I61/100,2)","v":66227.83},0]
[null,"BLOCK 4",472948.14999999991,{"$f":"ROUND(D11*D62/100,2)","v":0},0,116335.19,17841.669999999998,197452.21,141319.07999999999,0]
[null,"BLOCK 5",322622.24,{"$f":"ROUND(D12*D63/100,2)","v":0},0,106968.44,0,102624.1,113029.7,0]
[null,"ANNUAL MINIMUM",0,null,null,null,null,null,null,{"$f":"BFG!F11","v":0}]
[]
[null,"SUBTOTAL",{"$f":"IF(ROUND(SUM(D115:J115),3)<>ROUND(SUM(C106:C113),3),#VALUE!,SUM(D115:J115))","v":91153499.532600001},{"$f":"SUM(D106:D113)","v":69014005.650000006},16658163.5,324957.49,201031.06,{"$f":"SUM(H106:H113)","v":3235612.9826000002},1297750.27,{"$f":"SUM(J106:J113)","v":421978.58}]
[null,"NET SHIFTING ADJUSTMENT"]
[]
[null,"SUBTOTAL",{"$f":"SUM(D118:J118)","v":91153499.532600001},{"$f":"D115+D116","v":69014005.650000006},16658163.5,324957.49,201031.06,{"$f":"H115+H116","v":3235612.9826000002},1297750.27,421978.58]
[null,"ADJUST TO ACTUAL",{"$f":"SUM(D119:J119)","v":0},{"$f":"ROUND(D18*D65/100,2)","v":0},{"$f":"ROUND(E18*E65/100,2)","v":0},{"$f":"ROUND(F18*F65/100,2)","v":0},{"$f":"ROUND(G18*G65/100,2)","v":0},0,0,0]
[]
[null,{"$f":"\"TOTAL \"&UPPER(CHOOSE(Base1_Billing2,$O$9,$O$10))&\" REVENUE\"","v":"TOTAL BASE TARIFF REVENUE"},{"$f":"IF(ROUND(C118+C119,3)<>ROUND(SUM(D121:J121),3),#VALUE!,SUM(D121:J121))","v":91153499.532600001},{"$f":"D118+D119","v":69014005.650000006},16658163.5,324957.49,201031.06,{"$f":"H118+H119","v":3235612.9826000002},1297750.27,421978.58]
[]
[]
[null,"ADJUSTMENT REVENUE"]
[null,"UNBILLED REVENUE ADJUSTMENT"]
["JDM-G-15","UNBILLED LOAD THERMS",{"$f":"SUM(D126:J126)","v":-2539340},{"$f":"'12MEDEC18'!P204","v":-1839341},{"$f":"'12MEDEC18'!P205","v":-547180},{"$f":"'12MEDEC18'!P206","v":-152819}]
["JDM-G-2/5/6","UNBILLED LOAD RATE",null,{"$f":"D65","v":40.792513876809842},{"$f":"E65","v":24.840410332082502},{"$f":"F65","v":19.2888971216349}]
[null,"UNBILLED LOAD REVENUE",{"$f":"SUM(D128:J128)","v":-915712.29},{"$f":"ROUND(D126*D127/100,2)","v":-750313.43},{"$f":"ROUND(E126*E127/100,2)","v":-135921.76},{"$f":"ROUND(F126*F127/100,2)","v":-29477.1}]
[]
["JDM-G-14","WEATHER-SENSITIVE THERMS",{"$f":"SUM(D130:J130)","v":0},0,0]
["JDM-G-2/5","WEATHER-SENSITIVE RATE",null,{"$f":"D59","v":36.722999999999999},{"$f":"I230","v":26.304589794761945}]
[null,"WEATHER-SENSITIVE REVENUE",{"$f":"SUM(D132:J132)","v":0},{"$f":"ROUND(D130*D131/100,2)","v":0},{"$f":"ROUND(E130*E131/100,2)","v":0}]
[]
[null,"TOTAL UNBILLED THERM ADJ",{"$f":"IF(ROUND(SUM(D134:J134),3)<>ROUND(C126+C130,3),#VALUE!,SUM(D134:J134))","v":-2539340},{"$f":"D126+D130","v":-1839341},{"$f":"E126+E130","v":-547180},{"$f":"F126+F130","v":-152819}]
[null,"TOTAL UNBILLED REVENUE ADJ",{"$f":"IF(ROUND(SUM(D135:J135),3)<>ROUND(C128+C132,3),#VALUE!,SUM(D135:J135))","v":-915712.29},{"$f":"D128+D132","v":-750313.43},{"$f":"E128+E132","v":-135921.76},{"$f":"F128+F132","v":-29477.1}]
[null,"WEATHER NORMALIZATION ADJ"]
["JDM-G-17","WEATHER-SENSITIVE THERMS",{"$f":"SUM(D137:J137)","v":9164130},6856979,2239073,68078]
["JDM-G-2/5/6","WEATHER-SENSITIVE RATE",null,{"$f":"I208","v":41.832859958892833},{"$f":"I230","v":26.304589794761945},{"$f":"I260","v":17.349581688404527}]
[null,"WEATHER-SENSITIVE REVENUE",{"$f":"SUM(D139:J139)","v":3469260.6399999997},{"$f":"ROUND(D137*D138/100,2)","v":2868470.42},{"$f":"ROUND(E137*E138/100,2)","v":588978.97},{"$f":"ROUND(F137*F138/100,2)","v":11811.25}]
[null,"OTHER ADJUSTMENTS"]
[]
[null,"TOTAL ADJUSTMENT REVENUE",{"$f":"IF(ROUND(SUM(D142:J142),3)<>ROUND(C135+C139+C140,3),#VALUE!,SUM(D142:J142))","v":2553548.3499999996},{"$f":"D135+D139+D140","v":2118156.9899999998},{"$f":"E135+E139+E140","v":453057.20999999996},{"$f":"F135+F139+F140","v":-17665.849999999999},0,0,0,0]
[null,{"$f":"B121","v":"TOTAL BASE TARIFF REVENUE"},{"$f":"SUM(D143:J143)","v":91153499.532600001},{"$f":"D121","v":69014005.650000006},16658163.5,324957.49,201031.06,{"$f":"H121","v":3235612.9826000002},1297750.27,421978.58]
[]
[null,"TOTAL PRESENT REVENUE",{"$f":"IF(ROUND(SUM(D145:J145),3)<>ROUND(C142+C143,3),#VALUE!,SUM(D145:J145))","v":93707047.882599995},{"$f":"D142+D143","v":71132162.640000001},17111220.710000001,{"$f":"F142+F143","v":307291.64},201031.06,{"$f":"H142+H143","v":3235612.9826000002},1297750.27,421978.58]
[]
[]
[]
[]
[null,null,null,null,null,null,null,null,null,"TRANSPORT"]
["WORK PAPER",null," ","GEN SERVICE","LRG GEN SVC","EX LRG GEN SVC","INTERRUPTIBLE","TRANSPORT","TRANSPORT","SCH 148 - WSU"]
["REFERENCE",null,"TOTAL","SCHEDULE 101","SCHEDULE 111","SCHEDULE 121","SCHEDULE 131","SCHEDULE 146","SCHEDULE 148","ANN. MINIMUM"]
[null,"PROPOSED REVENUE"]
[null,{"$f":"UPPER(CHOOSE(Base1_Billing2,$O$9,$O$10))&\" REVENUE\"","v":"BASE TARIFF REVENUE"}]
[null,"BASIC CHARGE",{"$f":"SUM(D155:J155)","v":19069786.5},{"$f":"D48*D74","v":18444202.5},{"$f":"E48*E74","v":0},0,0,300000,9600,315984]
[null,"MONTHLY/ANNUAL MINIMUM",3997517.3731200001,{"$f":"D49*D75","v":0},{"$f":"E49*E75","v":3966382.56},0,0,{"$f":"'Big Schedules'!X48","v":31134.813120000003},0,0]
[null,"BLOCK 1",33809917.549999997,{"$f":"ROUND(D31*D77/100,2)","v":32060865.620000001},{"$f":"ROUND(E31*E77/100,2)","v":0},0,64819.199999999997,891338.85,686899.3,105994.58]
[null,"BLOCK 2",31588560.649999999,{"$f":"ROUND(D32*D78/100,2)","v":24446676.890000001},6000197.9000000004,0,66122.710000000006,794888.79,280674.36,0]
[null,"BLOCK 3",9392581.4900000002,0,8081841.3099999996,0,69731.070000000007,1174781.28,66227.83,0]
[null,"BLOCK 4",663556.71,0,290574.08000000002,0,17841.669999999998,213821.88,141319.07999999999,0]
[null,"BLOCK 5",346819.52,0,122656.45,0,0,111133.37,113029.7,0]
[null,"ANNUAL MINIMUM",0,null,null,null,null,null,null,{"$f":"BFG!F11","v":0}]
[]
[null,"SUBTOTAL",{"$f":"IF(ROUND(SUM(D164:J164),3)<>ROUND(SUM(C155:C162),3),#VALUE!,SUM(D164:J164))","v":98868739.793119997},{"$f":"SUM(D155:D163)","v":74951745.010000005},18461652.299999997,0,218514.65000000002,{"$f":"SUM(H155:H163)","v":3517098.98312},1297750.27,421978.58]
[null,"NET SHIFTING ADJUSTMENT"]
[]
[null,"SUBTOTAL",{"$f":"SUM(D167:J167)","v":98868739.793119997},{"$f":"D164+D165","v":74951745.010000005},18461652.299999997,0,218514.65000000002,{"$f":"H164+H165","v":3517098.98312},1297750.27,421978.58]
[null,"ADJUST TO ACTUAL",{"$f":"SUM(D168:J168)","v":0},{"$f":"ROUND(D41*D83/100,2)","v":0},{"$f":"ROUND(E41*E83/100,2)","v":0},null,0,0,0,0]
[]
[null,{"$f":"\"TOTAL \"&UPPER(CHOOSE(Base1_Billing2,$O$9,$O$10))&\" REVENUE\"","v":"TOTAL BASE TARIFF REVENUE"},{"$f":"IF(ROUND(SUM(D170:J170),3)<>ROUND(C167+C168,3),#VALUE!,SUM(D170:J170))","v":98868739.793119997},{"$f":"D167+D168","v":74951745.010000005},18461652.299999997,0,218514.65000000002,{"$f":"H167+H168","v":3517098.98312},1297750.27,421978.58]
[]
[null,"ADJUSTMENT REVENUE"]
[null,"UNBILLED REVENUE ADJUSTMENT"]
[null,"BASE LOAD THERMS",{"$f":"SUM(D174:J174)","v":-2539340},{"$f":"D126","v":-1839341},{"$f":"E126+F126","v":-699999},0]
["JDM-G-2/5/6","BASE LOAD RATE",null,{"$f":"D83","v":45.582236204207902},{"$f":"E83","v":26.705742929171549}]
[null,"BASE LOAD REVENUE",{"$f":"SUM(D176:J176)","v":-1025352.69},{"$f":"ROUND(D174*D175/100,2)","v":-838412.76},{"$f":"ROUND(E174*E175/100,2)","v":-186939.93},{"$f":"ROUND(F174*F175/100,2)","v":0}]
[]
[null,"WEATHER-SENSITIVE THERMS",{"$f":"SUM(D178:J178)","v":0},{"$f":"D130","v":0},{"$f":"E130","v":0},{"$f":"F130","v":0}]
["JDM-G-2/5","WEATHER-SENSITIVE RATE",null,{"$f":"D77","v":41.034999999999997},{"$f":"I242","v":28.531476699503383},{"$f":"F83","v":0}]
[null,"WEATHER-SENSITIVE REVENUE",{"$f":"SUM(D180:J180)","v":0},{"$f":"ROUND(D178*D179/100,2)","v":0},{"$f":"ROUND(E178*E179/100,2)","v":0},{"$f":"ROUND(F178*F179/100,2)","v":0}]
[]
[null,"TOTAL UNBILLED THERM ADJ",{"$f":"C174+C178","v":-2539340},{"$f":"D174+D178","v":-1839341},{"$f":"E174+E178","v":-699999},{"$f":"F174+F178","v":0}]
[null,"TOTAL UNBILLED REVENUE ADJ",{"$f":"C176+C180","v":-1025352.69},{"$f":"D176+D180","v":-838412.76},{"$f":"E176+E180","v":-186939.93}]
[null,"WEATHER NORMALIZATION ADJ"]
[null,"WEATHER-SENSITIVE THERMS",{"$f":"SUM(D185:J185)","v":9164130},{"$f":"D137","v":6856979},{"$f":"E137+F137","v":2307151},0]
["JDM-G-2/5/6","WEATHER-SENSITIVE RATE",null,{"$f":"I217","v":46.744709047289113},{"$f":"I242","v":28.531476699503383}]
[null,"WEATHER-SENSITIVE REVENUE",{"$f":"SUM(D187:J187)","v":3863539.13},{"$f":"ROUND(D185*D186/100,2)","v":3205274.88},{"$f":"ROUND(E185*E186/100,2)","v":658264.25},{"$f":"ROUND(F185*F186/100,2)","v":0}]
[null,"OTHER ADJUSTMENTS"]
[]
[null,"TOTAL ADJUSTMENT REVENUE",{"$f":"SUM(D190:J190)","v":2838186.44},{"$f":"D187+D183","v":2366862.12},{"$f":"E187+E183","v":471324.32},0,0,{"$f":"H187+H183","v":0},0,0]
[null,{"$f":"B170","v":"TOTAL BASE TARIFF REVENUE"},{"$f":"SUM(D191:J191)","v":98868739.793119997},{"$f":"D170","v":74951745.010000005},18461652.299999997,0,218514.65000000002,{"$f":"H170","v":3517098.98312},1297750.27,421978.58]
[null,"TOTAL PROPOSED REVENUE",{"$f":"SUM(D192:J192)","v":101706926.23311999},{"$f":"D190+D191","v":77318607.13000001},18932976.619999997,0,218514.65000000002,{"$f":"H190+H191","v":3517098.98312},1297750.27,421978.58]
[null,"TOTAL PRESENT REVENUE",{"$f":"SUM(D193:J193)","v":93707047.882599995},{"$f":"D145","v":71132162.640000001},{"$f":"E145","v":17111220.710000001},{"$f":"+F145","v":307291.64},201031.06,{"$f":"H145","v":3235612.9826000002},1297750.27,421978.58]
[]
[null,"TOTAL INCREASED REVENUE",{"$f":"SUM(D195:J195)","v":7999878.3505200054},{"$f":"D192-D193","v":6186444.4900000095},{"$f":"E192-E193-F193","v":1514464.2699999963},null,{"$f":"G192-G193","v":17483.590000000026},{"$f":"H192-H193","v":281486.00051999977},0,0]
[null,"PERCENT REVENUE INCREASE",{"$f":"C195/C193","v":8.5371149036117103E-2},{"$f":"D195/D193","v":8.6971128957650509E-2},8.8507085243481512E-2,null,8.6969595643578784E-2,8.6996189604174989E-2,0,0]
[]
[]
[]
["WORK PAPER",null," ","TOTAL","TOTAL","BASE LOAD","BASE LOAD","WTHR-SENS.","WTHR-SENS."]
["REFERENCE",null,"RATES","THERMS","REVENUE","THERMS(1)","REVENUE","THERMS","REVENUE"]
[null,"PRESENT BASELOAD AND WEATHER-SENSITIVE RATE"]
[null,"SCHEDULE 101"]
[null,"0-70 THERMS",{"$f":"D59","v":36.722999999999999},{"$f":"D8","v":78130536.427342966},{"$f":"C204*D204/100","v":28691876.892213158},{"$f":"MIN(D204,F207)","v":25239435},{"$f":"F204*C204/100","v":9268677.7150500007},{"$f":"D204-F204","v":52891101.427342966},{"$f":"H204*C204/100","v":19423199.177163158},null,{"$f":"H204/H207","v":0.53572051981711521}]
[null,"OVER 70 THERMS",{"$f":"D60","v":47.728999999999999},{"$f":"D9","v":45837805.662867025},{"$f":"C205*D205/100","v":21877926.264829803},{"$f":"MIN(F207-F204,D205)","v":0},{"$f":"F205*C205/100","v":0},{"$f":"D205-F205","v":45837805.662867025},{"$f":"H205*C205/100","v":21877926.264829803},null,{"$f":"H205/H207","v":0.46427948018288479}]
[]
[null,"TOTAL",null,{"$f":"D204+D205","v":123968342.09020999},{"$f":"E204+E205","v":50569803.157042965},{"$f":"13*D25","v":25239435},{"$f":"G204+G205","v":9268677.7150500007},{"$f":"H204+H205","v":98728907.090209991},{"$f":"I204+I205","v":41301125.441992961}]
[null,"AVERAGE RATE",null,null,{"$f":"E207/D207*100","v":40.7925138824911},null,{"$f":"G207/F207*100","v":36.722999999999999},null,{"$f":"I207/H207*100","v":41.832859958892833}]
[]
[]
[null,"PROPOSED BASELOAD AND WEATHER-SENSITIVE RATE"]
[null,"SCHEDULE 101"]
[null,"0-70 THERMS",{"$f":"D77","v":41.034999999999997},{"$f":"D8","v":78130536.427342966},{"$f":"C213*D213/100","v":32060865.62296018},{"$f":"MIN(D213,F216)","v":25239435},{"$f":"F213*C213/100","v":10357002.152249999},{"$f":"D213-F213","v":52891101.427342966},{"$f":"H213*C213/100","v":21703863.470710181}]
[null,"OVER 70 THERMS",{"$f":"D78","v":53.332999999999998},{"$f":"D9","v":45837805.662867025},{"$f":"C214*D214/100","v":24446676.894176871},{"$f":"MIN(F216-F213,D214)","v":0},{"$f":"F214*C214/100","v":0},{"$f":"D214-F214","v":45837805.662867025},{"$f":"H214*C214/100","v":24446676.894176871}]
[]
[null,"TOTAL",null,{"$f":"D213+D214","v":123968342.09020999},{"$f":"E213+E214","v":56507542.517137051},{"$f":"F207","v":25239435},{"$f":"G213+G214","v":10357002.152249999},{"$f":"H213+H214","v":98728907.090209991},{"$f":"I212+I213+I214","v":46150540.364887051}]
[null,"AVERAGE RATE",null,null,{"$f":"E216/D216*100","v":45.582236209965053},null,{"$f":"G216/F216*100","v":41.034999999999997},null,{"$f":"I216/H216*100","v":46.744709047289113}]
[]
[]
[null,"(1) Base load per bill for Schedule 101 is shown on workpaper JDM-G-18 multiplied by total billings from JDM-G-1, or"]
[null,{"$f":"\"13 X \"&TEXT(D25,\"#,##0\")&\" = \"&TEXT(F207,\"#,##0\")","v":"13 X 1,941,495 = 25,239,435"}]
[]
[null,"PRESENT BASELOAD AND WEATHER-SENSITIVE RATE"]
[null,"SCHEDULE 111"]
[null,"0-200 THERMS",{"$f":"E59","v":0},{"$f":"E8","v":6375094.2101864293},{"$f":"C225*D225/100","v":0},{"$f":"MIN(D225,F229)","v":6375094.2101864293},{"$f":"F225*C225/100","v":0},{"$f":"D225-F225","v":0},{"$f":"H225*C225/100","v":0}]
[null,"201-1,000 THERMS",{"$f":"E60","v":33.353999999999999},{"$f":"E9","v":16565126.557450794},{"$f":"C226*D226/100","v":5525132.3119721375},{"$f":"MIN(F229-F225,D226)","v":12855385.789813571},{"$f":"F226*C226/100","v":4287785.3763344176},{"$f":"D226-F226","v":3709740.767637223},{"$f":"H226*C226/100","v":1237346.9356377192}]
[null,"OVER 1,000 THERMS",{"$f":"E61","v":25.423999999999999},{"$f":"E10","v":29697691.912542783},{"$f":"C227*D227/100","v":7550341.1918448769},{"$f":"MIN(F229-F225-F226,D227)","v":0},{"$f":"F227*C227/100","v":0},{"$f":"D227-F227","v":29697691.912542783},{"$f":"H227*C227/100","v":7550341.1918448769}]
[]
[null,"TOTAL",null,{"$f":"D225+D226+D227","v":52637912.680180006},{"$f":"E225+E226+E227","v":13075473.503817014},{"$f":"522*E26","v":19230480},{"$f":"G225+G226+G227","v":4287785.3763344176},{"$f":"H225+H226+H227","v":33407432.680180006},{"$f":"I225+I226+I227","v":8787688.1274825968}]
[null,"AVERAGE RATE",null,null,{"$f":"E229/D229*100","v":24.840410339333957},null,{"$f":"G229/F229*100","v":22.296819301101259},null,{"$f":"I229/H229*100","v":26.304589794761945}]
[]
[]
[null,"PROPOSED BASELOAD AND WEATHER-SENSITIVE RATE"]
[null,"SCHEDULE 111"]
[null,"0-200 THERMS",{"$f":"E77","v":0},{"$f":"E31","v":6382294.2101864293},{"$f":"C235*D235/100","v":0},{"$f":"MIN(D235,F241)","v":6382294.2101864293},{"$f":"F235*C235/100","v":0},{"$f":"D235-F235","v":0},{"$f":"H235*C235/100","v":0}]
[null,"201-1,000 THERMS",{"$f":"E78","v":36.158999999999999},{"$f":"E32","v":16593926.557450794},{"$f":"C236*D236/100","v":6000197.9039086318},{"$f":"MIN(F241-F235,D236)","v":12866977.789813571},{"$f":"F236*C236/100","v":4652570.4990186887},{"$f":"D236-F236","v":3726948.767637223},{"$f":"H236*C236/100","v":1347627.4048899433}]
[null,"1001-10,000 THERMS",{"$f":"E79","v":27.562000000000001},{"$f":"E33","v":29322405.148542784},{"$f":"C237*D237/100","v":8081841.3070413629},{"$f":"MIN(F241-F235-F236,D237)","v":0},{"$f":"F237*C237/100","v":0},{"$f":"D237-F237","v":29322405.148542784},{"$f":"H237*C237/100","v":8081841.3070413629}]
[null,"10,001-25,000 THERMS",{"$f":"E80","v":23.516999999999999},{"$f":"E34","v":1235591.594},{"$f":"C238*D238/100","v":290574.07516097999},{"$f":"MIN(F241-F235-F236-F237,D238)","v":0},{"$f":"F238*C238/100","v":0},{"$f":"D238-F238","v":1235591.594},{"$f":"H238*C238/100","v":290574.07516097999}]
[null,"OVER 25,000 THERMS",16.497,743507.61600003822,122656.4514115263,{"$f":"MIN(F241-F235-F236-F237-F238,D239)","v":0},{"$f":"F239*C239/100","v":0},{"$f":"D239-F239","v":743507.61600003822},{"$f":"H239*C239/100","v":122656.4514115263}]
[]
[null,"TOTAL",null,{"$f":"D235+D236+D237+D238+D239","v":54277725.126180045},{"$f":"E235+E236+E237+E238+E239","v":14495269.737522501},{"$f":"522*E49","v":19249272},{"$f":"G235+G236+G237","v":4652570.4990186887},{"$f":"H235+H236+H237","v":33049353.916180007},{"$f":"I234+I235+I236+I237","v":9429468.7119313069}]
[null,"AVERAGE RATE",null,null,{"$f":"E241/D241*100","v":26.705742924607069},null,{"$f":"G241/F241*100","v":24.170111467169715},null,{"$f":"I241/H241*100","v":28.531476699503383}]
[]
[]
[null,"(1) Base load per bill for Schedule 111 is shown on workpaper JDM-G-18 multiplied by total billings from JDM-G-1, or"]
[null,{"$f":"\"522 X \"&TEXT(E26,\"#,##0\")&\" = \"&TEXT(F229,\"#,##0\")","v":"522 X 36,840 = 19,230,480"}]
[]
["WORK PAPER",null," ","TOTAL","TOTAL","BASE LOAD","BASE LOAD","WTHR-SENS.","WTHR-SENS."]
["REFERENCE",null,"RATES","THERMS","REVENUE","THERMS(1)","REVENUE","THERMS","REVENUE"]
[]
[null,"PRESENT BASELOAD AND WEATHER-SENSITIVE RATE"]
[null,"SCHEDULE 121"]
[null,"0-500 THERMS",{"$f":"F59","v":0},{"$f":"F8","v":17999.891669999983},{"$f":"C253*D253/100","v":0},{"$f":"MIN(D253,F259)","v":17999.891669999983},{"$f":"F253*C253/100","v":0},{"$f":"D253-F253","v":0},{"$f":"H253*C253/100","v":0}]
[null,"501-1,000 THERMS",{"$f":"F60","v":34.85},{"$f":"F9","v":17999.666660000003},{"$f":"C254*D254/100","v":6272.8838310100009},{"$f":"MIN(F259-F253,D254)","v":17999.666660000003},{"$f":"F254*C254/100","v":6272.8838310100009},{"$f":"D254-F254","v":0},{"$f":"H254*C254/100","v":0}]
[null,"1001-10,000 THERMS",{"$f":"F61","v":26.766999999999999},324000.22331999964,{"$f":"C255*D255/100","v":86725.139776064301},{"$f":"MIN(F259-F253-F254,D255)","v":324000.22331999964},{"$f":"F255*C255/100","v":86725.139776064301},{"$f":"D255-F255","v":0},{"$f":"H255*C255/100","v":0}]
[null,"10,001-25,000 THERMS",{"$f":"F62","v":21.692},536304.60407,{"$f":"C256*D256/100","v":116335.1947148644},{"$f":"MIN(F259-F253-F254-F255,D256)","v":29052.218350000388},{"$f":"F256*C256/100","v":6302.0072044820836},{"$f":"D256-F256","v":507252.38571999961},{"$f":"H256*C256/100","v":110033.18751038231}]
[null,"OVER 25,000 THERMS",{"$f":"F63","v":14.387},743507.61600003822,106968.44071392551,{"$f":"MIN(F259-F253-F254-F255-F256,D257)","v":0},0,743507.61600003822,106968.44071392551]
[]
[null,"TOTAL",null,{"$f":"D253+D254+D255+D256+D257","v":1639812.0017200378},{"$f":"E253+E254+E255+E256+E257","v":316301.65903586423},{"$f":"10807*F26","v":389052},{"$f":"G253+G254+G255","v":92998.023607074298},{"$f":"H253+H254+H255+H256+H257","v":1250760.0017200378},{"$f":"I253+I254+I255+I256+I257","v":217001.62822430782}]
[null,"AVERAGE RATE",null,null,{"$f":"E259/D259*100","v":19.288897672665399},null,{"$f":"G259/F259*100","v":23.903751582583897},null,{"$f":"I259/H259*100","v":17.349581688404527}]
[]
[]
[null,"PROPOSED BASELOAD AND WEATHER-SENSITIVE RATE"]
[null,"SCHEDULE 121"]
[null,"0-500 THERMS",{"$f":"F77","v":0},{"$f":"F31","v":0},{"$f":"C265*D265/100","v":0},{"$f":"MIN(D265,F271)","v":0},{"$f":"F265*C265/100","v":0},{"$f":"D265-F265","v":0},{"$f":"H265*C265/100","v":0}]
[null,"501-1,000 THERMS",{"$f":"F78","v":0},{"$f":"F32","v":0},{"$f":"C266*D266/100","v":0},{"$f":"MIN(F271-F265,D266)","v":0},{"$f":"F266*C266/100","v":0},{"$f":"D266-F266","v":0},{"$f":"H266*C266/100","v":0}]
[null,"1001-10,000 THERMS",{"$f":"F79","v":0},{"$f":"F33","v":0},0,{"$f":"MIN(F271-F265-F266,D267)","v":0},{"$f":"F267*C267/100","v":0},0,0]
[null,"10,001-25,000 THERMS",{"$f":"F80","v":0},{"$f":"F34","v":0},0,{"$f":"MIN(F271-F265-F266-F267,D268)","v":0},{"$f":"F268*C268/100","v":0},0,0]
[null,"OVER 25,000 THERMS",{"$f":"F81","v":0},{"$f":"F35","v":0},0,{"$f":"MIN(F271-F265-F266-F267-F268,D269)","v":0},0,0,0]
[]
[null,"TOTAL",null,{"$f":"D265+D266+D267+D268+D269","v":0},{"$f":"E265+E266+E267+E268+E269","v":0},{"$f":"F259","v":389052},{"$f":"G265+G266+G267+G268+G269","v":0},{"$f":"H265+H266+H267+H268+H269","v":0},{"$f":"I264+I265+I266+I267+I268+I269","v":0}]
[null,"AVERAGE RATE",null,null,{"$f":"E271/D271*100","v":{"$error":"#DIV/0!"}},null,{"$f":"G271/F271*100","v":0},null,{"$f":"I271/H271*100","v":{"$error":"#DIV/0!"}}]
[]
[null,"(1) Base load per bill for Schedule 121 is shown on workpaper JDM-G-18 multiplied by total billings from JDM-G-1, or"]
[null,{"$f":"\"10,807 X \"&TEXT(F26,\"#,##0\")&\" = \"&TEXT(F259,\"#,##0\")","v":"10,807 X 36 = 389,052"}]

{"sheet":"Rate Design","index":1,"n_rows":122,"n_cols":22,"rows_kept":122,"cut":false,"hidden":false,"merged":[]}
["PRESENT RATES",null,null,1,2,3,4,5,null,null,null,"Tiers - used for bill comparisons"]
[null,null,"TOTAL","SCH. 101","SCH. 111,112,116","SCH. 121,122,126","SCH. 132","SCH. 146",null,"Range Name",null,"SCH. 101","SCH. 111,112","SCH. 121,122","SCH. 131,132","SCH. 146"]
[null,"Base Tariff Rates"]
[1,"BASIC CHARGE",null,9.5,null,null,null,550]
[2,"MONTHLY MINIMUM",null,null,97.25,240.44]
[3,"BLOCK 1 PER THERM",null,36.722999999999999,0,0,24.655000000000001,9.69,null,null,null,9999999,200,500,10000,20000]
[4,"BLOCK 2 PER THERM",null,47.728999999999999,33.353999999999999,34.85,19.792000000000002,8.6210000000000004,{"$f":"H7/H6-1","v":-0.11031991744066039},null,null,9999999,1000,1000,25000,50000]
[5,"BLOCK 3 PER THERM",null,null,25.423999999999999,26.766999999999999,18.597999999999999,7.774,{"$f":"H8/H7-1","v":-9.8248463055330082E-2},"Rates_Base_Present",null,9999999,9999999,10000,50000,300000]
[6,"BLOCK 4 PER THERM",null,null,null,21.692,18.202999999999999,7.1890000000000001,-7.5250836120401288E-2,null,null,9999999,9999999,25000,9999999,500000]
[7,"BLOCK 5 PER THERM",null,null,null,14.387,null,5.4029999999999996,{"$f":"H10/H9-1","v":-0.24843510919460288},null,null,9999999,9999999,9999999,9999999,9999999]
[null,null,null,null,null,null,null,null,null,null,null,"1st block rate",{"$f":"(M6/100*E6+E5)/M6*100","v":48.625},{"$f":"(N6/100*F6+F5)/N6*100","v":48.087999999999994}]
[null,"Billing Rates",null,null,null,null,{"$f":"IF(G13<>'Pres & Prop Rev'!G$5,#VALUE!,\"\")","v":""},{"$f":"IF(H13<>'Pres & Prop Rev'!H$5,#VALUE!,\"\")","v":""},null,null,null,"check",{"$f":"M6*M11/100-(M6*E6/100+E5)","v":0},{"$f":"N6*N11/100-(N6*F6/100+F5)","v":0}]
[null,null,null,"SCHEDULE 101","SCH. 111&112","SCH. 121&122","SCH. 131&132","SCHEDULE 146"]
[1,"BASIC CHARGE",null,{"$f":"D4","v":9.5},0,0,0,550]
[2,"MONTHLY MINIMUM",null,0,{"$f":"E5","v":97.25},{"$f":"F5","v":240.44},0,0]
[3,"BLOCK 1 PER THERM",null,{"$f":"D6+26.15+0.429+0.42+3.028+2.093","v":68.843000000000004},{"$f":"E6+25.181+1.085+1.841+1.626+1.754","v":31.487000000000005},{"$f":"F6+25.181+1.085+1.841+1.276+1.602","v":30.985000000000003},{"$f":"G6+21.892+1.132+1.539","v":49.217999999999996},{"$f":"H6+0.056+0.08","v":9.8259999999999987},null,null,null,{"$f":"L6","v":9999999},200,500,10000,20000]
[4,"BLOCK 2 PER THERM",null,{"$f":"D7+26.15+0.429+0.42+3.028+2.093","v":79.849000000000004},{"$f":"E7+25.181+1.085+1.841+1.626+1.754","v":64.840999999999994},{"$f":"F7+25.181+1.085+1.841+1.276+1.602","v":65.835000000000008},{"$f":"G7+21.892+1.132+1.539","v":44.354999999999997},{"$f":"H7+0.056+0.08","v":8.7569999999999997},null,null,null,9999999,1000,1000,25000,50000]
[5,"BLOCK 3 PER THERM",null,{"$f":"D8","v":0},56.911000000000001,57.752000000000002,43.160999999999994,7.91,null,"Rates_Billing_Present",null,9999999,9999999,10000,50000,300000]
[6,"BLOCK 4 PER THERM",null,{"$f":"D9","v":0},{"$f":"E9","v":0},52.677000000000007,42.765999999999998,7.3250000000000002,null,null,null,{"$f":"L9","v":9999999},9999999,25000,9999999,500000]
[7,"BLOCK 5 PER THERM",null,{"$f":"D10","v":0},{"$f":"E10","v":0},45.372,null,5.5389999999999997,null,null,null,9999999,9999999,9999999,9999999,9999999]
[null,null,null,null,null,null,null,null,null,null,null,"1st block rate",{"$f":"(M16/100*E16+E15)/M16*100","v":80.112000000000009},{"$f":"(N16/100*F16+F15)/N16*100","v":79.073000000000008}]
["PROPOSED RATES",null,null,null,null,null,null,null,null,null,null,"check",{"$f":"M16*M21/100-(M16*E16/100+E15)","v":0},{"$f":"N16*N21/100-(N16*F16/100+F15)","v":0}]
[]
[null,"Base Tariff Rates",null,null,null,null,{"$f":"IF(G25<>'Pres & Prop Rev'!G$5,#VALUE!,\"\")","v":""},{"$f":"IF(H25<>'Pres & Prop Rev'!H$5,#VALUE!,\"\")","v":""}]
[null,null,null,"SCHEDULE 101","SCH. 111&112","SCH. 121&122","SCH. 131&132","SCHEDULE 146"]
[1,"BASIC CHARGE",null,{"$f":"IF(D4>0,ROUND(D63,2),0)","v":9.5},{"$f":"IF(E4>0,ROUND(E63,2),0)","v":0},{"$f":"IF(F4>0,ROUND(F63,2),0)","v":0},{"$f":"IF(G4>0,ROUND(G63,2),0)","v":0},{"$f":"IF(H4>0,ROUND(H63,2),0)","v":625}]
[2,"MONTHLY MINIMUM",null,{"$f":"IF(D5>0,ROUND(D63,2),0)","v":0},{"$f":"IF(E5>0,ROUND(E63,2),0)","v":107.56},{"$f":"IF(F5>0,ROUND(F63,2),0)","v":0},{"$f":"IF(G5>0,ROUND(G63,2),0)","v":0},{"$f":"IF(H5>0,ROUND(H63,2),0)","v":0}]
[2,"BLOCK 1 PER THERM",null,{"$f":"ROUND(D82,3)","v":41.034999999999997},{"$f":"ROUND(E82,3)","v":0},0,27.007999999999999,10.494,null,null,null,9999999,200,500,10000,20000]
[3,"BLOCK 2 PER THERM",null,{"$f":"ROUND(D83,3)","v":53.332999999999998},36.158999999999999,0,21.681000000000001,9.3360000000000003,{"$f":"H29/H28-1","v":-0.11034877072612914},null,null,9999999,1000,1000,25000,50000]
[4,"BLOCK 3 PER THERM",null,0,{"$f":"ROUND(E84,3)","v":27.562000000000001},0,20.373000000000001,8.4190000000000005,{"$f":"H30/H29-1","v":-9.8221936589545811E-2},"Rates_Base_Proposed",null,9999999,9999999,10000,50000,300000]
[5,"BLOCK 4 PER THERM",null,{"$f":"ROUND(D85,3)","v":0},{"$f":"ROUND(E85,3)","v":23.516999999999999},0,18.202999999999999,7.7850000000000001,-7.5305855802351829E-2,null,null,9999999,9999999,25000,9999999,500000]
[6,"BLOCK 5 PER THERM",null,0,16.497,0,0,5.851,{"$f":"H32/H31-1","v":-0.2484264611432242},null,null,9999999,9999999,9999999,9999999,9999999]
[null,null,null,null,null,null,null,null,null,null,null,"1st block rate",{"$f":"(M28/100*E28+E27)/M28*100","v":53.780000000000008},{"$f":"(N28/100*F28+F27)/N28*100","v":0}]
[null,"Billing Rates",null,null,null,null,{"$f":"IF(G35<>'Pres & Prop Rev'!G$5,#VALUE!,\"\")","v":""},{"$f":"IF(H35<>'Pres & Prop Rev'!H$5,#VALUE!,\"\")","v":""},null,null,null,"check",{"$f":"M28*M33/100-(M28*E28/100+E27)","v":0},{"$f":"N28*N33/100-(N28*F28/100+F27)","v":0}]
[null,null,null,"SCHEDULE 101","SCH. 111&112","SCH. 121&122","SCH. 131&132","SCHEDULE 146",null,null,null,"Basic Charge Calc",{"$f":"E5+(D26-D4)+(((D28/100)-(D6/100))*70)+(((D29/100)-(D7/100))*130)","v":107.5536},{"$f":"F5+(D26-D4)+(70*((D28/100)-(D6/100)))+(430*((D29/100)-(D7/100)))","v":267.55559999999997},null,null,null,null,100]
[1,"BASIC CHARGE",null,{"$f":"D26","v":9.5},0,0,0,625,null,null,null,null,null,null,null,null,null,null,"LIRAP increase"]
[2,"MONTHLY MINIMUM",null,0,107.56,{"$f":"F27","v":0},0,0,null,null,null,null,null,null,null,null,null,null,101,111,121,131]
[2,"BLOCK 1 PER THERM",null,{"$f":"D28+26.15+0.429+0.42+3.028+2.093","v":73.155000000000015},{"$f":"E28+25.181+1.085+1.841+1.626+1.754","v":31.487000000000005},{"$f":"F28","v":0},{"$f":"G28+21.892+1.132+1.539","v":51.570999999999998},{"$f":"H28+0.056+0.08","v":10.629999999999999},null,null,null,{"$f":"L28","v":9999999},200,500,10000,20000,null,null,0,0,0,0]
[3,"BLOCK 2 PER THERM",null,{"$f":"D29+26.15+0.429+0.42+3.028+2.093","v":85.453000000000017},{"$f":"E29+25.181+1.085+1.841+1.626+1.754","v":67.646000000000015},{"$f":"F29","v":0},{"$f":"G29+21.892+1.132+1.539","v":46.244},{"$f":"H29+0.056+0.08","v":9.4719999999999995},null,null,null,9999999,1000,1000,25000,50000,null,null,{"$f":"S$38","v":0},{"$f":"T$38","v":0},{"$f":"U$38","v":0},{"$f":"V$38","v":0}]
[4,"BLOCK 3 PER THERM",null,{"$f":"D30","v":0},59.048999999999999,0,44.936,8.5549999999999997,null,"Rates_Billing_Proposed",null,9999999,9999999,10000,50000,300000,null,null,{"$f":"S$38","v":0},0,0,0]
[5,"BLOCK 4 PER THERM",null,{"$f":"D31","v":0},55.003999999999998,0,42.765999999999998,7.9210000000000003,null,null,null,9999999,9999999,25000,9999999,500000,null,null,0,0,0,0]
[6,"BLOCK 5 PER THERM",null,{"$f":"D32","v":0},47.983999999999995,0,null,5.9870000000000001,null,null,null,9999999,9999999,9999999,9999999,9999999,null,null,0,0,0,0]
[null,null,null,null,null,null,null,null,null,null,null,"1st block rate",{"$f":"(M38/100*E38+E37)/M38*100","v":85.26700000000001},{"$f":"(N38/100*F38+F37)/N38*100","v":0}]
[null,null,null,null,null,null,null,null,null,null,null,"check",{"$f":"M38*M43/100-(M38*E38/100+E37)","v":0},{"$f":"N38*N43/100-(N38*F38/100+F37)","v":0}]
[]
[]
[" ","Proposed Rate Workup - from Pres & Prop Rev tab"]
[]
[null,"THERMS"]
[null,"BLOCK 1",{"$f":"SUM(D50:H50)","v":93246625.637529403},{"$f":"'Pres & Prop Rev'!D31","v":78130536.427342966},{"$f":"'Pres & Prop Rev'!E31","v":6382294.2101864293},{"$f":"'Pres & Prop Rev'!F31","v":0},{"$f":"'Pres & Prop Rev'!G31","v":240000},{"$f":"'Pres & Prop Rev'!H31","v":8493795}]
[null,"BLOCK 2",71250945.220317811,{"$f":"'Pres & Prop Rev'!D32","v":45837805.662867025},{"$f":"'Pres & Prop Rev'!E32","v":16593926.557450794},{"$f":"'Pres & Prop Rev'!F32","v":0},{"$f":"'Pres & Prop Rev'!G32","v":304980},{"$f":"'Pres & Prop Rev'!H32","v":8514233}]
[null,"BLOCK 3",43618606.148542784,{"$f":"'Pres & Prop Rev'!D33","v":0},{"$f":"'Pres & Prop Rev'!E33","v":29322405.148542784},{"$f":"'Pres & Prop Rev'!F33","v":0},{"$f":"'Pres & Prop Rev'!G33","v":342272},{"$f":"'Pres & Prop Rev'!H33","v":13953929}]
[null,"BLOCK 4",4080194.594,{"$f":"'Pres & Prop Rev'!D34","v":0},{"$f":"'Pres & Prop Rev'!E34","v":1235591.594},{"$f":"'Pres & Prop Rev'!F34","v":0},{"$f":"'Pres & Prop Rev'!G34","v":98015},{"$f":"'Pres & Prop Rev'!H34","v":2746588}]
[null,"BLOCK 5",2642898.6160000381,{"$f":"'Pres & Prop Rev'!D35","v":0},{"$f":"'Pres & Prop Rev'!E35","v":743507.61600003822},{"$f":"'Pres & Prop Rev'!F35","v":0},{"$f":"'Pres & Prop Rev'!G35","v":0},{"$f":"'Pres & Prop Rev'!H35","v":1899391}]
[null,"ADJ. TO ACTUAL",0,{"$f":"'Pres & Prop Rev'!D41","v":0},{"$f":"'Pres & Prop Rev'!E41","v":0},{"$f":"'Pres & Prop Rev'!F41","v":0},{"$f":"'Pres & Prop Rev'!G41","v":0},{"$f":"'Pres & Prop Rev'!H41","v":0}]
[null,"WEATHER & U/B THERMS",6624790,{"$f":"'Pres & Prop Rev'!D44","v":5017638},{"$f":"'Pres & Prop Rev'!E44","v":1607152},{"$f":"'Pres & Prop Rev'!F44","v":0},{"$f":"'Pres & Prop Rev'!G44","v":0},{"$f":"'Pres & Prop Rev'!H44","v":0},"Proposed rates:"]
[null,"TOTAL PROFORMA THERMS",{"$f":"IF(ROUND(SUM(D57:H57),3)<>ROUND(SUM(C50:C56),3),#VALUE!,SUM(D57:H57))","v":221464060.21639004},{"$f":"SUM(D50:D56)","v":128985980.09020999},{"$f":"SUM(E50:E56)","v":55884877.126180045},{"$f":"SUM(F50:F56)","v":0},{"$f":"SUM(G50:G56)","v":985267},{"$f":"SUM(H50:H56)","v":35607936},"same as current"]
[null,"TOTAL BILLS",null,{"$f":"SUM('Pres & Prop Rev'!D48:D49)","v":1941495},{"$f":"SUM('Pres & Prop Rev'!E48:E49)","v":36876},{"$f":"SUM('Pres & Prop Rev'!F48:F49)","v":0},{"$f":"SUM('Pres & Prop Rev'!G48:G49)","v":24},{"$f":"SUM('Pres & Prop Rev'!H48:H49)","v":480},"diff than current"]
[null,null,null,null,null,null,null,null,"Formulas to copy"]
[null,"Proposed Revenue",{"$f":"SUM(D60:H60)","v":99987419.032599986},{"$f":"'Rate Spread'!H13*1000","v":77318734.230029106},{"$f":"('Rate Spread'!H14+'Rate Spread'!H15)*1000","v":18933160.30116386},0,{"$f":"'Rate Spread'!H16*1000","v":218514.46960031631},{"$f":"'Rate Spread'!H17*1000","v":3517010.0318067097},"FLOOR","CEILING","OTHER"]
[null,"Targeted Rate Increase",{"$f":"#REF!","v":{"$error":"#REF!"}},{"$f":"#REF!","v":{"$error":"#REF!"}},{"$f":"#REF!","v":{"$error":"#REF!"}},{"$f":"#REF!","v":{"$error":"#REF!"}},{"$f":"#REF!","v":{"$error":"#REF!"}},{"$f":"#REF!","v":{"$error":"#REF!"}}]
[null,"Present Basic/Min Charge",null,{"$f":"D4+D5","v":9.5},{"$f":"E4+E5","v":97.25},{"$f":"F4+F5","v":240.44},{"$f":"G4+G5","v":0},{"$f":"H4+H5","v":550}]
[null,"BASIC/MIN CHARGE",null,9.5,{"$f":"ROUND((RD!D15*70)+(RD!D16*130)+D62+(70*RD!G15)+(130*RD!G16)+RD!G13,2)","v":107.56},0,0,625,{"$f":"FLOOR(I62*(1+I$61),$I64)","v":0},{"$f":"CEILING(J62*(1+J$61),$J64)","v":0},1.05]
[null,"% D in Basic Charge",null,{"$f":"IF(D62,D63/D62-1,0)","v":0},{"$f":"IF(E62,E63/E62-1,0)","v":0.10601542416452436},{"$f":"IF(F62,F63/F62-1,0)","v":-1},{"$f":"IF(G62,G63/G62-1,0)","v":0},{"$f":"IF(H62,H63/H62-1,0)","v":0.13636363636363646},0.05,0.05]
[null,"Basic Charge Revenue",{"$f":"SUM(D65:H65)","v":22741719.873119999},{"$f":"D58*D63","v":18444202.5},{"$f":"E58*E63","v":3966382.56},{"$f":"F58*F63","v":0},{"$f":"G58*G63","v":0},{"$f":"(H58*H63)+'Pres & Prop Rev'!H156","v":331134.81312000001}]
[null,null,null,0]
[null,"Present Block 1 Rate",null,{"$f":"D6","v":36.722999999999999},0,0,24.655000000000001,9.69,null,{"$f":"+E62+(D63-D62)+30*(D82/100)+130*(D83/100)","v":178.89349881385533}]
[null,"Present Block 2 Rate",null,47.728999999999999,33.353999999999999,34.85,19.792000000000002,8.6210000000000004]
[null,"Present Block 3 Rate",null,0,25.423999999999999,26.766999999999999,18.597999999999999,7.774]
[null,"Present Block 4 Rate",null,{"$f":"D9","v":0},{"$f":"'Sch 111 Rate Design'!T38*100","v":21.692},{"$f":"F9","v":21.692},18.202999999999999,7.1890000000000001]
[null,"Present Block 5 Rate",null,0,{"$f":"'Sch 111 Rate Design'!U38*100","v":15.217281202275618},14.387,0,5.4029999999999996]
[]
[null,"1) Flat Rate Increase",null,1,1,1,1,1]
[null,"2) % Rate Increase",null,0.1174152573730001,8.4109996911547996E-2,0,9.5438994397677682E-2,8.2925464012283942E-2,null,null,{"$f":"K$61","v":0}]
[null,"Method --->",null,2,2,2,2,2]
[null,null,null,null,null,0]
["Calculated","BLOCK 1 PER THERM",null,{"$f":"CHOOSE(D$75,D67+D$73,D67*(1+D$74))","v":41.034840496508679},{"$f":"E67","v":0},{"$f":"F67","v":0},{"$f":"CHOOSE(G$75,G67+G$73,G67*(1+G$74))","v":27.008048406874742},10.493547746279029]
[null,"BLOCK 2 PER THERM",null,{"$f":"CHOOSE(D$75,D68+D$73,D68*(1+D$74))","v":53.333112819155922},{"$f":"CHOOSE(E$75,E68+E$73,E68*(1+E$74))","v":36.159404836987768},null,21.680928577118838,9.3359004252498998]
[null,"BLOCK 3 PER THERM",null,0,{"$f":"CHOOSE(E$75,E69+E$73,E69*(1+E$74))","v":27.562412561479196},null,{"$f":"CHOOSE(G$75,G69+G$73,G69*(1+G$74))","v":20.37297441780801},8.4186625572314941]
[null,"BLOCK 4 PER THERM",null,0,{"$f":"CHOOSE(E$75,E70+E$73,E70*(1+E$74))","v":23.516514053005299},null,{"$f":"G70","v":18.202999999999999},7.7851511607843085]
[null,"BLOCK 5 PER THERM",null,0,16.497206677201177,null,0,{"$f":"CHOOSE(H$75,H71+H$73,H71*(1+H$74))","v":5.8510462820583689}]
["Input","BLOCK 1 PER THERM",null,{"$f":"D77","v":41.034840496508679},{"$f":"E77","v":0},{"$f":"F77","v":0},{"$f":"G77","v":27.008048406874742},{"$f":"H77","v":10.493547746279029},null,{"$f":"F82-F67","v":0},{"$f":"H82-H67","v":0.8035477462790297},{"$f":"D63+((D77/100)*200)","v":91.569680993017357},{"$f":"E63+((E82/100)*200)","v":107.56},null,null,{"$f":"F63+((F82/100)*500)","v":0}]
[null,"BLOCK 2 PER THERM",null,{"$f":"D78","v":53.333112819155922},{"$f":"E78","v":36.159404836987768},{"$f":"F78","v":0},{"$f":"G78","v":21.680928577118838},{"$f":"H78","v":9.3359004252498998},null,{"$f":"F83-F68","v":-34.85},{"$f":"H83-H68","v":0.71490042524989938}]
[null,"BLOCK 3 PER THERM",null,null,{"$f":"E79","v":27.562412561479196},{"$f":"F79","v":0},20.37297441780801,8.4186625572314941,null,{"$f":"F84-F69","v":-26.766999999999999},{"$f":"H84-H69","v":0.64466255723149413}]
[null,"BLOCK 4 PER THERM",null,null,{"$f":"E80","v":23.516514053005299},{"$f":"F80","v":0},{"$f":"G80","v":18.202999999999999},{"$f":"H80","v":7.7851511607843085},null,{"$f":"F85-F70","v":-21.692},0.59615116078430841]
[null,"BLOCK 5 PER THERM",null,null,16.497206677201177,{"$f":"F81","v":0},0,{"$f":"H81","v":5.8510462820583689},null,-14.387,0.44804628205836927]
[null,"Blocks 1-5 Revenue",{"$f":"SUM(D87:H87)","v":74407312.719479993},{"$f":"SUMPRODUCT(D50:D54,D82:D86)/100","v":56507469.610029109},{"$f":"SUMPRODUCT(E50:E54,E82:E86)/100","v":14495453.421163857},{"$f":"SUMPRODUCT(F50:F54,F82:F86)/100","v":0},{"$f":"SUMPRODUCT(G50:G54,G82:G86)/100","v":218514.46960031622},{"$f":"SUMPRODUCT(H50:H54,H82:H86)/100","v":3185875.2186867087},null,null,null,101,"111/112",101,111,121]
[null,"Adj. to Actual Revenue",{"$f":"SUM(D88:H88)","v":0},{"$f":"'Pres & Prop Rev'!D168","v":0},{"$f":"'Pres & Prop Rev'!E168","v":0},{"$f":"'Pres & Prop Rev'!F168","v":0},{"$f":"'Pres & Prop Rev'!G168","v":0},{"$f":"'Pres & Prop Rev'!H168","v":0},null,null,"Breakeven Proof Calc",null,200,500]
[null,"Weather & U/B Revenue",{"$f":"SUM(D89:H89)","v":2838186.44},{"$f":"'Pres & Prop Rev'!D190","v":2366862.12},{"$f":"'Pres & Prop Rev'!E190","v":471324.32},{"$f":"'Pres & Prop Rev'!F190","v":0},{"$f":"'Pres & Prop Rev'!G190","v":0},{"$f":"'Pres & Prop Rev'!H190","v":0},null,null,"Basic Charge/Minimum",{"$f":"D63","v":9.5},{"$f":"E63","v":107.56},{"$f":"D63","v":9.5},{"$f":"E63","v":107.56},{"$f":"F63","v":0}]
[null,null,null,null,null,null,null,null,null,null,"Therm Rate",{"$f":"D82/100","v":0.41034840496508679},null,{"$f":"D82/100","v":0.41034840496508679},{"$f":"(E82/100)","v":0},{"$f":"F82/100","v":0}]
[" ","Revenue Remaining",{"$f":"IF(ROUND(C60-C65-SUM(C87:C89),3)<>ROUND(SUM(D91:H91),3),#VALUE!,SUM(D91:H91))","v":200},{"$f":"D60-D65-SUM(D87:D89)","v":200},{"$f":"E60-E65-SUM(E87:E89)","v":0},{"$f":"F60-F65-SUM(F87:F89)","v":0},{"$f":"G60-G65-SUM(G87:G89)","v":0},{"$f":"H60-H65-SUM(H87:H89)","v":0},null,null,"Therm Rate",{"$f":"D83/100","v":0.53333112819155926},null,{"$f":"L91","v":0.53333112819155926},{"$f":"RD!D20","v":0.33354}]
[null,"Revenue Remaining - ¢/Th",{"$f":"C91/C57*100","v":9.030810678923806E-5},1.5505561136188936E-4,0,{"$error":"#DIV/0!"},0,0,null,null,"Bill Calculation",{"$f":"(70*L90)+(130*L91)+L89","v":107.55743501245878},{"$f":"(M88*M90)+M89","v":107.56},{"$f":"((70*N90)+(430*N91))+N89","v":267.55677346992655},{"$f":"O89+(200*O90)+((N88-200)*O91)","v":207.62200000000001},{"$f":"P89+(N88*P90)","v":0}]
[null,"check - < $4k is rounding",{"$f":"SUM(D93:H93)","v":21.649479984364007},{"$f":"D60-'Pres & Prop Rev'!D192-D91","v":-72.899970903992653},{"$f":"E60-'Pres & Prop Rev'!E192-E91","v":183.6811638623476},{"$f":"F60-'Pres & Prop Rev'!F192-F91","v":0},{"$f":"G60-'Pres & Prop Rev'!G192-G91","v":-0.18039968371158466},{"$f":"H60-'Pres & Prop Rev'!H192-H91","v":-88.951313290279359}]
[null,null,null,null,null,null,null,null,null,null,"Gas Costs",0,{"$f":"E82/100","v":0},{"$f":"L94","v":0},{"$f":"M94","v":0},{"$f":"F82/100","v":0}]
[null,"Proposed Target",{"$f":"SUM(D95:H95)","v":99987419.032599986},{"$f":"D60","v":77318734.230029106},{"$f":"E60","v":18933160.30116386},{"$f":"F60","v":0},{"$f":"G60","v":218514.46960031631},{"$f":"H60","v":3517010.0318067097},null,null,"Gas Cost Revenue",{"$f":"L94*200","v":0},{"$f":"M94*200","v":0},{"$f":"$N$88*N94","v":0},{"$f":"$N$88*O94","v":0},0]
[null,"Proposed Actual",{"$f":"'Pres & Prop Rev'!C192-SUM('Pres & Prop Rev'!I192:J192)","v":99987197.38312},{"$f":"'Pres & Prop Rev'!D192","v":77318607.13000001},{"$f":"'Pres & Prop Rev'!E192","v":18932976.619999997},{"$f":"'Pres & Prop Rev'!F192","v":0},{"$f":"'Pres & Prop Rev'!G192","v":218514.65000000002},{"$f":"'Pres & Prop Rev'!H192","v":3517098.98312},null,null,"Gas Cost Difference",null,{"$f":"L95-M95","v":0},null,null,{"$f":"N95-P95","v":0}]
[null,null,{"$f":"SUM(D97:H97)","v":-221.64947998436401},{"$f":"D96-D95","v":-127.10002909600735},{"$f":"E96-E95","v":-183.6811638623476},{"$f":"F96-F95","v":0},{"$f":"G96-G95","v":0.18039968371158466},{"$f":"H96-H95","v":88.951313290279359}]
[null,"Rate D Check",null,null,null,null,null,null,null,null,null,null,{"$f":"L92-M92-M96","v":-2.5649875412199208E-3},null,null,{"$f":"N92-P92-P96","v":267.55677346992655}]
[null,"Basic/Min Charge",{"$f":"SUM('Pres & Prop Rev'!C155:C156)/SUM('Pres & Prop Rev'!C106:C107)-1","v":1.8206893369495214E-2},{"$f":"SUM('Pres & Prop Rev'!D155:D156)/SUM('Pres & Prop Rev'!D106:D107)-1","v":0},{"$f":"SUM('Pres & Prop Rev'!E155:E156)/SUM('Pres & Prop Rev'!E106:E107)-1","v":0.10709622099595562},{"$f":"SUM('Pres & Prop Rev'!F155:F156)/SUM('Pres & Prop Rev'!F106:F107)-1","v":-1},{"$f":"SUM('Pres & Prop Rev'!G155:G156)/SUM('Pres & Prop Rev'!G106:G107)-1","v":{"$error":"#DIV/0!"}},{"$f":"SUM('Pres & Prop Rev'!H155:H156)/SUM('Pres & Prop Rev'!H106:H107)-1","v":0.12746909758286762}]
[null,"Adj. to Actual Revenue",{"$f":"'Pres & Prop Rev'!C168/'Pres & Prop Rev'!C119-1","v":{"$error":"#DIV/0!"}},{"$f":"'Pres & Prop Rev'!D168/'Pres & Prop Rev'!D119-1","v":{"$error":"#DIV/0!"}},{"$f":"'Pres & Prop Rev'!E168/'Pres & Prop Rev'!E119-1","v":{"$error":"#DIV/0!"}},{"$f":"'Pres & Prop Rev'!F168/'Pres & Prop Rev'!F119-1","v":{"$error":"#DIV/0!"}},{"$f":"'Pres & Prop Rev'!G168/'Pres & Prop Rev'!G119-1","v":{"$error":"#DIV/0!"}},{"$f":"'Pres & Prop Rev'!H168/'Pres & Prop Rev'!H119-1","v":{"$error":"#DIV/0!"}}]
[null,"Weather & U/B Revenue",{"$f":"'Pres & Prop Rev'!C190/'Pres & Prop Rev'!C142-1","v":0.11146767203370178},{"$f":"'Pres & Prop Rev'!D190/'Pres & Prop Rev'!D142-1","v":0.11741581534048628},{"$f":"'Pres & Prop Rev'!E190/'Pres & Prop Rev'!E142-1","v":4.031965411167393E-2},{"$f":"'Pres & Prop Rev'!F190/'Pres & Prop Rev'!F142-1","v":-1},{"$f":"'Pres & Prop Rev'!G190/'Pres & Prop Rev'!G142-1","v":{"$error":"#DIV/0!"}},{"$f":"'Pres & Prop Rev'!H190/'Pres & Prop Rev'!H142-1","v":{"$error":"#DIV/0!"}}]
[null,"Block Therm Charges",{"$f":"SUM('Pres & Prop Rev'!C157:C161)/SUM('Pres & Prop Rev'!C108:C112)-1","v":0.10661179580253433},{"$f":"SUM('Pres & Prop Rev'!D157:D161)/SUM('Pres & Prop Rev'!D108:D112)-1","v":0.11741669909980645},{"$f":"SUM('Pres & Prop Rev'!E157:E161)/SUM('Pres & Prop Rev'!E108:E112)-1","v":0.10858469025997408},{"$f":"SUM('Pres & Prop Rev'!F157:F161)/SUM('Pres & Prop Rev'!F108:F112)-1","v":-1},{"$f":"SUM('Pres & Prop Rev'!G157:G161)/SUM('Pres & Prop Rev'!G108:G112)-1","v":8.6969595643578756E-2},{"$f":"SUM('Pres & Prop Rev'!H157:H161)/SUM('Pres & Prop Rev'!H108:H112)-1","v":8.2955696158127479E-2}]
[null,"Overall Revenue",{"$f":"'Pres & Prop Rev'!C192/'Pres & Prop Rev'!C193-1","v":8.5371149036117089E-2},{"$f":"'Pres & Prop Rev'!D192/'Pres & Prop Rev'!D193-1","v":8.6971128957650468E-2},{"$f":"'Pres & Prop Rev'!E192/'Pres & Prop Rev'!E193-1","v":0.10646557255470035},{"$f":"'Pres & Prop Rev'!F192/'Pres & Prop Rev'!F193-1","v":-1},{"$f":"'Pres & Prop Rev'!G192/'Pres & Prop Rev'!G193-1","v":8.6969595643578756E-2},{"$f":"'Pres & Prop Rev'!H192/'Pres & Prop Rev'!H193-1","v":8.6996189604174878E-2}]
[]
[null,"Avg. Usage",null,{"$f":"D57/D58","v":66.436421463980068},{"$f":"E57/E58","v":1515.4809937677635},{"$f":"F57/F58","v":{"$error":"#DIV/0!"}},{"$f":"G57/G58","v":41052.791666666664},{"$f":"H57/H58","v":74183.199999999997}]
[null,"Bill Compare:",{"$f":"INDEX($D$2:$H$2,I106)","v":"SCH. 101"},null,null,{"$f":"INDEX($D$2:$H$2,J106)","v":"SCH. 111,112,116"},null,null,1,2]
[null,null,"Pres","Prop","% Incr","Pres","Prop","% Incr"]
[null,0,{"$f":"I$108+MIN($B108,M$109)*I$109/100+MAX(0,MIN($B108-M$109,M$110-M$109))*I$110/100+MAX(0,MIN($B108-M$110,M$111-M$110))*I$111/100+MAX(0,MIN($B108-M$111,M$112-M$111))*I$112/100+MAX(0,B108-M$113)*I$113/100","v":9.5},{"$f":"J$108+MIN($B108,N$109)*J$109/100+MAX(0,MIN($B108-N$109,N$110-N$109))*J$110/100+MAX(0,MIN($B108-N$110,N$111-N$110))*J$111/100+MAX(0,MIN($B108-N$111,N$112-N$111))*J$112/100+MAX(0,C108-N$113)*J$113/100","v":9.5},{"$f":"D108/C108-1","v":0},{"$f":"K$108+MIN($B108,O$109)*K$109/100+MAX(0,MIN($B108-O$109,O$110-O$109))*K$110/100+MAX(0,MIN($B108-O$110,O$111-O$110))*K$111/100+MAX(0,MIN($B108-O$111,O$112-O$111))*K$112/100+MAX(0,E108-O$113)*K$113/100","v":97.25},{"$f":"L$108+MIN($B108,P$109)*L$109/100+MAX(0,MIN($B108-P$109,P$110-P$109))*L$110/100+MAX(0,MIN($B108-P$110,P$111-P$110))*L$111/100+MAX(0,MIN($B108-P$111,P$112-P$111))*L$112/100+MAX(0,F108-P$113)*L$113/100","v":107.56},{"$f":"G108/F108-1","v":0.10601542416452436},{"$f":"INDEX(CHOOSE(Base1_Billing2,$D$4:$H$4,$D$14:$H$14),$I$106)+INDEX(CHOOSE(Base1_Billing2,$D$5:$H$5,$D$15:$H$15),$I$106)","v":9.5},{"$f":"INDEX(CHOOSE(Base1_Billing2,$D$26:$H$26,$D$36:$H$36),$I$106)+INDEX(CHOOSE(Base1_Billing2,$D$27:$H$27,$D$37:$H$37),$I$106)","v":9.5},{"$f":"INDEX(CHOOSE(Base1_Billing2,$D$4:$H$4,$D$14:$H$14),$J$106)+INDEX(CHOOSE(Base1_Billing2,$D$5:$H$5,$D$15:$H$15),$J$106)","v":97.25},{"$f":"INDEX(CHOOSE(Base1_Billing2,$D$26:$H$26,$D$36:$H$36),$J$106)+INDEX(CHOOSE(Base1_Billing2,$D$27:$H$27,$D$37:$H$37),$J$106)","v":107.56}]
[null,65,{"$f":"I$108+MIN($B109,M$109)*I$109/100+MAX(0,MIN($B109-M$109,M$110-M$109))*I$110/100+MAX(0,MIN($B109-M$110,M$111-M$110))*I$111/100+MAX(0,MIN($B109-M$111,M$112-M$111))*I$112/100+MAX(0,B109-M$113)*I$113/100","v":33.369950000000003},{"$f":"J$108+MIN($B109,N$109)*J$109/100+MAX(0,MIN($B109-N$109,N$110-N$109))*J$110/100+MAX(0,MIN($B109-N$110,N$111-N$110))*J$111/100+MAX(0,MIN($B109-N$111,N$112-N$111))*J$112/100+MAX(0,C109-N$113)*J$113/100","v":36.172749999999994},8.3991735079015362E-2,{"$f":"K$108+MIN($B109,O$109)*K$109/100+MAX(0,MIN($B109-O$109,O$110-O$109))*K$110/100+MAX(0,MIN($B109-O$110,O$111-O$110))*K$111/100+MAX(0,MIN($B109-O$111,O$112-O$111))*K$112/100+MAX(0,E109-O$113)*K$113/100","v":97.25},{"$f":"L$108+MIN($B109,P$109)*L$109/100+MAX(0,MIN($B109-P$109,P$110-P$109))*L$110/100+MAX(0,MIN($B109-P$110,P$111-P$110))*L$111/100+MAX(0,MIN($B109-P$111,P$112-P$111))*L$112/100+MAX(0,F109-P$113)*L$113/100","v":107.56},0.10601542416452436,{"$f":"INDEX(CHOOSE(Base1_Billing2,$D6:$H6,$D16:$H16),$I$106)","v":36.722999999999999},{"$f":"INDEX(CHOOSE(Base1_Billing2,$D28:$H28,$D38:$H38),$I$106)","v":41.034999999999997},{"$f":"INDEX(CHOOSE(Base1_Billing2,$D6:$H6,$D16:$H16),$J$106)","v":0},{"$f":"INDEX(CHOOSE(Base1_Billing2,$D28:$H28,$D38:$H38),$J$106)","v":0},{"$f":"INDEX($L6:$P6,$I$106)","v":9999999},{"$f":"INDEX($L28:$P28,$I$106)","v":9999999},{"$f":"INDEX($L6:$P6,$J$106)","v":200},{"$f":"INDEX($L28:$P28,$J$106)","v":200}]
[null,2000,743.96,830.2,0.11592021076401959,618.322,672.452,8.7543383544496312E-2,{"$f":"INDEX(CHOOSE(Base1_Billing2,$D7:$H7,$D17:$H17),$I$106)","v":47.728999999999999},{"$f":"INDEX(CHOOSE(Base1_Billing2,$D29:$H29,$D39:$H39),$I$106)","v":53.332999999999998},{"$f":"INDEX(CHOOSE(Base1_Billing2,$D7:$H7,$D17:$H17),$J$106)","v":33.353999999999999},{"$f":"INDEX(CHOOSE(Base1_Billing2,$D29:$H29,$D39:$H39),$J$106)","v":36.158999999999999},{"$f":"INDEX($L7:$P7,$I$106)","v":9999999},{"$f":"INDEX($L29:$P29,$I$106)","v":9999999},{"$f":"INDEX($L7:$P7,$J$106)","v":1000},{"$f":"INDEX($L29:$P29,$J$106)","v":1000}]
[null,3000,1111.19,1240.55,0.11641573448285158,872.56200000000001,948.072,8.653826318359048E-2,{"$f":"INDEX(CHOOSE(Base1_Billing2,$D8:$H8,$D18:$H18),$I$106)","v":0},{"$f":"INDEX(CHOOSE(Base1_Billing2,$D30:$H30,$D40:$H40),$I$106)","v":0},{"$f":"INDEX(CHOOSE(Base1_Billing2,$D8:$H8,$D18:$H18),$J$106)","v":25.423999999999999},{"$f":"INDEX(CHOOSE(Base1_Billing2,$D30:$H30,$D40:$H40),$J$106)","v":27.562000000000001},{"$f":"INDEX($L8:$P8,$I$106)","v":9999999},{"$f":"INDEX($L30:$P30,$I$106)","v":9999999},{"$f":"INDEX($L8:$P8,$J$106)","v":9999999},{"$f":"INDEX($L30:$P30,$J$106)","v":9999999}]
[null,4000,1478.42,1650.9,0.11666508840518941,1126.8020000000001,1223.692,8.5986712838635126E-2,{"$f":"INDEX(CHOOSE(Base1_Billing2,$D9:$H9,$D19:$H19),$I$106)","v":0},{"$f":"INDEX(CHOOSE(Base1_Billing2,$D31:$H31,$D41:$H41),$I$106)","v":0},{"$f":"INDEX(CHOOSE(Base1_Billing2,$D9:$H9,$D19:$H19),$J$106)","v":0},{"$f":"INDEX(CHOOSE(Base1_Billing2,$D31:$H31,$D41:$H41),$J$106)","v":23.516999999999999},{"$f":"INDEX($L9:$P9,$I$106)","v":9999999},{"$f":"INDEX($L31:$P31,$I$106)","v":9999999},{"$f":"INDEX($L9:$P9,$J$106)","v":9999999},{"$f":"INDEX($L31:$P31,$J$106)","v":9999999}]
[null,5000,1845.65,2061.2499999999995,0.11681521415219542,1381.0419999999999,1499.3119999999999,8.5638235477270008E-2,{"$f":"INDEX(CHOOSE(Base1_Billing2,$D10:$H10,$D20:$H20),$I$106)","v":0},{"$f":"INDEX(CHOOSE(Base1_Billing2,$D32:$H32,$D42:$H42),$I$106)","v":0},{"$f":"INDEX(CHOOSE(Base1_Billing2,$D10:$H10,$D20:$H20),$J$106)","v":0},{"$f":"INDEX(CHOOSE(Base1_Billing2,$D32:$H32,$D42:$H42),$J$106)","v":16.497},{"$f":"INDEX($L10:$P10,$I$106)","v":9999999},{"$f":"INDEX($L32:$P32,$I$106)","v":9999999},{"$f":"INDEX($L10:$P10,$J$106)","v":9999999},{"$f":"INDEX($L32:$P32,$J$106)","v":9999999}]
[null,6000,2212.88,2471.6,0.11691551281587786,1635.2820000000002,1774.9319999999998,8.539811482056292E-2]
[null,7000,2580.11,2881.95,0.11698726023309081,1889.5219999999999,2050.5520000000001,8.5222611856331953E-2]
[null,8000,2947.34,3292.3,0.11704112861088301,2143.7620000000002,2326.172,8.5088736529521425E-2]
[null,9000,3314.57,3702.6499999999996,0.11708306054782347,2398.002,2601.7919999999999,8.498324855442152E-2]
[null,10000,3681.8,4112.9999999999991,0.11711662773643305,2652.2419999999997,2877.4119999999998,8.489798442223595E-2]
[null,11000,4049.03,4523.3499999999995,0.11714410611924309,2906.482,3153.0319999999997,8.4827636985193688E-2]
[null,12000,4416.26,4933.7,0.11716701462323309,3160.7219999999998,3428.652,8.4768606666451696E-2]
[null,13000,4783.49,5344.05,0.11718640574141492,3414.962,3704.2719999999999,8.471836582661818E-2]
[null,14000,5150.72,5754.4,0.11720303180914504,3669.2019999999998,3979.8919999999998,8.4675087389574077E-2]

{"sheet":"RS","index":2,"n_rows":44,"n_cols":25,"rows_kept":44,"cut":false,"hidden":false,"merged":[[0,14,2,15],[24,0,25,7]]}
["AVISTA UTILITIES",null,null,null,null,null,null,null,null,null,null,null,null,null,"This worksheet pulls data from 'Pres & Prop Rev' tab."]
["WASHINGTON NATURAL GAS"]
["PROPOSED INCREASE BY SERVICE SCHEDULE"]
["12 MONTHS ENDED DECEMBER 31, 2018"]
["(000s of Dollars)"]
[]
[]
[null,null,null,"Base Tariff",null,"Base Tariff","Base","Total Billed",null,null,null,"Percent "]
[null,null,null,"Distribution Revenue","Settlement","Distribution Revenue","Tariff","Revenue","Sch. 192","Settlement","Sch 194","Increase",null,"Revenue",null,null,null,null,null,null,null,null,"Base Revenue"]
["Line","Type of","Schedule","Under Present","General","Under Proposed","Percent","at Present","LIRAP","General","Remand","on Billed",null,"Per ",null,null,"Present",null,"Therm ","Sch 150","Sch 150",null,"plus"]
["No.","Service","Number","Rates","Increase","Rates","Increase","Rates (1)","Increase","Increase","Decrease","Revenue",null,"Customer",null,"# of Bills","Avg Bill",null,"Sales","PGA Rate","Revenue",null,"Sch 150"]
[null,"(a)","(b)","(c)","(d)","(e)","(f)","(g)","(h)","(i)","(j)","(k)"]
[]
[1,"General Service","101/102",{"$f":"'Pres & Prop Rev'!$D$145/1000","v":71132.162639999995},{"$f":"'Pres & Prop Rev'!$D$195/1000+0.1","v":6186.5444900000102},{"$f":"'Pres & Prop Rev'!$D$192/1000","v":77318.607130000004},{"$f":"E14/D14","v":8.6972534791471517E-2},{"$f":"112562.45945-68","v":112494.45944999999},{"$f":"LIRAP!G13/1000","v":125.68330819486694},{"$f":"E14","v":6186.5444900000102},-2761,{"$f":"(E14+I14+K14)/H14","v":3.1568024021425507E-2},null,{"$f":"(D14*1000)/(P14/12)","v":439.65395310314989},null,{"$f":"'Bill Determ'!C7","v":1941495},{"$f":"'Bill Impact'!E15","v":54.94},null,{"$f":"'Pres & Prop Rev'!D23","v":128985980.09020999},0.26150000000000001,{"$f":"(S14*T14)/1000","v":33729.833793589911},null,{"$f":"D14+U14","v":104861.9964335899},{"$f":"E14/W14","v":5.8997012267623647E-2},"LIRAP is 2x this percentage, less the prior 7%"]
[2,"Large General Service","111/112/116",{"$f":"'Pres & Prop Rev'!$E$145/1000+'Pres & Prop Rev'!$F$145/1000-0.2","v":17418.31235},{"$f":"'Pres & Prop Rev'!$E$195/1000+0.1","v":1514.5642699999962},{"$f":"'Pres & Prop Rev'!$E$192/1000-0.4","v":18932.576619999996},{"$f":"E15/D15","v":8.6952411896551868E-2},{"$f":"35006.97703-1-5","v":35000.977030000002},{"$f":"LIRAP!G14/1000","v":45.634128044137313},{"$f":"E15","v":1514.5642699999962},-676,{"$f":"(E15+I15+K15)/H15","v":2.5262106177386712E-2},null,{"$f":"((D15+D16+D17)*1000)/((P15+P16+P17)/12)","v":5724.2831091617936},null,{"$f":"'Bill Determ'!H23","v":36876},{"$f":"(H15*1000)/P15","v":949.15329835123123},null,{"$f":"'Pres & Prop Rev'!E23","v":54329805.680180006},0.25180999999999998,13680.788368326126,null,{"$f":"D15+U15","v":31099.100718326124}]
[3,"Large General Svc.-High Annual Load Factor (2)","121/122/126",0,{"$f":"'Pres & Prop Rev'!$F$195/1000","v":0},{"$f":"'Pres & Prop Rev'!$F$192/1000","v":0},0,0,0,0,0,0,null,null,null,{"$f":"'Bill Determ'!H29","v":36},{"$f":"(H16*1000)/P16","v":0},null,{"$f":"'Pres & Prop Rev'!F23","v":1555071.0017200378},0.25180999999999998,391.58242894312269,null,391.58242894312269]
[4,"Interruptible Service ","131/132",{"$f":"'Pres & Prop Rev'!$G$145/1000","v":201.03106},{"$f":"'Pres & Prop Rev'!$G$195/1000","v":17.483590000000024},{"$f":"'Pres & Prop Rev'!$G$192/1000-0.1","v":218.41465000000002},{"$f":"E17/D17","v":8.6969595643578784E-2},443.04218999999995,{"$f":"LIRAP!G15/1000","v":0.70592477498610873},17.483590000000024,-8,2.2998971666752854E-2,null,null,null,{"$f":"'Bill Determ'!G36","v":24},{"$f":"(H17*1000)/P17","v":18460.091249999998},null,{"$f":"'Pres & Prop Rev'!G23","v":985267},0.21892,215.69465163999999,null,416.72571163999999]
[5,"Transportation Service","146",{"$f":"'Pres & Prop Rev'!$H$145/1000","v":3235.6129826000001},{"$f":"'Pres & Prop Rev'!$H$195/1000","v":281.48600051999978},{"$f":"'Pres & Prop Rev'!$H$192/1000","v":3517.09898312},{"$f":"E18/D18","v":8.6996189604174989E-2},3284.0397625999999,{"$f":"LIRAP!G16/1000","v":6.6846410312000009},281.48600051999978,-126,4.9381448847869006E-2,null,null,null,{"$f":"'Bill Determ'!H40","v":480},{"$f":"(H18*1000)/P18","v":6841.7495054166666},null,{"$f":"'Pres & Prop Rev'!H23","v":35607936},0,0,null,3235.6129826000001]
[6,"Special Contracts","148",{"$f":"SUM('Pres & Prop Rev'!$I$145:$J$145)/1000","v":1719.7288500000002},{"$f":"SUM('Pres & Prop Rev'!$I$195:$J$195)/1000","v":0},{"$f":"SUM('Pres & Prop Rev'!$I$192:$J$192)/1000","v":1719.7288500000002},0,1719.7288500000002,0,0,0,0,null,null,null,null,null,null,{"$f":"'Pres & Prop Rev'!I23+'Pres & Prop Rev'!J23","v":54517605},0,0,null,1719.7288500000002]
[7,"Total",null,{"$f":"'Pres & Prop Rev'!$C$145/1000","v":93707.047882599989},{"$f":"'Pres & Prop Rev'!$C$195/1000","v":7999.8783505200054},{"$f":"'Pres & Prop Rev'!$C$192/1000","v":101706.92623312},{"$f":"E20/D20","v":8.5371149036117103E-2},{"$f":"SUM(H14:H19)+0.4","v":152942.64728260002},{"$f":"SUM(I14:I19)","v":178.70800204519034},{"$f":"SUM(J14:J19)","v":8000.0783505200061},{"$f":"SUM(K14:K19)","v":-3571},3.0126236431958189E-2,null,null,null,null,null,null,{"$f":"SUM(S14:S19)","v":275981664.77211004},null,{"$f":"SUM(U14:U19)","v":48017.899242499159},null,141724.94712509913]
[null,null,null,{"$f":"ROUND(D20-SUM(D14:D19),0)","v":0},null,null,null,null,null,{"$f":"ROUND(J20-SUM(J14:J19),-1)","v":0},null,{"$f":"ROUND(L20-SUM(L14:L19),0)","v":0}]
["(1) Includes Schedule 150 (Purchase Gas Cost Adjustment), Schedule 155 (Gas Rate Adjustment), Schedule 175 (Decoupling),"]
[" Schedule 191 (DSM Adjustment) and Schedule 192 (LIRAP Adjustment)."]
[]
["(2)  As discussed in the testimony of Company witness Miller Schedules 121/122/126 have been discontnued and the associated revenue has been included within rate schedules 111/112/116."]
[]
[]
[null,null,null,{"$f":"SUM(ROUND(D14:D19,0))","v":93707},{"$f":"SUM(ROUND(E14:E19,0))","v":8000},{"$f":"SUM(ROUND(F14:F19,0))","v":101707},null,{"$f":"SUM(ROUND(H14:H19,0))","v":152942},null,null,null,{"$f":"SUM(ROUND(L14:L19,0))","v":0}]
[null,null,null,{"$f":"ROUND(D20,0)-D28","v":0},{"$f":"ROUND(E20,0)-E28","v":0},{"$f":"ROUND(F20,0)-F28","v":0},null,{"$f":"ROUND(H20,0)-H28","v":1},null,null,null,{"$f":"ROUND(L20,0)-L28","v":0}]
[]
[null,null,null,null,null,null,null,null,null,"111/121",null,"112/122"]
[null,null,null,null,null,null,"Rate Sch.","Therms",null,"Sch 155 Rate",null,"Sch 155 Rate","Billing Impact"]
[null,null,null,null,null,null,112,{"$f":"'12MEDEC18'!P93","v":132272.37600000002},null,1.085E-2,null,0,{"$f":"(H33*(L33-J33)/1000)","v":-1.4351552796000002}]
[null,null,null,null,null,null,116,0,null,1.085E-2,null,0,{"$f":"(H34*(L34-J34)/1000)","v":0},"No 116 in Test Year"]
[null,null,null,null,null,null,122,{"$f":"'12MEDEC18'!P121","v":462369.47100000002},null,1.085E-2,null,0,{"$f":"(H35*(L35-J35)/1000)","v":-5.0167087603500002}]
[null,null,null,null,null,null,126,0,null,1.085E-2,null,0,{"$f":"(H36*(L36-J36)/1000)","v":0},"No 126 in Test Year"]
[null,null,null,null,null,null,null,null,null,"111/121",null,"112/122"]
[null,null,null,null,null,null,"Rate Sch.","Therms",null,"Sch 175 Rate",null,"Sch 175 Rate","Billing Impact"]
[null,null,null,null,null,null,112,{"$f":"'12MEDEC18'!P93","v":132272.37600000002},null,0,null,0,{"$f":"(H39*(L39-J39)/1000)","v":0}]
[null,null,null,null,null,null,122,{"$f":"'12MEDEC18'!P121","v":462369.47100000002},null,0,null,0,{"$f":"(H40*(L40-J40)/1000)","v":0}]
[]
[]
[null,null,null,null,null,null,"Rate Sch.","Therms",null,"Sch 189 Rate",null,"Sch 155 Rate","Billing Impact"]
[null,null,null,null,null,null,102,{"$f":"'12MEDEC18'!P69","v":141141.77483000001},null,-0.48469000000000001,null,null,{"$f":"((H44*J44)/1000)","v":-68.410006842352715}]

{"sheet":"RD","index":3,"n_rows":64,"n_cols":27,"rows_kept":64,"cut":false,"hidden":false,"merged":[[9,0,9,2],[14,22,14,23]]}
["AVISTA UTILITIES",null,null,null,null,null,null,null,null,null,null,null,null,null,null,null,"This worksheet uses Base & Billing rates from 'Rate Design' tab."]
["WASHINGTON NATURAL GAS"]
["PRESENT AND PROPOSED RATE COMPONENTS BY SCHEDULE"]
[]
[]
[]
[null,null,null,null,null,null,null,null,null,"Proposed"]
[null,null,null,"Present Base","Present",null,"General ","Sch 92","Proposed ","Base "]
[null,null,null,"Distribution","Billing","Present ","Rate ","LIRAP Rate","Billing ","Distribution",null,null,null,"GRC"]
["Type of Service",null,null,"Rate","Rate Adj. (1)","Billing Rate","Increase","Increase","Rate(1)","Rate",null,"Base","Bill ","Revenue"]
[null,"(a)",null,"(b)","(c)","(d)","(e)","(f)","(g)","(h)",null,"check","check","Check"]
["General Service - Schedule 101"]
["Basic Charge",null,null,{"$f":"'Rate Design'!D4","v":9.5},{"$f":"F13-D13","v":0},{"$f":"'Rate Design'!D14","v":9.5},{"$f":"IF(ROUND(I13-F13,5)<>ROUND(J13-D13,5),#VALUE!,J13-D13)","v":0},null,{"$f":"'Rate Design'!D36","v":9.5},{"$f":"'Rate Design'!D26","v":9.5},{"$f":"J13/D13-1","v":0},null,null,{"$f":"G13*'Pres & Prop Rev'!D25","v":0}]
["Usage Charge:"]
["   First 70 Therms",null,null,{"$f":"'Rate Design'!D6/100","v":0.36723},{"$f":"F15-D15","v":0.32119999999999999},{"$f":"'Rate Design'!D16/100","v":0.68842999999999999},{"$f":"J15-D15","v":4.3119999999999992E-2},{"$f":"LIRAP!K13","v":9.6999999999999864E-4},{"$f":"F15+G15+H15","v":0.73251999999999995},{"$f":"'Rate Design'!D28/100","v":0.41034999999999999},{"$f":"J15/D15-1","v":0.11741960079514202},{"$f":"D15+G15-J15","v":0},{"$f":"F15+G15+H15-I15","v":0},{"$f":"G15*'Pres & Prop Rev'!D31","v":3368988.7307470283},null,null,null,null,null,null,null,null,"155 Amort Rate",null,"Decoupling",null,"Proposed"]
["   All over 70 Therms",null,null,{"$f":"'Rate Design'!D7/100","v":0.47728999999999999},{"$f":"E15","v":0.32119999999999999},{"$f":"'Rate Design'!D17/100","v":0.79849000000000003},{"$f":"J16-D16","v":5.6039999999999979E-2},{"$f":"H15","v":9.6999999999999864E-4},{"$f":"F16+G16+H16","v":0.85550000000000004},{"$f":"'Rate Design'!D29/100","v":0.53332999999999997},{"$f":"J16/D16-1","v":0.1174128936286114},{"$f":"D16+G16-J16","v":0},{"$f":"F16+G16+H16-I16","v":0},{"$f":"G16*'Pres & Prop Rev'!D32","v":2568750.6293470669},null,null,{"$f":"(70*D15)+(130*D16)+D13","v":97.253799999999998},{"$f":"(70*J15)+(130*J16)+J13","v":107.5574},{"$f":"(70*D15)+(430*D16)+D13","v":240.4408},{"$f":"(70*J15)+(430*J16)+J13","v":267.5564},null,null,null,null,null,null,"Billing"]
["Large General Service - Schedule 111",null,null,null,null,null,null,null,null,null,null,null,null,{"$f":"SUM(N13:N16)","v":5937739.3600940946},{"$f":"N17-'Pres & Prop Rev'!D195","v":-248705.12990591489},null,null,null,null,null,null,"Large General Service - Schedule 112","Sch 111 ","Sch 112","Sch 175","Difference","Rate"]
["Usage Charge:",null,null,null,null,null,null,null,null,null,{"$f":"J25/200+J26-J19","v":0},null,null,null,null,null,null,null,null,null,null,"Usage Charge:"]
[{"$f":"\"First \"&TEXT('Rate Design'!M6,\"#,##0\")&\" therms\"","v":"First 200 therms"},null,null,{"$f":"'Rate Design'!M11/100","v":0.48625000000000002},{"$f":"F19-D19","v":0.31487000000000004},{"$f":"'Rate Design'!M21/100","v":0.80112000000000005},{"$f":"J19-D19","v":5.155000000000004E-2},{"$f":"LIRAP!K14","v":8.2000000000000128E-4},{"$f":"F19+G19+H19","v":0.85349000000000008},{"$f":"'Rate Design'!M33/100","v":0.53780000000000006},{"$f":"J19/D19-1","v":0.10601542416452459},{"$f":"D19+G19-J19","v":0},{"$f":"F19+G19-I19+H19","v":-4.163336342344337E-17},null,null,null,{"$f":"D19*200","v":97.25},{"$f":"J19*200","v":107.56000000000002},null,null,null,{"$f":"\"First \"&TEXT('Rate Design'!AG6,\"#,##0\")&\" therms\"","v":"First 0 therms"},1.085E-2,0,0,{"$f":"W19-X19+Y19","v":1.085E-2},{"$f":"I19-Z19","v":0.84264000000000006}]
[{"$f":"TEXT('Rate Design'!M6,\"#,##0\")&\" - \"&TEXT('Rate Design'!M7,\"#,##0\")&\" therms\"","v":"200 - 1,000 therms"},null,null,{"$f":"'Rate Design'!E7/100","v":0.33354},{"$f":"F20-D20","v":0.31486999999999993},{"$f":"'Rate Design'!E17/100","v":0.64840999999999993},{"$f":"J20-D20","v":2.8049999999999964E-2},{"$f":"H19","v":8.2000000000000128E-4},{"$f":"F20+G20+H20","v":0.67727999999999988},{"$f":"'Rate Design'!E29/100","v":0.36158999999999997},{"$f":"J20/D20-1","v":8.4097859327217028E-2},{"$f":"D20+G20-J20","v":0},{"$f":"F20+G20-I20+H20","v":-4.163336342344337E-17},{"$f":"G20*'Pres & Prop Rev'!E32","v":465459.63993649418},null,null,null,null,null,null,null,{"$f":"TEXT('Rate Design'!AG6,\"#,##0\")&\" - \"&TEXT('Rate Design'!AG7,\"#,##0\")&\" therms\"","v":"0 - 0 therms"},{"$f":"W19","v":1.085E-2},{"$f":"X19","v":0},{"$f":"Y19","v":0},{"$f":"W20-X20+Y20","v":1.085E-2},{"$f":"I20-Z20","v":0.66642999999999986}]
[{"$f":"TEXT('Rate Design'!N7,\"#,##0\")&\" - \"&TEXT('Rate Design'!N8,\"#,##0\")&\" therms\"","v":"1,000 - 10,000 therms"},null,"(Adjusted)",{"$f":"'Rate Design'!E8/100","v":0.25424000000000002},{"$f":"F21-D21","v":0.31486999999999998},{"$f":"'Rate Design'!E18/100","v":0.56911},{"$f":"J21-D21","v":2.138000000000001E-2},{"$f":"H19","v":8.2000000000000128E-4},0.59131,{"$f":"'Rate Design'!E30/100","v":0.27562000000000003},{"$f":"J21/D21-1","v":8.4093769666456986E-2},0,-4.163336342344337E-17,{"$f":"G21*'Pres & Prop Rev'!E33","v":626913.02207584505},null,null,null,null,null,null,null,{"$f":"\"All over \"&TEXT('Rate Design'!AG7,\"#,##0\")&\" therms\"","v":"All over 0 therms"},{"$f":"W19","v":1.085E-2},{"$f":"X19","v":0},{"$f":"Y19","v":0},1.085E-2,0.58045999999999998]
[{"$f":"TEXT('Rate Design'!N8,\"#,##0\")&\" - \"&TEXT('Rate Design'!N9,\"#,##0\")&\" therms\"","v":"10,000 - 25,000 therms"},null,"(New)",null,null,null,null,{"$f":"H19","v":8.2000000000000128E-4},{"$f":"J22+H22","v":0.23598999999999998},{"$f":"'Rate Design'!E31/100","v":0.23516999999999999},null,null,null,{"$f":"'Sch 111 Rate Design'!T49*'Pres & Prop Rev'!E34","v":22549.546590499987}]
[{"$f":"\"All over \"&TEXT('Rate Design'!N9,\"#,##0\")&\" therms\"","v":"All over 25,000 therms"},null,"(New)",null,null,null,null,{"$f":"H19","v":8.2000000000000128E-4},{"$f":"J23+H23","v":0.16578999999999999},{"$f":"'Rate Design'!E32/100","v":0.16497000000000001},null,null,null,{"$f":"'Sch 111 Rate Design'!U49*'Pres & Prop Rev'!E35","v":9514.8067244649101}]
["Minimum Charge:",null,null,null,null,null,null,null,null,null,null,null,null,null,null,null,null,null,null,null,null,"Minimum Charge:"]
["per month",null,null,{"$f":"'Rate Design'!E5","v":97.25},{"$f":"F25-D25","v":0},{"$f":"'Rate Design'!E15","v":97.25},{"$f":"IF(ROUND(I25-F25,5)<>ROUND(J25-D25,5),#VALUE!,J25-D25)","v":10.310000000000002},null,{"$f":"'Rate Design'!E37","v":107.56},{"$f":"'Rate Design'!E27","v":107.56},{"$f":"J25/D25-1","v":0.10601542416452436},0,{"$f":"F25+G25-I25","v":0},{"$f":"G25*'Pres & Prop Rev'!E49","v":380191.56000000006},null,null,null,null,null,null,null,"per month"]
["per therm",null,null,{"$f":"'Rate Design'!E6/100","v":0},{"$f":"F26-D26","v":0.31487000000000004},{"$f":"'Rate Design'!E16/100","v":0.31487000000000004},{"$f":"J26-D26","v":0},{"$f":"H19","v":8.2000000000000128E-4},{"$f":"F26+G26+H26","v":0.31569000000000003},{"$f":"'Rate Design'!E28/100","v":0},{"$f":"J26/D26-1","v":{"$error":"#DIV/0!"}},0,{"$f":"F26+G26-I26+H26","v":1.3877787807814457E-17},{"$f":"G26*'Pres & Prop Rev'!E31","v":0},null,null,null,null,null,null,null,"per therm",{"$f":"W19","v":1.085E-2},{"$f":"X19","v":0},{"$f":"Y19","v":0},{"$f":"W26-X26+Y26","v":1.085E-2},0.30484]
[null,null,null,null,null,null,null,null,null,null,null,null,null,{"$f":"SUM(N19:N26)","v":1504628.5753273042},{"$f":"-('Pres & Prop Rev'!E190-'Pres & Prop Rev'!E142-'Pres & Prop Rev'!F142)","v":-35932.960000000043},null,null,null,null,null,null,null,null,null,null,null,"Billing"]
["High Annual Load Factor Large General Service - Schedule 121 (Discontinued)",null,null,null,null,null,null,null,null,null,null,null,null,null,null,null,null,null,null,null,null,"High Annual Load Factor Large General Service - Schedule 121","Sch 121","Sch 122","Sch 175","Difference","Rate"]
["Usage Charge:",null,null,null,null,null,null,null,null,null,{"$f":"J36/500+J37-J30","v":0},null,null,null,null,null,null,null,null,null,null,"Usage Charge:"]
[{"$f":"\"First \"&TEXT('Rate Design'!N6,\"#,##0\")&\" therms\"","v":"First 500 therms"},null,null,{"$f":"'Rate Design'!N11/100","v":0.48087999999999992},{"$f":"F30-D30","v":0.30985000000000013},{"$f":"'Rate Design'!N21/100","v":0.79073000000000004},0,null,"**DISCONTINUED**",null,{"$f":"J30/D30-1","v":-1},{"$f":"D30+G30-J30","v":0.48087999999999992},{"$f":"F30+G30","v":0.79073000000000004},null,null,null,{"$f":"D30*500","v":240.43999999999997},{"$f":"J30*500","v":0},null,null,null,"First 500 therms",0,0,0,{"$f":"W30-X30+Y30","v":0},0]
[{"$f":"TEXT('Rate Design'!N6,\"#,##0\")&\" - \"&TEXT('Rate Design'!N7,\"#,##0\")&\" therms\"","v":"500 - 1,000 therms"},null,null,{"$f":"'Rate Design'!F7/100","v":0.34850000000000003},{"$f":"F31-D31","v":0.30985000000000007},{"$f":"'Rate Design'!F17/100","v":0.6583500000000001},null,null,null,null,{"$f":"J31/D31-1","v":-1},{"$f":"D31+G31-J31","v":0.34850000000000003},{"$f":"F31+G31-I31","v":0.6583500000000001},{"$f":"G31*'Pres & Prop Rev'!F32","v":0},null,null,null,null,null,null,null,"500 - 1,000 therms",{"$f":"W30","v":0},{"$f":"X30","v":0},{"$f":"Y30","v":0},{"$f":"W31-X31+Y31","v":0},{"$f":"I31-Z31","v":0}]
[{"$f":"TEXT('Rate Design'!N7,\"#,##0\")&\" - \"&TEXT('Rate Design'!N8,\"#,##0\")&\" therms\"","v":"1,000 - 10,000 therms"},null,null,{"$f":"'Rate Design'!F8/100","v":0.26767000000000002},{"$f":"F32-D32","v":0.30985000000000001},{"$f":"'Rate Design'!F18/100","v":0.57752000000000003},null,null,null,null,{"$f":"J32/D32-1","v":-1},0.26767000000000002,0.57752000000000003,{"$f":"G32*'Pres & Prop Rev'!F33","v":0},null,null,null,null,null,null,null,"1,000 - 10,000 therms",{"$f":"W30","v":0},{"$f":"X30","v":0},{"$f":"Y30","v":0},0,0]
[{"$f":"TEXT('Rate Design'!N8,\"#,##0\")&\" - \"&TEXT('Rate Design'!N9,\"#,##0\")&\" therms\"","v":"10,000 - 25,000 therms"},null,null,{"$f":"'Rate Design'!F9/100","v":0.21692},{"$f":"F33-D33","v":0.30985000000000007},{"$f":"'Rate Design'!F19/100","v":0.52677000000000007},null,null,null,null,{"$f":"J33/D33-1","v":-1},0.21692,0.52677000000000007,{"$f":"G33*'Pres & Prop Rev'!F34","v":0},null,null,null,null,null,null,null,"10,000 - 25,000 therms",{"$f":"W30","v":0},{"$f":"X30","v":0},{"$f":"Y30","v":0},0,0]
[{"$f":"\"All over \"&TEXT('Rate Design'!N9,\"#,##0\")&\" therms\"","v":"All over 25,000 therms"},null,null,{"$f":"'Rate Design'!F10/100","v":0.14387},{"$f":"F34-D34","v":0.30985000000000001},{"$f":"'Rate Design'!F20/100","v":0.45372000000000001},null,null,null,null,{"$f":"J34/D34-1","v":-1},0.14387,0.45372000000000001,{"$f":"G34*'Pres & Prop Rev'!F35","v":0},null,null,null,null,null,null,null,"All over 25,000 therms",{"$f":"W30","v":0},{"$f":"X30","v":0},{"$f":"Y30","v":0},0,0]
["Minimum Charge:",null,null,null,null,null,null,null,null,null,null,null,null,null,null,null,null,null,null,null,null,"Minimum Charge:"]
["per month",null,null,{"$f":"'Rate Design'!F5","v":240.44},{"$f":"F36-D36","v":0},{"$f":"'Rate Design'!F15","v":240.44},null,null,null,null,{"$f":"J36/D36-1","v":-1},null,null,{"$f":"G36*'Pres & Prop Rev'!F49","v":0},null,null,null,null,null,null,null,"per month"]
["per therm",null,null,{"$f":"'Rate Design'!F6/100","v":0},{"$f":"F37-D37","v":0.30985000000000001},{"$f":"'Rate Design'!F16/100","v":0.30985000000000001},null,null,null,null,{"$f":"J37/D37-1","v":{"$error":"#DIV/0!"}},0,{"$f":"F37+G37-I37","v":0.30985000000000001},{"$f":"G37*'Pres & Prop Rev'!F31","v":0},null,null,null,null,null,null,null,"per therm",{"$f":"W30","v":0},{"$f":"X30","v":0},{"$f":"Y30","v":0},{"$f":"W37-X37+Y37","v":0},{"$f":"I37-Z37","v":0}]
["Annual Minimum per therm",null,null,"Present:",0.38268999999999997,null,null,null,null,null,{"$f":"J38/E38-1","v":-1},null,null,{"$f":"SUM(N30:N37)","v":0},{"$f":"N38-'Pres & Prop Rev'!F195","v":0},null,null,null,null,null,null,"Annual Minimum per therm"]
[null,null,null,null,null,null,null,null,null,null,null,null,null,null,null,null,null,null,null,null,null,null,null,null,null,null,"Billing"]
["Interruptible Service - Schedule 132",null,null,null,null,null,null,null,null,null,null,null,null,null,null,null,null,null,null,null,null,"Interruptible Service - Schedule 132","Sch 131","Sch 132","Sch 175","Difference","Rate"]
["Usage Charge:",null,null,null,null,null,null,null,null,null,null,null,null,null,null,null,null,null,null,null,null,"Usage Charge:"]
[{"$f":"\"First \"&TEXT('Rate Design'!O6,\"#,##0\")&\" therms\"","v":"First 10,000 therms"},null,null,{"$f":"'Rate Design'!G6/100","v":0.24655000000000002},{"$f":"F42-D42","v":0.24562999999999993},{"$f":"'Rate Design'!G16/100","v":0.49217999999999995},{"$f":"J42-D42","v":2.3529999999999968E-2},{"$f":"LIRAP!K15","v":7.2000000000000015E-4},{"$f":"F42+G42+H42","v":0.51642999999999994},{"$f":"'Rate Design'!G28/100","v":0.27007999999999999},{"$f":"J42/D42-1","v":9.5437031028188901E-2},{"$f":"D42+G42-J42","v":0},{"$f":"F42+G42-I42+H42","v":-5.377642775528102E-17},{"$f":"G42*'Pres & Prop Rev'!G31","v":5647.1999999999925},null,null,null,null,null,null,null,"First 10,000 therms",0,0,1.132E-2,{"$f":"W42-X42+Y42","v":1.132E-2},{"$f":"I42+Z42","v":0.52774999999999994}]
[{"$f":"TEXT('Rate Design'!O6,\"#,##0\")&\" - \"&TEXT('Rate Design'!O7,\"#,##0\")&\" therms\"","v":"10,000 - 25,000 therms"},null,null,{"$f":"'Rate Design'!G7/100","v":0.19792000000000001},{"$f":"F43-D43","v":0.24562999999999993},{"$f":"'Rate Design'!G17/100","v":0.44354999999999994},{"$f":"J43-D43","v":1.888999999999999E-2},{"$f":"H42","v":7.2000000000000015E-4},{"$f":"F43+G43+H43","v":0.46315999999999996},{"$f":"'Rate Design'!G29/100","v":0.21681},{"$f":"J43/D43-1","v":9.5442603071948184E-2},{"$f":"D43+G43-J43","v":0},{"$f":"F43+G43-I43+H43","v":1.7347234759768071E-18},{"$f":"G43*'Pres & Prop Rev'!G32","v":5761.0721999999969},null,null,null,null,null,null,null,"10,000 - 25,000 therms",{"$f":"W42","v":0},{"$f":"X42","v":0},{"$f":"Y42","v":1.132E-2},{"$f":"W43-X43+Y43","v":1.132E-2},{"$f":"I43+Z43","v":0.47447999999999996}]
[{"$f":"TEXT('Rate Design'!O7,\"#,##0\")&\" - \"&TEXT('Rate Design'!O8,\"#,##0\")&\" therms\"","v":"25,000 - 50,000 therms"},null,null,{"$f":"'Rate Design'!G8/100","v":0.18597999999999998},{"$f":"F44-D44","v":0.24562999999999996},{"$f":"'Rate Design'!G18/100","v":0.43160999999999994},{"$f":"J44-D44","v":1.7750000000000044E-2},{"$f":"H42","v":7.2000000000000015E-4},0.45007999999999998,{"$f":"'Rate Design'!G30/100","v":0.20373000000000002},{"$f":"J44/D44-1","v":9.5440369932251023E-2},0,1.7347234759768071E-18,{"$f":"G44*'Pres & Prop Rev'!G33","v":6075.328000000015},null,null,null,null,null,null,null,"25,000 - 50,000 therms",{"$f":"W42","v":0},0,1.132E-2,1.132E-2,0.46139999999999998]
[{"$f":"\"All over \"&TEXT('Rate Design'!O8,\"#,##0\")&\" therms\"","v":"All over 50,000 therms"},null,null,{"$f":"'Rate Design'!G9/100","v":0.18203},{"$f":"F45-D45","v":0.24562999999999999},{"$f":"'Rate Design'!G19/100","v":0.42765999999999998},{"$f":"J45-D45","v":0},{"$f":"H42","v":7.2000000000000015E-4},0.42837999999999998,{"$f":"'Rate Design'!G31/100","v":0.18203},{"$f":"J45/D45-1","v":0},0,1.7347234759768071E-18,{"$f":"G45*'Pres & Prop Rev'!G34","v":0},null,null,null,null,null,null,null,"All over 50,000 therms",0,0,1.132E-2,1.132E-2,0.43969999999999998]
["Annual Minimum per therm",null,null,"Present:",0.27731,null,null,null,"Proposed:",{"$f":"D43+0.05863+N(\"Tariffed Demand Rate, 2019 PGA - Grossed up for Rev Related Items\")+G43","v":0.27544000000000002},{"$f":"J46/E46-1","v":-6.7433558111860137E-3},null,null,{"$f":"SUM(N42:N45)","v":17483.600200000004},{"$f":"N46-'Pres & Prop Rev'!G195","v":1.0199999978794949E-2},null,null,null,null,null,null,"Annual Minimum per therm"]
[]
["Transportation Service - Schedule 146"]
["Basic Charge",null,null,{"$f":"'Rate Design'!H4","v":550},{"$f":"F49-D49","v":0},{"$f":"'Rate Design'!H14","v":550},{"$f":"IF(ROUND(I49-F49,5)<>ROUND(J49-D49,5),#VALUE!,J49-D49)","v":75},null,{"$f":"'Rate Design'!H36","v":625},{"$f":"'Rate Design'!H26","v":625},{"$f":"J49/D49-1","v":0.13636363636363646},null,null,{"$f":"G49*'Pres & Prop Rev'!H48","v":36000}]
["Usage Charge:"]
[{"$f":"\"First \"&TEXT('Rate Design'!P6,\"#,##0\")&\" therms\"","v":"First 20,000 therms"},null,null,{"$f":"'Rate Design'!H6/100","v":9.69E-2},{"$f":"F51-D51","v":1.3599999999999862E-3},{"$f":"'Rate Design'!H16/100","v":9.8259999999999986E-2},{"$f":"J51-D51","v":8.0399999999999916E-3},{"$f":"LIRAP!K16","v":1.8999999999999996E-4},{"$f":"F51+G51+H51","v":0.10648999999999997},{"$f":"'Rate Design'!H28/100","v":0.10493999999999999},{"$f":"J51/D51-1","v":8.2972136222910109E-2},{"$f":"D51+G51-J51","v":0},{"$f":"F51+G51-I51+H51","v":4.2283884726934673E-18},{"$f":"G51*'Pres & Prop Rev'!H31","v":68290.111799999926}]
[{"$f":"TEXT('Rate Design'!P6,\"#,##0\")&\" - \"&TEXT('Rate Design'!P7,\"#,##0\")&\" therms\"","v":"20,000 - 50,000 therms"},null,null,{"$f":"'Rate Design'!H7/100","v":8.6210000000000009E-2},{"$f":"F52-D52","v":1.3599999999999862E-3},{"$f":"'Rate Design'!H17/100","v":8.7569999999999995E-2},{"$f":"J52-D52","v":7.1499999999999897E-3},{"$f":"H51","v":1.8999999999999996E-4},{"$f":"F52+G52+H52","v":9.490999999999998E-2},{"$f":"'Rate Design'!H29/100","v":9.3359999999999999E-2},{"$f":"J52/D52-1","v":8.2937014267486342E-2},{"$f":"D52+G52-J52","v":0},{"$f":"F52+G52-I52+H52","v":4.2283884726934673E-18},{"$f":"G52*'Pres & Prop Rev'!H32","v":60876.765949999914}]
[{"$f":"TEXT('Rate Design'!P7,\"#,##0\")&\" - \"&TEXT('Rate Design'!P8,\"#,##0\")&\" therms\"","v":"50,000 - 300,000 therms"},null,null,{"$f":"'Rate Design'!H8/100","v":7.7740000000000004E-2},{"$f":"F53-D53","v":1.3600000000000001E-3},{"$f":"'Rate Design'!H18/100","v":7.9100000000000004E-2},{"$f":"J53-D53","v":6.4499999999999974E-3},{"$f":"H51","v":1.8999999999999996E-4},8.5739999999999997E-2,{"$f":"'Rate Design'!H30/100","v":8.4190000000000001E-2},{"$f":"J53/D53-1","v":8.2968870594288591E-2},0,4.2283884726934673E-18,{"$f":"G53*'Pres & Prop Rev'!H33","v":90002.842049999963}]
[{"$f":"TEXT('Rate Design'!P8,\"#,##0\")&\" - \"&TEXT('Rate Design'!P9,\"#,##0\")&\" therms\"","v":"300,000 - 500,000 therms"},null,null,{"$f":"'Rate Design'!H9/100","v":7.1889999999999996E-2},{"$f":"F54-D54","v":1.3600000000000001E-3},{"$f":"'Rate Design'!H19/100","v":7.3249999999999996E-2},{"$f":"J54-D54","v":5.960000000000007E-3},{"$f":"H51","v":1.8999999999999996E-4},7.9399999999999998E-2,{"$f":"'Rate Design'!H31/100","v":7.7850000000000003E-2},{"$f":"J54/D54-1","v":8.2904437334817116E-2},0,4.2283884726934673E-18,{"$f":"G54*'Pres & Prop Rev'!H34","v":16369.664480000019}]
[{"$f":"\"All over \"&TEXT('Rate Design'!P9,\"#,##0\")&\" therms\"","v":"All over 500,000 therms"},null,null,{"$f":"'Rate Design'!H10/100","v":5.4029999999999995E-2},{"$f":"F55-D55","v":1.3600000000000001E-3},{"$f":"'Rate Design'!H20/100","v":5.5389999999999995E-2},{"$f":"J55-D55","v":4.4800000000000048E-3},{"$f":"H51","v":1.8999999999999996E-4},6.0060000000000002E-2,{"$f":"'Rate Design'!H32/100","v":5.851E-2},{"$f":"J55/D55-1","v":8.2916898019618879E-2},0,-2.7105054312137611E-18,{"$f":"G55*'Pres & Prop Rev'!H35","v":8509.2716800000089}]
["Annual Minimum per therm",null,null,"Present:",8.9050000000000004E-2,null,null,null,"Proposed:",{"$f":"J52","v":9.3359999999999999E-2},{"$f":"J56/E56-1","v":4.839977540707463E-2},null,null,{"$f":"SUM(N49:N55)","v":280048.65595999983},{"$f":"N56-'Pres & Prop Rev'!H195","v":-1437.3445599999395}]
[null,null,null,null,null,null,null,null,null,null,null,null,null,{"$f":"'Pres & Prop Rev'!H156-'Pres & Prop Rev'!H107","v":1437.3505200000036},"Annual Minimum Difference"]
[]
[]
[]
["(1) Includes Schedule 150 (Purchase Gas Cost Adjustment), Schedule 155 (Gas Rate Adjustment), Schedule 174 (Tax Rebate),",null,null,null,null,null,null,null,null,null,null,null,null,{"$f":"N17+N27+N38+N46+N56","v":7739900.1915813992},{"$f":"O17+O27+O38+O46+O56","v":-286075.42426591489}]
["  Schedule 175 (Decoupling), Schedule 191 (DSM Adjustment) and Schedule 192 (LIRAP Adjustment).",null,null,null,null,null,null,null,null,null,null,null,null,null,{"$f":"'Pres & Prop Rev'!C190-'Pres & Prop Rev'!C142","v":284638.09000000032},"Weather & Unbilled Revenue"]
[null,null,null,null,null,null,null,null,null,null,null,null,null,null,{"$f":"N57","v":1437.3505200000036},"Sch 456 Annual Minimum Difference"]
[null,null,null,null,null,null,null,null,null,null,null,null,null,null,{"$f":"SUM(O61:O63)","v":1.6254085432592547E-2}]

{"sheet":"BFG","index":4,"n_rows":24,"n_cols":6,"rows_kept":24,"cut":false,"hidden":true,"merged":[]}
["AVISTA UTILITIES"]
["GAS ANNUAL MINIMUM DEFICIENCY FOR B.F. GOODRICH"]
["STATE OF WASHINGTON"]
["BASED ON 2007 ANNUAL MINIMUM"]
[]
[null,null,null,null,null,"Gas"]
["Annual Minimum Usage Requirement(1)",null,null,null,null,10500000]
["Less: Jan 09 - Dec 09 Usage(2)",null,null,null,null,{"$f":"SUMIF('Big Schedules'!$B$4:$B$48,\"BF Goodrich\",'Big Schedules'!$O$4:$O$48)","v":0}]
["Usage Deficiency",null,null,null,null,{"$f":"F7-F8","v":10500000}]
["Deficiency Charge per therm(3)",null,null,null,null,0]
["Annual Minimum Deficiency",null,null,null,null,{"$f":"F9*F10","v":0}]
[]
[]
[]
[]
["(1) Per Contract - workpaper BJH-G-36"]
["(2) From workpaper BJH-G-9"]
["(3) From workpaper BJH-G-35"]
[]
[]
["**  Annual Minimum Ended in 2009"]
[]
[]
[null,null,null,null,null,{"$f":"ROUND(F11-'Pres & Prop Rev'!J113,0)","v":0}]

{"sheet":"Rate Spread","index":5,"n_rows":23,"n_cols":10,"rows_kept":23,"cut":false,"hidden":false,"merged":[]}
[]
["Avista"]
["Natural Gas"]
["Rate Spread"]
[]
[]
[null,null,null,"Base Tariff",null,"Base",null,"Base Tariff","Total Billed","Percent "]
[null,null,null,"Distribution Revenue","Percentage ","Tariff","Proposed","Distribution Revenue","Revenue","Increase"]
["Line","Type of","Schedule","Under Present","of Base","Percent","General","Under Proposed","at Present","on Billed"]
["No.","Service","Number","Rates","Increase","Increase","Increase","Rates","Rates (1)","Revenue"]
[null,"(a)","(b)","(c)","(d)","(e)","(f)",null,"(g)","(i)"]
[]
[1,"General Service","101/102",{"$f":"RS!D14","v":71132.162639999995},1,{"$f":"$E$23*E13","v":8.6968698271383205E-2},{"$f":"D13*F13+0.3","v":6186.571590029117},{"$f":"D13+G13","v":77318.734230029106},{"$f":"RS!H14","v":112494.45944999999},{"$f":"(G13)/I13","v":5.4994455907215946E-2}]
[2,"Large General Service","111/112",{"$f":"RS!D15","v":17418.31235},1,{"$f":"$E$23*E14","v":8.6968698271383205E-2},{"$f":"D14*F14","v":1514.8479511638577},{"$f":"D14+G14","v":18933.160301163858},{"$f":"RS!H15","v":35000.977030000002},{"$f":"(G14)/I14","v":4.3280161861351835E-2}]
[3,"Large General Svc.-High Annual Load Factor","121/122",{"$f":"RS!D16","v":0},0,{"$f":"$E$23*E15","v":0},{"$f":"D15*F15","v":0},0,{"$f":"RS!H16","v":0},0]
[4,"Interruptible Service ","131/132",{"$f":"RS!D17","v":201.03106},{"$f":"E14","v":1},8.6968698271383205E-2,17.483409600316332,218.51446960031632,{"$f":"RS!H17","v":443.04218999999995},3.9462177632149056E-2]
[5,"Transportation Service","146",{"$f":"RS!D18","v":3235.6129826000001},1,{"$f":"$E$23*E17","v":8.6968698271383205E-2},281.39704920670971,3517.0100318067098,{"$f":"RS!H18","v":3284.0397625999999},8.5686249116522714E-2]
[6,"Special Contracts","148",{"$f":"RS!D19","v":1719.7288500000002},0,0,0,1719.7288500000002,{"$f":"RS!H19","v":1719.7288500000002},0]
[7,"Total",null,{"$f":"'Pres & Prop Rev'!$C$145/1000-0.2","v":93706.847882599992},null,{"$f":"D23/D19","v":8.5372629437100986E-2},{"$f":"SUM(G13:G18)","v":8000.3000000000011},{"$f":"SUM(H13:H18)","v":101707.14788259998},{"$f":"SUM(I13:I18)+0.4","v":152942.64728260002},{"$f":"(G19)/I19","v":5.230915079701369E-2}]
[]
[]
[]
[null,"Revenue Requirement",null,8000,{"$f":"D23/(D19-D18)","v":8.6968698271383205E-2}]

{"sheet":"Bill Impact","index":6,"n_rows":102,"n_cols":16,"rows_kept":102,"cut":false,"hidden":false,"merged":[]}
[]
["Schedule 101 Bill Impact"]
[]
[]
[]
["Schedule 101 Present",null,null,null,null,null,"Schedule 101 Proposed"]
[null,"Basic Charge","Block 1","Block 2","Total Bill",null,"Basic Charge","Block 1","Block 2","Total Bill",null,"Bill Impact","% Change"]
[null,{"$f":"'Rate Design'!D4","v":9.5},{"$f":"'Rate Design'!D16/100","v":0.68842999999999999},{"$f":"'Rate Design'!D17/100","v":0.79849000000000003},null,null,{"$f":"'Rate Design'!D26","v":9.5},{"$f":"RD!I15-0.02141","v":0.71110999999999991},{"$f":"RD!I16-0.02141","v":0.83409}]
[10,{"$f":"$B$8","v":9.5},{"$f":"A9*$C$8","v":6.8842999999999996},null,{"$f":"SUM(B9:D9)","v":16.3843},null,{"$f":"$G$8","v":9.5},{"$f":"A9*$H$8","v":7.1110999999999986},null,{"$f":"SUM(G9:I9)","v":16.6111},null,{"$f":"J9-E9","v":0.22680000000000078},{"$f":"L9/E9","v":1.3842519973389207E-2}]
[{"$f":"A9+10","v":20},{"$f":"$B$8","v":9.5},13.768599999999999,null,{"$f":"SUM(B10:D10)","v":23.268599999999999},null,{"$f":"$G$8","v":9.5},{"$f":"A10*$H$8","v":14.222199999999997},null,23.722199999999997,null,0.453599999999998,1.949408215363185E-2]
[{"$f":"A10+10","v":30},9.5,20.652899999999999,null,30.152899999999999,null,9.5,21.333299999999998,null,30.833299999999998,null,0.68039999999999878,2.2564993748528293E-2]
[40,9.5,27.537199999999999,null,37.037199999999999,null,9.5,28.444399999999995,null,37.944399999999995,null,0.90719999999999601,2.4494292225114102E-2]
[50,9.5,34.421500000000002,null,43.921500000000002,null,9.5,35.555499999999995,null,45.055499999999995,null,1.1339999999999932,2.5818790341859753E-2]
[60,9.5,41.305799999999998,null,50.805799999999998,null,9.5,42.666599999999995,null,52.166599999999995,null,1.3607999999999976,2.6784343519834303E-2]
[{"$f":"ROUND('Pres & Prop Rev'!D46/'Pres & Prop Rev'!D48,0)","v":66},9.5,{"$f":"ROUND(A15*$C$8,2)","v":45.44},null,{"$f":"SUM(B15:D15)","v":54.94},null,9.5,{"$f":"ROUND(A15*$H$8,2)","v":46.93},null,{"$f":"SUM(G15:I15)","v":56.43},null,1.490000000000002,{"$f":"L15/E15","v":2.7120495085547907E-2},null,null,"Includes Remand"]
[{"$f":"A14+10","v":70},9.5,{"$f":"ROUND(A16*$C$8,2)","v":48.19},null,57.69,null,9.5,{"$f":"ROUND(A16*$H$8,2)","v":49.78},null,59.28,null,{"$f":"J16-E16","v":1.5900000000000034},2.7561102444097825E-2]
[80,9.5,{"$f":"70*$C$8","v":48.190100000000001},{"$f":"(A17-70)*$D$8","v":7.9849000000000006},{"$f":"SUM(B17:D17)","v":65.674999999999997},null,9.5,{"$f":"70*$H$8","v":49.777699999999996},{"$f":"(A17-70)*$I$8","v":8.3408999999999995},67.618600000000001,null,1.9436000000000035,2.9594213932242156E-2]
[90,9.5,{"$f":"70*$C$8","v":48.190100000000001},{"$f":"(A18-70)*$D$8","v":15.969800000000001},73.659900000000007,null,9.5,{"$f":"70*$H$8","v":49.777699999999996},{"$f":"(A18-70)*$I$8","v":16.681799999999999},75.959499999999991,null,2.2995999999999839,3.1219157234804604E-2]
[100,9.5,48.190100000000001,{"$f":"(A19-70)*$D$8","v":23.954700000000003},81.644800000000004,null,9.5,49.777699999999996,25.0227,84.300399999999996,null,2.6555999999999926,3.2526260092498142E-2]
[110,9.5,48.190100000000001,31.939600000000002,89.6297,null,9.5,49.777699999999996,33.363599999999998,92.641300000000001,null,3.0116000000000014,3.3600469487234719E-2]
[120,9.5,48.190100000000001,39.924500000000002,97.614599999999996,null,9.5,49.777699999999996,41.704500000000003,100.98220000000001,null,3.3676000000000101,3.4498937658915881E-2]
[130,9.5,48.190100000000001,47.909400000000005,105.59950000000001,null,9.5,49.777699999999996,50.045400000000001,109.3231,null,3.7235999999999905,3.5261530594368255E-2]
[140,9.5,48.190100000000001,55.894300000000001,113.5844,null,9.5,49.777699999999996,58.386299999999999,117.66399999999999,null,4.079599999999985,3.5916904081898439E-2]
[150,9.5,48.190100000000001,63.879200000000004,121.5693,null,9.5,49.777699999999996,66.727199999999996,126.00489999999999,null,4.4355999999999938,3.6486185245781573E-2]
[160,9.5,48.190100000000001,71.864100000000008,129.55420000000001,null,9.5,49.777699999999996,75.068100000000001,134.3458,null,4.7915999999999883,3.6985292641998388E-2]
[170,9.5,48.190100000000001,79.849000000000004,137.53910000000002,null,9.5,49.777699999999996,83.409000000000006,142.6867,null,5.1475999999999829,3.7426448188187814E-2]
[180,9.5,48.190100000000001,87.8339,145.524,null,9.5,49.777699999999996,91.749899999999997,151.02760000000001,null,5.5036000000000058,3.7819191336137037E-2]
[190,9.5,48.190100000000001,95.81880000000001,153.50890000000001,null,9.5,49.777699999999996,100.0908,159.36849999999998,null,5.8595999999999719,3.8171076725844376E-2]
[200,9.5,48.190100000000001,103.80370000000001,161.49380000000002,null,9.5,49.777699999999996,108.43170000000001,167.70940000000002,null,6.2155999999999949,3.848816487072565E-2]
[210,9.5,48.190100000000001,111.7886,169.4787,null,9.5,49.777699999999996,116.7726,176.05029999999999,null,6.5715999999999894,3.8775374132560547E-2]
[220,9.5,48.190100000000001,119.7735,177.46359999999999,null,9.5,49.777699999999996,125.1135,184.3912,null,6.9276000000000124,3.9036737674655611E-2]
[230,9.5,48.190100000000001,127.75840000000001,185.44850000000002,null,9.5,49.777699999999996,133.45439999999999,192.7321,null,7.2835999999999785,3.9275594032844578E-2]
[240,9.5,48.190100000000001,135.7433,193.43340000000001,null,9.5,49.777699999999996,141.7953,201.07299999999998,null,7.6395999999999731,3.9494730486048291E-2]
[250,9.5,48.190100000000001,143.72820000000002,201.41830000000002,null,9.5,49.777699999999996,150.1362,209.41390000000001,null,7.995599999999996,3.9696492324679512E-2]
[260,9.5,48.190100000000001,151.7131,209.4032,null,9.5,49.777699999999996,158.47710000000001,217.75479999999999,null,8.3515999999999906,3.9882867119509113E-2]
[270,9.5,48.190100000000001,159.69800000000001,217.38810000000001,null,9.5,49.777699999999996,166.81800000000001,226.09570000000002,null,8.7076000000000136,4.0055550418813236E-2]
[280,9.5,48.190100000000001,167.68290000000002,225.37300000000002,null,9.5,49.777699999999996,175.15889999999999,234.4366,null,9.0635999999999797,4.0215997479733506E-2]
[290,9.5,48.190100000000001,175.6678,{"$f":"SUM(B38:D38)","v":233.3579},null,9.5,49.777699999999996,183.49979999999999,242.77749999999997,null,9.4195999999999742,4.0365464378964558E-2]
[300,9.5,48.190100000000001,183.65270000000001,241.34280000000001,null,9.5,49.777699999999996,191.8407,251.11840000000001,null,9.7755999999999972,4.0505040962481566E-2]
[310,9.5,48.190100000000001,{"$f":"(A40-70)*$D$8","v":191.63760000000002},{"$f":"SUM(B40:D40)","v":249.32770000000002},null,9.5,49.777699999999996,{"$f":"(A40-70)*$I$8","v":200.1816},{"$f":"SUM(G40:I40)","v":259.45929999999998},null,10.131599999999963,4.0635677463835597E-2]
[320,9.5,48.190100000000001,199.6225,257.31259999999997,null,9.5,49.777699999999996,208.52250000000001,267.80020000000002,null,10.487600000000043,4.0758206166351917E-2]
[330,9.5,48.190100000000001,207.60740000000001,265.29750000000001,null,9.5,49.777699999999996,216.86340000000001,276.14109999999999,null,10.843599999999981,4.0873359153403177E-2]
[340,9.5,48.190100000000001,215.59230000000002,273.28240000000005,null,9.5,49.777699999999996,225.20429999999999,284.48199999999997,null,11.199599999999919,4.0981782946870771E-2]
[350,9.5,48.190100000000001,223.5772,281.26729999999998,null,9.5,49.777699999999996,233.54519999999999,292.8229,null,11.555600000000027,4.1084050652173319E-2]
[360,9.5,48.190100000000001,231.56210000000002,289.25220000000002,null,9.5,49.777699999999996,241.8861,301.16379999999998,null,11.911599999999964,4.1180672091690101E-2]
[370,9.5,48.190100000000001,239.547,297.2371,null,9.5,49.777699999999996,250.227,309.50470000000001,null,12.267600000000016,4.1272102304860385E-2]
[380,9.5,48.190100000000001,{"$f":"(A47-70)*$D$8","v":247.53190000000001},{"$f":"SUM(B47:D47)","v":305.22199999999998},null,9.5,49.777699999999996,258.56790000000001,317.84559999999999,null,12.62360000000001,4.1358748714050791E-2]
[390,9.5,48.190100000000001,255.51680000000002,313.20690000000002,null,9.5,49.777699999999996,266.90879999999999,326.18649999999997,null,12.979599999999948,4.1440977194308129E-2]
[400,9.5,48.190100000000001,263.50170000000003,321.19180000000006,null,9.5,49.777699999999996,275.24970000000002,334.5274,null,13.335599999999943,4.1519117237737511E-2]
[]
[]
[]
["Breakeven Analysis (Base Rates)"]
[]
["Schedule 101",null,null,null,null,null,"Schedule 111"]
[null,"Basic Charge","Block 1","Block 2","Total Bill",null,"Minimum Charge","Block 1","Block 2","Block 3","Total Bill",null,"Bill Differential"]
[null,{"$f":"RD!J13","v":9.5},{"$f":"'Rate Design'!D28/100","v":0.41034999999999999},{"$f":"'Rate Design'!D29/100","v":0.53332999999999997},null,null,{"$f":"'Rate Design'!E27","v":107.56},{"$f":"'Rate Design'!E28/100","v":0},{"$f":"'Rate Design'!E29/100","v":0.36158999999999997},{"$f":"'Rate Design'!E30/100","v":0.27562000000000003}]
[10,{"$f":"$B$57","v":9.5},{"$f":"A58*$C$57","v":4.1035000000000004},null,{"$f":"SUM(B58:D58)","v":13.6035},null,{"$f":"$G$57","v":107.56},{"$f":"A58*$H$57","v":0},null,null,{"$f":"SUM(G58:J58)","v":107.56},null,{"$f":"K58-E58","v":93.956500000000005}]
[{"$f":"A58+10","v":20},9.5,{"$f":"A59*$C$57","v":8.2070000000000007},null,{"$f":"SUM(B59:D59)","v":17.707000000000001},null,{"$f":"$G$57","v":107.56},{"$f":"A59*$H$57","v":0},null,null,{"$f":"SUM(G59:J59)","v":107.56},null,89.853000000000009]
[{"$f":"A59+10","v":30},9.5,12.310499999999999,null,21.810499999999998,null,107.56,0,null,null,107.56,null,85.749500000000012]
[40,9.5,16.414000000000001,null,25.914000000000001,null,107.56,0,null,null,107.56,null,81.646000000000001]
[50,9.5,20.517499999999998,null,30.017499999999998,null,107.56,0,null,null,107.56,null,77.542500000000004]
[60,9.5,24.620999999999999,null,34.120999999999995,null,107.56,0,null,null,107.56,null,73.439000000000007]
[70,9.5,{"$f":"A64*$C$57","v":28.724499999999999},null,38.224499999999999,null,107.56,0,null,null,107.56,null,69.335499999999996]
[80,9.5,{"$f":"70*$C$57","v":28.724499999999999},{"$f":"(A65-70)*$D$57","v":5.3332999999999995},43.5578,null,107.56,0,null,null,107.56,null,64.002200000000002]
[90,9.5,{"$f":"70*$C$57","v":28.724499999999999},{"$f":"(A66-70)*$D$57","v":10.666599999999999},48.891099999999994,null,107.56,0,null,null,107.56,null,58.668900000000008]
[100,9.5,28.724499999999999,15.999899999999998,54.224399999999996,null,107.56,0,null,null,107.56,null,53.335600000000007]
[110,9.5,28.724499999999999,21.333199999999998,59.557699999999997,null,107.56,0,null,null,107.56,null,48.002300000000005]
[120,9.5,28.724499999999999,26.666499999999999,64.890999999999991,null,107.56,0,null,null,107.56,null,42.669000000000011]
[130,9.5,28.724499999999999,31.999799999999997,70.224299999999999,null,107.56,0,null,null,107.56,null,37.335700000000003]
[140,9.5,28.724499999999999,37.333099999999995,75.557599999999994,null,107.56,0,null,null,107.56,null,32.002400000000009]
[150,9.5,28.724499999999999,42.666399999999996,80.890899999999988,null,107.56,0,null,null,107.56,null,26.669100000000014]
[160,9.5,28.724499999999999,47.999699999999997,86.224199999999996,null,107.56,0,null,null,107.56,null,21.335800000000006]
[170,9.5,28.724499999999999,53.332999999999998,91.557500000000005,null,107.56,0,null,null,107.56,null,16.002499999999998]
[180,9.5,28.724499999999999,58.6663,96.890799999999999,null,107.56,0,null,null,107.56,null,10.669200000000004]
[190,9.5,28.724499999999999,63.999599999999994,102.22409999999999,null,107.56,0,null,null,107.56,null,5.3359000000000094]
[200,9.5,28.724499999999999,69.332899999999995,107.5574,null,107.56,0,null,null,107.56,null,2.6000000000010459E-3]
[210,9.5,28.724499999999999,74.666199999999989,112.89069999999998,null,107.56,{"$f":"200*$H$57","v":0},{"$f":"(A78-200)*$I$57","v":3.6158999999999999},null,111.1759,null,-1.7147999999999826]
[220,9.5,28.724499999999999,79.999499999999998,118.22399999999999,null,107.56,0,{"$f":"(A79-200)*$I$57","v":7.2317999999999998},null,114.79179999999999,null,-3.4321999999999946]
[230,9.5,28.724499999999999,85.332799999999992,123.5573,null,107.56,0,10.8477,null,118.40770000000001,null,-5.1495999999999924]
[240,9.5,28.724499999999999,90.6661,128.89060000000001,null,107.56,0,14.4636,null,122.0236,null,-6.8670000000000044]
[250,9.5,28.724499999999999,95.999399999999994,134.22389999999999,null,107.56,0,18.079499999999999,null,125.6395,null,-8.584399999999988]
[260,9.5,28.724499999999999,101.33269999999999,139.55719999999999,null,107.56,0,21.695399999999999,null,129.25540000000001,null,-10.301799999999986]
[270,9.5,28.724499999999999,106.666,144.8905,null,107.56,0,25.311299999999999,null,132.87129999999999,null,-12.019200000000012]
[280,9.5,28.724499999999999,111.99929999999999,150.22379999999998,null,107.56,0,28.927199999999999,null,136.4872,null,-13.736599999999981]
[290,9.5,28.724499999999999,117.3326,155.55709999999999,null,107.56,0,32.543099999999995,null,140.10309999999998,null,-15.454000000000008]
[300,9.5,28.724499999999999,122.66589999999999,160.8904,null,107.56,0,36.158999999999999,null,143.71899999999999,null,-17.171400000000006]
[310,9.5,28.724499999999999,127.99919999999999,166.22369999999998,null,107.56,0,39.774899999999995,null,147.3349,null,-18.888799999999975]
[320,9.5,28.724499999999999,133.33249999999998,171.55699999999999,null,107.56,0,43.390799999999999,null,150.95080000000002,null,-20.606199999999973]
[330,9.5,28.724499999999999,138.66579999999999,176.8903,null,107.56,0,47.006699999999995,null,154.5667,null,-22.323599999999999]
[340,9.5,28.724499999999999,143.9991,182.2236,null,107.56,0,50.622599999999998,null,158.18260000000001,null,-24.040999999999997]
[350,9.5,28.724499999999999,149.33239999999998,187.55689999999998,null,107.56,0,54.238499999999995,null,161.79849999999999,null,-25.758399999999995]
[500,9.5,28.724499999999999,{"$f":"(A93-70)*$D$57","v":229.33189999999999},{"$f":"SUM(B93:D93)","v":267.5564},null,107.56,0,{"$f":"(A93-200)*$I$57","v":108.47699999999999},null,{"$f":"SUM(G93:J93)","v":216.03699999999998},null,-51.519400000000019]
[]
[]
["Breakeven Analysis (Base Rates)"]
[]
["Schedule 101",null,null,null,null,null,null,"Schedule 121"]
[null,"Basic Charge","Block 1","Block 2","Block 3","Total Bill",null,"Minimum Charge","Block 1","Block 2","Block 3","Block 4","Total Bill",null,"Bill Differential"]
[null,{"$f":"B57","v":9.5},{"$f":"C57","v":0.41034999999999999},0.53332999999999997,0,null,null,{"$f":"'Rate Design'!F27","v":0},{"$f":"'Rate Design'!F28/100","v":0},{"$f":"'Rate Design'!F29/100","v":0},{"$f":"'Rate Design'!F30/100","v":0},{"$f":"'Rate Design'!F31/100","v":0}]
[200,{"$f":"$B$100","v":9.5},{"$f":"70*$C$100","v":28.724499999999999},{"$f":"D100*(A101-70)","v":69.332899999999995},null,{"$f":"SUM(B101:E101)","v":107.5574},null,{"$f":"$H$100","v":0},{"$f":"A101*$I$100","v":0},null,null,null,{"$f":"SUM(H101:L101)","v":0},null,{"$f":"M101-F101","v":-107.5574}]
[500,{"$f":"$B$100","v":9.5},{"$f":"$C$101","v":28.724499999999999},{"$f":"D100*(A102-70)","v":229.33189999999999},null,{"$f":"SUM(B102:E102)","v":267.5564},null,{"$f":"$H$100","v":0},{"$f":"A102*$I$100","v":0},null,null,null,{"$f":"SUM(H102:L102)","v":0},null,{"$f":"M102-F102","v":-267.5564}]

{"sheet":"LIRAP","index":7,"n_rows":43,"n_cols":19,"rows_kept":43,"cut":false,"hidden":false,"merged":[]}
[]
[]
[]
[]
[]
[]
[]
[null,null,null,null,"Present ","Present",4.8000000000000001E-2,"Proposed","Proposed",null,"Total",null,null,null,null,null,null,"Present "]
[null,"Type of","Schedule","Billing ","LIRAP Funding","LIRAP Funding","LIRAP Funding","LIRAP Funding","LIRAP ",null,"Incremental ",null,null,null,null,null,null,"Billed"]
[null,"Service","Number","Determinants","Rate","Revenue","Increased","Revenue","Rate",null,"Rate",null,null,null,null,null,null,"Revenue"]
[null,"(a)","(b)","(c)","(d)","(e)","(f)","(g)","(h)",null,"Change"]
[null,null,null,null,null,null,null,null,null,null,"(m)"]
[null,"General Service","101/102",{"$f":"'Pres & Prop Rev'!D46","v":128985980.09020999},2.0930000000000001E-2,{"$f":"D13*E13","v":2699676.5632880954},{"$f":"F13*$G$43","v":125683.30819486694},{"$f":"F13+G13","v":2825359.8714829623},{"$f":"ROUND(H13/D13,5)","v":2.1899999999999999E-2},null,{"$f":"I13-E13","v":9.6999999999999864E-4},null,null,null,null,null,null,{"$f":"RS!H14*1000","v":112494459.44999999},{"$f":"(G13)/R13","v":1.1172399850565881E-3}]
[null,"Large General Service","111/112",{"$f":"'Pres & Prop Rev'!E46","v":55884877.126180045},1.754E-2,{"$f":"D14*E14","v":980220.74479319796},{"$f":"F14*$G$43","v":45634.128044137316},{"$f":"F14+G14","v":1025854.8728373352},{"$f":"ROUND(H14/D14,5)","v":1.8360000000000001E-2},null,{"$f":"I14-E14","v":8.2000000000000128E-4},null,null,null,null,null,null,{"$f":"RS!H15*1000","v":35000977.030000001},{"$f":"(G14)/R14","v":1.3037958341855268E-3}]
[null,"Interruptible Service ","131/132",{"$f":"'Pres & Prop Rev'!G46","v":985267},1.5389999999999999E-2,15163.259129999999,{"$f":"F15*$G$43","v":705.92477498610867},15869.183904986106,1.6109999999999999E-2,null,7.2000000000000015E-4,null,null,null,null,null,null,{"$f":"RS!H17*1000","v":443042.18999999994},1.5933579034224906E-3]
[null,"Transportation Service","146",{"$f":"'Pres & Prop Rev'!H46","v":35607936},8.0000000000000004E-4,28486.3488,{"$f":"H16-F16","v":6684.6410312000007},{"$f":"C40","v":35170.9898312},9.8999999999999999E-4,null,1.8999999999999996E-4,null,null,null,null,null,null,{"$f":"RS!H18*1000","v":3284039.7626},2.0354933296872504E-3]
[null,"Special Contracts","148",{"$f":"'Pres & Prop Rev'!I46+'Pres & Prop Rev'!J46","v":54517605},null,0,{"$f":"F17*$G$37","v":0},0,null,null,null,null,null,null,null,null,null,{"$f":"RS!H19*1000","v":1719728.85},0]
[null,"Total",null,{"$f":"SUM(D13:D17)","v":275981665.21639001},null,{"$f":"SUM(F13:F17)","v":3723546.9160112934},{"$f":"SUM(G13:G17)","v":178708.00204519037},{"$f":"SUM(H13:H17)","v":3902254.9180564834},null,null,null,null,null,null,null,null,null,{"$f":"SUM(R13:R17)","v":152942247.28259999},1.168467217007617E-3]
[]
[null,null,null,null,"Net Funding",{"$f":"F18*G36","v":3559133.7019348145},{"$f":"G18*G36","v":170817.15021488498},{"$f":"H18*G36","v":3729950.8521496993}]
[null,null,null,null,null,null,{"$f":"G20/F20","v":4.7994024535247287E-2}]
[]
[]
[null,"Natural Gas"]
[null,"Sch 101 Base Rate Change",{"$f":"RS!X14","v":5.8997012267623647E-2},"Sch 101 & 150 revenue"]
[null,"times 2",{"$f":"C25*2","v":0.11799402453524729}]
[null,"less Oct Increase",-7.0000000000000007E-2]
[null,"Incremental Change",{"$f":"SUM(C26:C27)","v":4.7994024535247287E-2}]
[]
[]
[]
[]
[]
[]
[null,"Schedule 146 Calculation",null,null,null,null,{"$f":"(RS!X14*2)-0.07","v":4.7994024535247287E-2},"Funding Increase (101 - 132)"]
[null,null,null,null,null,null,0.95584499999999994,"Revenue Conversion Factor"]
[null,"Base Revenue (UG-190335)",{"$f":"RS!F18*1000","v":3517098.98312}]
[null,null,0.01,null,null,null,null," "]
[null,null,null,null,null,null,null,null,null,null,"Present Bill",{"$f":"ROUND((66*'Bill Impact'!C8),2)+9.5","v":54.94},null,null,"66 Therms"]
[null,"Proposed LIRAP Revenue",{"$f":"C37*C38","v":35170.9898312},null,null,null,null,null,null,null,"Proposed Bill",{"$f":"ROUND((66*('Bill Impact'!C8+K13)),2)+9.5","v":55}]
[null,null,null,null,null,null,{"$f":"F18*G35","v":178708.0020451904},null,null,null,"Bill Change",{"$f":"L40-L39","v":6.0000000000002274E-2},null,{"$f":"L41/L39","v":1.0921004732435799E-3}]
[null,null,null,null,null,null,{"$f":"G41-G16","v":172023.36101399039}]
[null,null,null,null,null,null,{"$f":"G42/SUM(F13:F15)","v":4.6554950287003946E-2}]

{"sheet":"Bill Determ","index":8,"n_rows":98,"n_cols":8,"rows_kept":98,"cut":false,"hidden":false,"merged":[]}
["AVISTA UTILITIES"]
["WASHINGTON GAS"]
["USAGE & BILLINGS BY RATE SCHEDULE"]
["12 MONTHS ENDED DECEMBER 31, 2018"]
[]
["Schedule 101/102","Total therms","Total Billings",null,"0-70",">70","Total Therms"]
["therms per Revenue Run(1)(2)",{"$f":"'12MEDEC18'!P162","v":123968342.09020998},{"$f":"'12MEDEC18'!O26","v":1941495},null,{"$f":"'Block Usage'!O17","v":78130536.427342966},{"$f":"'Block Usage'!O18","v":45837805.662867025},{"$f":"SUM(D7:F7)","v":123968342.09020999}]
[null,null,null,null,null,null,{"$f":"'12MEDEC18'!P162","v":123968342.09020998}]
["Schedule 111,112, 116 - Present","0-200 thms","201-1000 thms","> 1000 thms","Total","Billings",{"$f":"G8-G7","v":0}]
["therms by block(2)",{"$f":"'Block Usage'!O35","v":6375094.2101864293},{"$f":"'Block Usage'!O36","v":16565126.557450794},{"$f":"'Block Usage'!O37","v":29697691.912542783},{"$f":"SUM(B10:D10)","v":52637912.680180006}]
["less: shifted to Sch 146",0,0,0,{"$f":"SUM(B11:D11)","v":0}]
["Total therms by block",{"$f":"SUM(B10:B11)","v":6375094.2101864293},{"$f":"SUM(C10:C11)","v":16565126.557450794},{"$f":"SUM(D10:D11)","v":29697691.912542783},{"$f":"SUM(E10:E11)","v":52637912.680180006}]
["Per Rev. Run(1)",null,null,null,{"$f":"'12MEDEC18'!P163","v":52637912.680179998},{"$f":"'12MEDEC18'!O27","v":36840}]
["less: shifted to Sch. 146",0,0,0,{"$f":"SUM(B14:D14)","v":0},0]
["less: shifted from Sch. 121 ",null,null,null,0,0]
["Total",null,null,null,{"$f":"E13+E14+E15","v":52637912.680179998},{"$f":"F13+F14+F15","v":36840}]
["Adjust. To Actual",null,null,null,{"$f":"E16-E12","v":0}]
[null,null,null,"1001-10000","10000-",null,"Total"]
["Schedule 111,112, 116 - Proposed","0-200 thms","201-1000 thms","therms","25000 thms",">25000 thms","therms","Total Billings"]
["therms by block(2)",{"$f":"B12","v":6375094.2101864293},{"$f":"C12","v":16565126.557450794},{"$f":"D12","v":29697691.912542783},null,null,{"$f":"SUM(B20:F20)","v":52637912.680180006},{"$f":"F16","v":36840}]
["Block Adjustment",null,null,{"$f":"-E21","v":-699286.76399999997},{"$f":"'121 to 111'!U90","v":699286.76399999997},null,{"$f":"SUM(B21:F21)","v":0}]
["Add:  Sch 121/122",{"$f":"'Sch 111 Rate Design'!Q37","v":7200},{"$f":"'Sch 111 Rate Design'!R37","v":28800},{"$f":"'Sch 111 Rate Design'!S37","v":324000},{"$f":"'Sch 111 Rate Design'!T37","v":536304.83000000007},{"$f":"'Sch 111 Rate Design'!U37","v":743508.10100007057},1639812.9310000706,{"$f":"H29","v":36}]
["Total",{"$f":"SUM(B20:B22)","v":6382294.2101864293},{"$f":"SUM(C20:C22)","v":16593926.557450794},29322405.148542784,1235591.594,743508.10100007057,54277725.611180075,36876]
[]
[null,null,null,"1001-10000","10000-",null,"Total"]
["Schedule 121,122","0-500 thms","501-1000 thms","therms","25000 thms",">25000 thms","therms","Total Billings"]
["therms by block(3)",{"$f":"'Block Usage'!O60","v":22499.891669999983},{"$f":"'Block Usage'!O61","v":22499.666660000003},{"$f":"'Block Usage'!O62","v":398964.25031999964},{"$f":"'Block Usage'!O63","v":578951.37607},{"$f":"'Block Usage'!O64","v":745405.11600003822},{"$f":"SUM(B27:F27)","v":1768320.3007200379},{"$f":"'12MEDEC18'!O28","v":45}]
["less: Closed Acct",{"$f":"-'121 to 111'!R32","v":-4500},{"$f":"-'121 to 111'!S32","v":-4500},{"$f":"-'121 to 111'!T32","v":-74964.027000000002},{"$f":"-'121 to 111'!U32","v":-42646.771999999997},{"$f":"-'121 to 111'!V32","v":-1897.5},{"$f":"SUM(B28:F28)","v":-128508.299},{"$f":"-'121 to 111'!X32","v":-9}]
["Total therms by block",{"$f":"SUM(B27:B28)","v":17999.891669999983},{"$f":"SUM(C27:C28)","v":17999.666660000003},324000.22331999964,536304.60407,743507.61600003822,1639812.0017200378,36]
["Per Rev. Run(1)",null,null,null,null,null,{"$f":"'12MEDEC18'!P164","v":1768320.3007200379}]
["less: Acct closed (2)",null,null,null,null,null,{"$f":"G28","v":-128508.299}]
["Total",null,null,null,null,null,{"$f":"G30+G31","v":1639812.0017200378}]
[null,null,null,null,null,null,{"$f":"G29-G32","v":0}]
[null,"first","next","next","over","Total"]
["Schedule 131,132","10000 thms","15000 thms","25000 thms","50000 thms","therms","Total Billings"]
["billed/pro forma therms(3)",{"$f":"'Big Schedules'!Q108","v":240000},{"$f":"'Big Schedules'!R108","v":304980},{"$f":"'Big Schedules'!S108","v":342272},{"$f":"'Big Schedules'!T108","v":98015},{"$f":"SUM(B36:E36)","v":985267},24]
[]
[null,"first","next","next","next","over","Total"]
["Schedule 146","20000 thms","30000 thms","250000 thms","200000 thms","500000 thms","therms","Total Billings"]
["billed/pro forma therms(4)",{"$f":"'Big Schedules'!Q48","v":8493795},{"$f":"'Big Schedules'!R48","v":8514233},{"$f":"'Big Schedules'!S48","v":13953929},{"$f":"'Big Schedules'!T48","v":2746588},{"$f":"'Big Schedules'!U48","v":1899391},{"$f":"SUM(B40:F40)","v":35607936},{"$f":"40*12","v":480}]
[]
["Sch. 147-Interdepartmental(3)","Total therms"]
["billed/pro forma therms",{"$f":"'Big Schedules'!O132","v":5405533}]
[]
["Sch. 148-Sp. Contracts(3)","Total therms","Total Billings"]
["Kaiser -Trentwood",{"$f":"'Big Schedules'!O116","v":24532118},12]
["Lamb-Weston",{"$f":"'Big Schedules'!O117","v":6237208},12]
["Mutual Materials",{"$f":"'Big Schedules'!O118","v":2090525},12]
["Washington Potato",{"$f":"'Big Schedules'!O119","v":5652763},12]
["Total",{"$f":"SUM(B46:B49)","v":38512614},{"$f":"SUM(C46:C49)","v":48}]
[]
["Wash. State Univ.",{"$f":"MAX(8000000,'Big Schedules'!O120)","v":10599458},12]
[]
["(1) shown on workpaper JDM-G-11"]
["(2) shown on workpaper JDM-G-9"]
["(3) shown on workpaper JDM-G-10"]
["(4) shown on workpaper JDM-G-9"]
[]
[]
[]
[]
[]
[]
[]
["USAGE"]
["Revenue Run therms, this sheet",{"$f":"B7+E16+F36+G40+B43+B50+B52+G27","v":269485383.07111001}]
[]
["actual Revenue Run therms",{"$f":"'12MEDEC18'!P169","v":269485382.79811001}]
["less:"]
["Sch 132 Jan 2016 billing",{"$f":"-'Big Schedules'!C113","v":0.27900000000954606}]
["Schedule 121 Shifting",{"$f":"G28","v":-128508.299}]
["Sch 146 Shifting",{"$f":"-'Big Schedules'!O48+G40","v":0}]
["Sch 11/12 Shifting",{"$f":"-E15-E14","v":0}]
[null,{"$f":"B68-SUM(B69:B73)","v":269613890.81810999}]
["Diff",{"$f":"B66-B74","v":-128507.74699997902}]
[]
["from Present Rev tab",{"$f":"SUM('Pres & Prop Rev'!D20:J20)","v":269356874.77211004}]
["this sheet",{"$f":"B66","v":269485383.07111001}]
["Diff",{"$f":"B77-B78","v":-128508.29899996519}]
[]
[]
["CUSTOMERS"]
["Customers from this sheet",{"$f":"C7+F16+G36+H40+C50+C52+H27","v":1978944}]
[]
["Rev. Run customers",{"$f":"'12MEDEC18'!O33","v":1978984}]
["less:"]
["Sch 111",{"$f":"-F14","v":0}]
["Sch 121/122",0]
["Sch 131 normalize",0]
["Stimson switching--reduce Sch 146",0]
["Sch 146 normalize",{"$f":"'12MEDEC18'!O30-'Bill Determ'!H40","v":6}]
["Sch 147 customers not billed",{"$f":"'12MEDEC18'!O31","v":34}]
["Sch 148 normalize",0]
[null,{"$f":"B85-SUM(B86:B93)","v":1978944}]
["Diff",{"$f":"B83-B94","v":0}]
[]
["from Present Rev tab",{"$f":"SUM('Pres & Prop Rev'!D25:J26)","v":1978935}]
["Diff",{"$f":"B94-B97","v":9}]

{"sheet":"Block Usage","index":9,"n_rows":66,"n_cols":16,"rows_kept":66,"cut":false,"hidden":false,"merged":[]}
["WASHINGTON NATURAL GAS SYSTEM"]
[null,null,"January","February","March","April","May","June","July","August","September","October","November","December","Annual Total"]
["Rate Design Program Monthly Results"]
[null,"Schedule 101/102"]
[null,"Block 1",{"$f":"'12MEDEC18'!D54+'12MEDEC18'!D67","v":10524232.489080001},{"$f":"'12MEDEC18'!E54+'12MEDEC18'!E67","v":10061691.79439},{"$f":"'12MEDEC18'!F54+'12MEDEC18'!F67","v":10255778.751489999},{"$f":"'12MEDEC18'!G54+'12MEDEC18'!G67","v":9188098.1626500003},{"$f":"'12MEDEC18'!H54+'12MEDEC18'!H67","v":5512458.6299000001},{"$f":"'12MEDEC18'!I54+'12MEDEC18'!I67","v":2696906.7928200001},{"$f":"'12MEDEC18'!J54+'12MEDEC18'!J67","v":2255273.3151000002},{"$f":"'12MEDEC18'!K54+'12MEDEC18'!K67","v":1950475.62555},{"$f":"'12MEDEC18'!L54+'12MEDEC18'!L67","v":2251412.6811800003},{"$f":"'12MEDEC18'!M54+'12MEDEC18'!M67","v":4822544.1305600004},{"$f":"'12MEDEC18'!N54+'12MEDEC18'!N67","v":8249954.4405199997},{"$f":"'12MEDEC18'!O54+'12MEDEC18'!O67","v":10362255.78516},{"$f":"SUM(C5:N5)","v":78131082.598400012}]
[null,"Block 2",{"$f":"'12MEDEC18'!D55+'12MEDEC18'!D68","v":13383248.916239999},{"$f":"'12MEDEC18'!E55+'12MEDEC18'!E68","v":7346777.0500400001},{"$f":"'12MEDEC18'!F55+'12MEDEC18'!F68","v":8516900.2042899989},{"$f":"'12MEDEC18'!G55+'12MEDEC18'!G68","v":3625933.13277},{"$f":"'12MEDEC18'!H55+'12MEDEC18'!H68","v":608786.27544999996},{"$f":"'12MEDEC18'!I55+'12MEDEC18'!I68","v":191811.35051000002},{"$f":"'12MEDEC18'!J55+'12MEDEC18'!J68","v":188458.89171},{"$f":"'12MEDEC18'!K55+'12MEDEC18'!K68","v":135332.40104999999},{"$f":"'12MEDEC18'!L55+'12MEDEC18'!L68","v":190755.15787000002},{"$f":"'12MEDEC18'!M55+'12MEDEC18'!M68","v":472854.81367},{"$f":"'12MEDEC18'!N55+'12MEDEC18'!N68","v":2592797.0348300003},{"$f":"'12MEDEC18'!O55+'12MEDEC18'!O68","v":8584533.2633800004},{"$f":"SUM(C6:N6)","v":45838188.491810001}]
["Therms","Total",{"$f":"SUM(C5:C6)","v":23907481.40532},17408468.84443,18772678.955779999,12814031.29542,6121244.9053499997,2888718.1433300003,2443732.2068100004,2085808.0266,2442167.8390500005,5295398.9442300005,10842751.47535,18946789.04854,123969271.09021002]
[null,"Billed Customers",{"$f":"'12MEDEC18'!C26","v":160611},{"$f":"'12MEDEC18'!D26","v":160378},{"$f":"'12MEDEC18'!E26","v":161228},{"$f":"'12MEDEC18'!F26","v":160935},{"$f":"'12MEDEC18'!G26","v":161371},{"$f":"'12MEDEC18'!H26","v":161247},{"$f":"'12MEDEC18'!I26","v":161588},{"$f":"'12MEDEC18'!J26","v":161900},{"$f":"'12MEDEC18'!K26","v":160395},{"$f":"'12MEDEC18'!L26","v":164606},{"$f":"'12MEDEC18'!M26","v":163386},{"$f":"'12MEDEC18'!N26","v":163850},{"$f":"SUM(C8:N8)","v":1941495}]
[null,"Block 1 Limit",{"$f":"C8*70","v":11242770},{"$f":"D8*70","v":11226460},11285960,11265450,11295970,11287290,11311160,11333000,11227650,11522420,11437020,11469500,{"$f":"SUM(C9:N9)","v":135904650}]
[null,"Revenue Run Total",{"$f":"'12MEDEC18'!D162","v":23907481.40532},{"$f":"'12MEDEC18'!E162","v":17408468.844430003},{"$f":"'12MEDEC18'!F162","v":18772678.955779996},{"$f":"'12MEDEC18'!G162","v":12814031.29542},{"$f":"'12MEDEC18'!H162","v":6121244.9053499997},{"$f":"'12MEDEC18'!I162","v":2888718.1433300003},{"$f":"'12MEDEC18'!J162","v":2443732.2068100004},{"$f":"'12MEDEC18'!K162","v":2085808.0266},{"$f":"'12MEDEC18'!L162","v":2442167.8390500001},{"$f":"'12MEDEC18'!M162","v":5295338.9442299996},{"$f":"'12MEDEC18'!N162","v":10842675.47535},{"$f":"'12MEDEC18'!O162","v":18945996.04854},{"$f":"SUM(C10:N10)","v":123968342.09021002}]
[null,"Difference",{"$f":"C10-C7","v":0},0,0,0,0,0,0,0,0,-60.000000000931323,-76,-793,{"$f":"SUM(C11:N11)","v":-929.00000000093132},{"$f":"O11/O10","v":-7.4938487063488442E-6}]
[]
[null,"Block 1",{"$f":"(C5/C$7)*C$11","v":0},{"$f":"(D5/D$7)*D$11","v":0},0,0,0,0,0,0,0,-54.642275470741872,-57.826331158187941,-433.70245040359941,{"$f":"SUM(C13:N13)","v":-546.17105703252923}]
[null,"Block 2",{"$f":"(C6/C$7)*C$11","v":0},{"$f":"(D6/D$7)*D$11","v":0},0,0,0,0,0,0,0,-5.3577245301894481,-18.173668841812059,-359.29754959640059,{"$f":"SUM(C14:N14)","v":-382.82894296840209}]
[null,null,{"$f":"SUM(C13:C14)","v":0},0,0,0,0,0,0,0,0,-60.000000000931323,-76,-793,-929.00000000093132]
[]
[null,"Block 1",{"$f":"C5+C13","v":10524232.489080001},10061691.79439,10255778.751489999,9188098.1626500003,5512458.6299000001,2696906.7928200001,2255273.3151000002,1950475.62555,2251412.6811800003,4822489.4882845301,8249896.6141888415,10361822.082709596,{"$f":"SUM(C17:N17)","v":78130536.427342966}]
[null,"Block 2",{"$f":"C6+C14","v":13383248.916239999},7346777.0500400001,8516900.2042899989,3625933.13277,608786.27544999996,191811.35051000002,188458.89171,135332.40104999999,190755.15787000002,472849.45594546979,2592778.8611611584,8584173.9658304043,{"$f":"SUM(C18:N18)","v":45837805.662867025}]
[null,null,{"$f":"SUM(C17:C18)","v":23907481.40532},17408468.84443,18772678.955779999,12814031.29542,6121244.9053499997,2888718.1433300003,2443732.2068100004,2085808.0266,2442167.8390500005,5295338.9442299996,10842675.47535,18945996.04854,123968342.09020999]
[null,null,{"$f":"C19-C10","v":0},0,0,0,0,0,0,0,0,0,0,0,0]
[]
[null,"Schedule 111/112"]
[null,"Block 1",{"$f":"'12MEDEC18'!D78","v":589934.13208000001},{"$f":"'12MEDEC18'!E78","v":590810.42694000003},{"$f":"'12MEDEC18'!F78","v":603524.18038000003},{"$f":"'12MEDEC18'!G78","v":598823.42938999995},{"$f":"'12MEDEC18'!H78","v":554355.24927999999},{"$f":"'12MEDEC18'!I78","v":457385.41934000002},{"$f":"'12MEDEC18'!J78","v":406432.06326999998},{"$f":"'12MEDEC18'!K78","v":369191.69267000002},{"$f":"'12MEDEC18'!L78","v":401055.14079999999},{"$f":"'12MEDEC18'!M78","v":544518.68382000003},{"$f":"'12MEDEC18'!N78","v":589843.81619000004},{"$f":"'12MEDEC18'!O78","v":651631.33661999996},{"$f":"SUM(C23:N23)","v":6357505.5707799997}]
[null,"Block 2",{"$f":"'12MEDEC18'!D79","v":2084775.2813500001},{"$f":"'12MEDEC18'!E79","v":1987647.6339},{"$f":"'12MEDEC18'!F79","v":2037283.4333800001},{"$f":"'12MEDEC18'!G79","v":1803319.13485},{"$f":"'12MEDEC18'!H79","v":1207255.9927099999},{"$f":"'12MEDEC18'!I79","v":735033.10869000002},{"$f":"'12MEDEC18'!J79","v":625181.92593999999},{"$f":"'12MEDEC18'!K79","v":560486.23004000005},{"$f":"'12MEDEC18'!L79","v":636511.38428},{"$f":"'12MEDEC18'!M79","v":1024196.78307},{"$f":"'12MEDEC18'!N79","v":1602247.2423700001},{"$f":"'12MEDEC18'!O79","v":2217997.9376099999},{"$f":"SUM(C24:N24)","v":16521936.088190001}]
[null,"Block 3",{"$f":"'12MEDEC18'!D80","v":5325802.2349800002},{"$f":"'12MEDEC18'!E80","v":3964960.8490300002},{"$f":"'12MEDEC18'!F80","v":4143033.33005},{"$f":"'12MEDEC18'!G80","v":2753191.9021299998},{"$f":"'12MEDEC18'!H80","v":1378027.18099},{"$f":"'12MEDEC18'!I80","v":698319.80547000002},{"$f":"'12MEDEC18'!J80","v":544971.01361999998},{"$f":"'12MEDEC18'!K80","v":516705.80326000002},{"$f":"'12MEDEC18'!L80","v":569053.90060000005},{"$f":"'12MEDEC18'!M80","v":985638.28654999996},{"$f":"'12MEDEC18'!N80","v":2122581.5898899999},{"$f":"'12MEDEC18'!O80","v":6624153.7486400008},{"$f":"SUM(C25:N25)","v":29626439.645210002}]
["Therms","Total",{"$f":"SUM(C23:C25)","v":8000511.6484099999},{"$f":"SUM(D23:D25)","v":6543418.9098700006},6783840.9438100001,5155334.4663699996,3139638.4229800003,1890738.3335000002,{"$f":"SUM(I23:I25)","v":1576585.0028300001},{"$f":"SUM(J23:J25)","v":1446383.72597},1606620.4256800001,2554353.7534400001,4314672.6484500002,9493783.0228700005,52505881.304179996]
[null,"Revenue Run Total",{"$f":"'12MEDEC18'!D163","v":8018208.2324099997},{"$f":"'12MEDEC18'!E163","v":6561360.7318700003},{"$f":"'12MEDEC18'!F163","v":6797194.94881},{"$f":"'12MEDEC18'!G163","v":5166624.3463699995},{"$f":"'12MEDEC18'!H163","v":3145531.1909800004},{"$f":"'12MEDEC18'!I163","v":1896315.6935000003},{"$f":"'12MEDEC18'!J163","v":1581289.0838300001},{"$f":"'12MEDEC18'!K163","v":1451036.2879699999},{"$f":"'12MEDEC18'!L163","v":1613677.3076800001},{"$f":"'12MEDEC18'!M163","v":2564277.13344},{"$f":"'12MEDEC18'!N163","v":4331827.7364500007},{"$f":"'12MEDEC18'!O163","v":9510569.9868700001},{"$f":"SUM(C27:N27)","v":52637912.680180006}]
[null,null,{"$f":"C27-C26","v":17696.583999999799},17941.821999999695,13354.004999999888,11289.879999999888,5892.7680000001565,5577.3600000001024,4704.0810000000056,4652.561999999918,7056.8819999999832,9923.3799999998882,17155.088000000454,16786.963999999687,{"$f":"SUM(C28:N28)","v":132031.37599999947},{"$f":"O28/O27","v":2.5082942935484949E-3}]
[]
[null,"Block 1",{"$f":"(C23/C$26)*C$28","v":1304.893909490836},{"$f":"(D23/D$26)*D$28","v":1619.9811844404599},1188.0386036717612,1311.3881753169442,1040.4659497346529,1349.2100399149119,1212.6776185155443,1187.5736771582824,1761.585225036026,2115.3944747741748,2345.2121162959193,1152.2184320792228,{"$f":"SUM(C30:N30)","v":17588.639406428738}]
[null,"Block 2",{"$f":"(C24/C$26)*C$28","v":4611.3801852742245},{"$f":"(D24/D$26)*D$28","v":5450.0591414623132},4010.396673671693,3949.1630983344485,2265.8913298995599,2168.2240141048756,1865.3649591229027,1802.9081001022021,2795.797724667581,3978.8904960770133,6370.5163010430724,3921.877237033887,{"$f":"SUM(C31:N31)","v":43190.469260793769}]
[null,"Block 3",{"$f":"(C25/C$26)*C$28","v":11780.309905234739},{"$f":"(D25/D$26)*D$28","v":10871.781674096921},8155.5697226564344,6029.3287263484972,2586.4107203659432,2059.9259459803143,1626.0384223615581,1662.0802227394338,2499.4990502963765,3829.0950291487002,8439.3595826614637,11712.868330886577,{"$f":"SUM(C32:N32)","v":71252.267332776959}]
[null,null,{"$f":"SUM(C30:C32)","v":17696.583999999799},{"$f":"SUM(D30:D32)","v":17941.821999999695},13354.004999999888,11289.87999999989,5892.7680000001565,5577.3600000001015,4704.0810000000056,4652.561999999918,7056.8819999999832,9923.3799999998882,17155.088000000454,16786.963999999687,{"$f":"SUM(O30:O32)","v":132031.37599999947}]
[]
[null,"Block 1",{"$f":"C23+C30","v":591239.02598949079},{"$f":"D23+D30","v":592430.40812444047},604712.21898367174,600134.81756531692,555395.71522973466,458734.62937991496,407644.74088851555,370379.26634715829,402816.72602503601,546634.07829477417,592189.02830629598,652783.55505207914,{"$f":"SUM(C35:N35)","v":6375094.2101864293}]
[null,"Block 2",{"$f":"C24+C31","v":2089386.6615352742},1993097.6930414622,2041293.8300536717,1807268.2979483344,1209521.8840398996,737201.33270410495,627047.29089912283,562289.13814010227,639307.18200466759,1028175.673566077,1608617.7586710432,2221919.8148470339,{"$f":"SUM(C36:N36)","v":16565126.557450794}]
[null,"Block 3",5337582.5448852349,3975832.630704097,4151188.8997726566,2759221.2308563483,1380613.5917103661,700379.73141598038,546597.05204236158,518367.88348273945,571553.39965029643,989467.3815791487,2131020.9494726616,6635866.6169708874,{"$f":"SUM(C37:N37)","v":29697691.912542783}]
[null,null,{"$f":"SUM(C35:C37)","v":8018208.2324099997},6561360.7318699993,6797194.94881,5166624.3463699995,3145531.1909800004,1896315.6935000005,1581289.0838299999,1451036.2879699999,1613677.3076800001,2564277.13344,4331827.7364500007,9510569.9868700001,52637912.680180006]
[null,null,{"$f":"C38-C27","v":0},0,0,0,0,0,0,0,0,0,0,0,0]
[]
[]
[]
[null,"Schedule 121/122"]
[null,"Block 1",{"$f":"'12MEDEC18'!D102+'12MEDEC18'!D116","v":11500},{"$f":"'12MEDEC18'!E102+'12MEDEC18'!E116","v":11500},{"$f":"'12MEDEC18'!F102+'12MEDEC18'!F116","v":11500},{"$f":"'12MEDEC18'!G102+'12MEDEC18'!G116","v":11500},{"$f":"'12MEDEC18'!H102+'12MEDEC18'!H116","v":11500},{"$f":"'12MEDEC18'!I102+'12MEDEC18'!I116","v":11500},{"$f":"'12MEDEC18'!J102+'12MEDEC18'!J116","v":11550},{"$f":"'12MEDEC18'!K102+'12MEDEC18'!K116","v":12000},{"$f":"'12MEDEC18'!L102+'12MEDEC18'!L116","v":10000},{"$f":"'12MEDEC18'!M102+'12MEDEC18'!M116","v":12500},{"$f":"'12MEDEC18'!N102+'12MEDEC18'!N116","v":11500},{"$f":"'12MEDEC18'!O102+'12MEDEC18'!O116","v":-104050.10833000002},{"$f":"SUM(C44:N44)","v":22499.891669999983}]
[null,"Block 2",{"$f":"'12MEDEC18'!D103+'12MEDEC18'!D117","v":11500},{"$f":"'12MEDEC18'!E103+'12MEDEC18'!E117","v":11500},{"$f":"'12MEDEC18'!F103+'12MEDEC18'!F117","v":11500},{"$f":"'12MEDEC18'!G103+'12MEDEC18'!G117","v":11500},{"$f":"'12MEDEC18'!H103+'12MEDEC18'!H117","v":11379.079},{"$f":"'12MEDEC18'!I103+'12MEDEC18'!I117","v":11215.103999999999},{"$f":"'12MEDEC18'!J103+'12MEDEC18'!J117","v":11266.876},{"$f":"'12MEDEC18'!K103+'12MEDEC18'!K117","v":11644.273999999999},{"$f":"'12MEDEC18'!L103+'12MEDEC18'!L117","v":10000},{"$f":"'12MEDEC18'!M103+'12MEDEC18'!M117","v":12341.027},{"$f":"'12MEDEC18'!N103+'12MEDEC18'!N117","v":11500},{"$f":"'12MEDEC18'!O103+'12MEDEC18'!O117","v":-102846.69334},{"$f":"SUM(C45:N45)","v":22499.666660000003}]
[null,"Block 3",{"$f":"'12MEDEC18'!D104+'12MEDEC18'!D118","v":203386.443},{"$f":"'12MEDEC18'!E104+'12MEDEC18'!E118","v":198441.93900000001},{"$f":"'12MEDEC18'!F104+'12MEDEC18'!F118","v":203480.45800000001},{"$f":"'12MEDEC18'!G104+'12MEDEC18'!G118","v":191875.011},{"$f":"'12MEDEC18'!H104+'12MEDEC18'!H118","v":185869.25200000001},{"$f":"'12MEDEC18'!I104+'12MEDEC18'!I118","v":175428.223},{"$f":"'12MEDEC18'!J104+'12MEDEC18'!J118","v":169184.98431999999},{"$f":"'12MEDEC18'!K104+'12MEDEC18'!K118","v":170892.52499999999},{"$f":"'12MEDEC18'!L104+'12MEDEC18'!L118","v":160240.04500000001},{"$f":"'12MEDEC18'!M104+'12MEDEC18'!M118","v":192242.52900000001},{"$f":"'12MEDEC18'!N104+'12MEDEC18'!N118","v":196830.56899999999},{"$f":"'12MEDEC18'!O104+'12MEDEC18'!O118","v":-1648907.7280000001},398964.25031999964]
[null,"Block 4",{"$f":"'12MEDEC18'!D105+'12MEDEC18'!D119","v":184426.15900000001},{"$f":"'12MEDEC18'!E105+'12MEDEC18'!E119","v":141925.30599999998},{"$f":"'12MEDEC18'!F105+'12MEDEC18'!F119","v":156602.019},{"$f":"'12MEDEC18'!G105+'12MEDEC18'!G119","v":113584.651},{"$f":"'12MEDEC18'!H105+'12MEDEC18'!H119","v":102398.334},{"$f":"'12MEDEC18'!I105+'12MEDEC18'!I119","v":77470.241999999998},{"$f":"'12MEDEC18'!J105+'12MEDEC18'!J119","v":69069.925409999996},{"$f":"'12MEDEC18'!K105+'12MEDEC18'!K119","v":76228.346999999994},{"$f":"'12MEDEC18'!L105+'12MEDEC18'!L119","v":76173.198999999993},{"$f":"'12MEDEC18'!M105+'12MEDEC18'!M119","v":87527.107000000004},{"$f":"'12MEDEC18'!N105+'12MEDEC18'!N119","v":113532.716},{"$f":"'12MEDEC18'!O105+'12MEDEC18'!O119","v":-619986.62933999998},{"$f":"SUM(C47:N47)","v":578951.37607}]
[null,"Block 5",{"$f":"'12MEDEC18'!D106+'12MEDEC18'!D120","v":136757.997},{"$f":"'12MEDEC18'!E106+'12MEDEC18'!E120","v":91812.78},{"$f":"'12MEDEC18'!F106+'12MEDEC18'!F120","v":91235.56},{"$f":"'12MEDEC18'!G106+'12MEDEC18'!G120","v":69503.763999999996},{"$f":"'12MEDEC18'!H106+'12MEDEC18'!H120","v":21110.359},{"$f":"'12MEDEC18'!I106+'12MEDEC18'!I120","v":27709.368000000002},{"$f":"'12MEDEC18'!J106+'12MEDEC18'!J120","v":19810.513999999999},{"$f":"'12MEDEC18'!K106+'12MEDEC18'!K120","v":22671.181},{"$f":"'12MEDEC18'!L106+'12MEDEC18'!L120","v":35739.872000000003},{"$f":"'12MEDEC18'!M106+'12MEDEC18'!M120","v":38109.998},{"$f":"'12MEDEC18'!N106+'12MEDEC18'!N120","v":78881.856},{"$f":"'12MEDEC18'!O106+'12MEDEC18'!O120","v":112061.86700003814},{"$f":"SUM(C48:N48)","v":745405.11600003822}]
["Therms","Total",{"$f":"SUM(C44:C48)","v":547570.59900000005},{"$f":"SUM(D44:D48)","v":455180.02500000002},474318.03700000001,397963.42599999998,332257.02400000003,303322.93700000003,{"$f":"SUM(I44:I48)","v":280882.29972999997},{"$f":"SUM(J44:J48)","v":293436.32699999999},292153.11600000004,342720.66100000002,412245.14099999995,-2363729.2920099618,1768320.3007200379]
[null,"Revenue Run Total",{"$f":"'12MEDEC18'!D164","v":547570.59900000005},{"$f":"'12MEDEC18'!E164","v":455180.02499999997},{"$f":"'12MEDEC18'!F164","v":474318.03700000001},{"$f":"'12MEDEC18'!G164","v":397963.42600000004},{"$f":"'12MEDEC18'!H164","v":332257.02400000003},{"$f":"'12MEDEC18'!I164","v":303322.93700000003},{"$f":"'12MEDEC18'!J164","v":280882.29972999997},{"$f":"'12MEDEC18'!K164","v":293436.32699999999},{"$f":"'12MEDEC18'!L164","v":292153.11600000004},{"$f":"'12MEDEC18'!M164","v":342720.66100000002},{"$f":"'12MEDEC18'!N164","v":412245.14099999995},{"$f":"'12MEDEC18'!O164","v":-2363729.2920099623},{"$f":"SUM(C50:N50)","v":1768320.3007200374}]
[null,null,{"$f":"C50-C49","v":0},0,0,0,0,0,0,0,0,0,0,0,{"$f":"SUM(C51:N51)","v":0},{"$f":"O51/O50","v":0}]
[]
[null,"Block 1",{"$f":"(C44/C$49)*C$51","v":0},{"$f":"(D44/D$49)*D$51","v":0},0,0,0,0,0,0,0,0,0,0,{"$f":"SUM(C53:N53)","v":0}]
[null,"Block 2",{"$f":"(C45/C$49)*C$51","v":0},0,0,0,0,0,0,0,0,0,0,0,{"$f":"SUM(C54:N54)","v":0}]
[null,"Block 3",{"$f":"(C46/C$49)*C$51","v":0},0,0,0,0,0,0,0,0,0,0,0,0]
[null,"Block 4",0,0,0,0,0,0,0,0,0,0,0,0,{"$f":"SUM(C56:N56)","v":0}]
[null,"Block 5",0,0,0,0,0,0,0,0,0,0,0,0,{"$f":"SUM(C57:N57)","v":0}]
[null,null,{"$f":"SUM(C53:C57)","v":0},{"$f":"SUM(D53:D57)","v":0},0,0,0,0,0,0,0,0,0,0,{"$f":"SUM(O53:O57)","v":0}]
[]
[null,"Block 1",{"$f":"C44+C53","v":11500},{"$f":"D44+D53","v":11500},11500,11500,11500,11500,11550,12000,10000,12500,11500,-104050.10833000002,{"$f":"SUM(C60:N60)","v":22499.891669999983}]
[null,"Block 2",{"$f":"C45+C54","v":11500},11500,11500,11500,11379.079,11215.103999999999,11266.876,11644.273999999999,10000,12341.027,11500,-102846.69334,{"$f":"SUM(C61:N61)","v":22499.666660000003}]
[null,"Block 3",{"$f":"C46+C55","v":203386.443},198441.93900000001,203480.45800000001,191875.011,185869.25200000001,175428.223,169184.98431999999,170892.52499999999,160240.04500000001,192242.52900000001,196830.56899999999,-1648907.7280000001,398964.25031999964]
[null,"Block 4",{"$f":"C47+C56","v":184426.15900000001},141925.30599999998,156602.019,113584.651,102398.334,77470.241999999998,69069.925409999996,76228.346999999994,76173.198999999993,87527.107000000004,113532.716,-619986.62933999998,{"$f":"SUM(C63:N63)","v":578951.37607}]
[null,"Block 5",{"$f":"C48+C57","v":136757.997},91812.78,91235.56,69503.763999999996,21110.359,27709.368000000002,19810.513999999999,22671.181,35739.872000000003,38109.998,78881.856,112061.86700003814,{"$f":"SUM(C64:N64)","v":745405.11600003822}]
[null,null,{"$f":"SUM(C60:C64)","v":547570.59900000005},455180.02500000002,474318.03700000001,397963.42599999998,332257.02400000003,303322.93700000003,280882.29972999997,293436.32699999999,292153.11600000004,342720.66100000002,412245.14099999995,-2363729.2920099618,1768320.3007200379]
[null,null,{"$f":"C65-C50","v":0},0,0,0,0,0,0,0,0,0,0,0,0]

{"sheet":"Big Schedules","index":10,"n_rows":138,"n_cols":46,"rows_kept":138,"cut":false,"hidden":false,"merged":[]}
[null,"Washington Gas Billing Determinants by Customer"]
[null,null,null,null,null,null,null,null,null,null,null,null,null,null,null,null,"1st",{"$f":"Q3","v":20000},{"$f":"R3","v":50000},{"$f":"S3","v":300000},{"$f":"T3","v":500000},null,"Present","Proposed"]
[null,"ANNUAL USAGE, Sch 146",null,null,null,null,null,null,null,null,null,null,null,null,"12-mo ended",null,20000,50000,300000,500000,99999999,null,"Annual","Annual","Present Base","Proposed Base"]
[null,"Washington","2018-01-01","2018-02-01","2018-03-01","2018-04-01","2018-05-01","2018-06-01","2018-07-01","2018-08-01","2018-09-01","2018-10-01","2018-11-01","2018-12-01","Total",null,"thms/mo","thms/mo","thms/mo","thms/mo","thms/mo",null,"Minimum","Minimum","Revenue","Revenue"]
[1,null,415785,355464,355300,281721,204574,43693,30183,15503,18744,47441,187342,322385,{"$f":"SUM(C5:N5)","v":2278135},null,{"$f":"Q$3*12-SUMPRODUCT(--($C5:$N5<=Q$3),Q$3-$C5:$N5)","v":234247},{"$f":"R$3*12-SUM($Q5:Q5)-SUMPRODUCT(--($C5:$N5<=R$3),R$3-$C5:$N5)","v":271317},{"$f":"S$3*12-SUM($Q5:R5)-SUMPRODUCT(--($C5:$N5<=S$3),S$3-$C5:$N5)","v":1523637},{"$f":"T$3*12-SUM($Q5:S5)-SUMPRODUCT(--($C5:$N5<=T$3),T$3-$C5:$N5)","v":248934},{"$f":"U$3*12-SUM($Q5:T5)-SUMPRODUCT(--($C5:$N5<=U$3),U$3-$C5:$N5)","v":0},null,{"$f":"IF(O5<250000,(250000-O5)*RD!$E$56,0)","v":0},{"$f":"IF(O5<250000,(250000-O5)*RD!$J$56,0)","v":0},{"$f":"Q5*RD!$D$51+'Big Schedules'!R5*RD!$D$52+'Big Schedules'!S5*RD!$D$53+'Big Schedules'!T5*RD!$D$54+'Big Schedules'!U5*RD!$D$55+RD!$D$49*12+W5","v":189032.17851},{"$f":"Q5*RD!$J$51+'Big Schedules'!R5*RD!$J$52+'Big Schedules'!S5*RD!$J$53+'Big Schedules'!T5*RD!$J$54+'Big Schedules'!U5*RD!$J$55+RD!$J$49*12+X5","v":205066.54623000001},{"$f":"Z5/Y5-1","v":8.4823482681028128E-2}]
[2,null,20735,20923,19103,20016,20036,19746,18315,18397,20766,18408,22562,20603,{"$f":"SUM(C6:N6)","v":239610},null,233969,{"$f":"R$3*12-SUM($Q6:Q6)-SUMPRODUCT(--($C6:$N6<=R$3),R$3-$C6:$N6)","v":5641},{"$f":"S$3*12-SUM($Q6:R6)-SUMPRODUCT(--($C6:$N6<=S$3),S$3-$C6:$N6)","v":0},{"$f":"T$3*12-SUM($Q6:S6)-SUMPRODUCT(--($C6:$N6<=T$3),T$3-$C6:$N6)","v":0},{"$f":"U$3*12-SUM($Q6:T6)-SUMPRODUCT(--($C6:$N6<=U$3),U$3-$C6:$N6)","v":0},null,{"$f":"IF(O6<250000,(250000-O6)*RD!$E$56,0)","v":925.22950000000003},{"$f":"IF(O6<250000,(250000-O6)*RD!$J$56,0)","v":970.0104},{"$f":"Q6*RD!$D$51+'Big Schedules'!R6*RD!$D$52+'Big Schedules'!S6*RD!$D$53+'Big Schedules'!T6*RD!$D$54+'Big Schedules'!U6*RD!$D$55+RD!$D$49*12+W6","v":30683.136210000001},{"$f":"Q6*RD!$J$51+'Big Schedules'!R6*RD!$J$52+'Big Schedules'!S6*RD!$J$53+'Big Schedules'!T6*RD!$J$54+'Big Schedules'!U6*RD!$J$55+RD!$J$49*12+X6","v":33549.361019999997},{"$f":"Z6/Y6-1","v":9.3413684650197393E-2}]
[3,null,54601,38234,38819,43480,42408,38631,35552,39785,39786,42220,39343,50945,503804,null,240000,{"$f":"R$3*12-SUM($Q7:Q7)-SUMPRODUCT(--($C7:$N7<=R$3),R$3-$C7:$N7)","v":258258},{"$f":"S$3*12-SUM($Q7:R7)-SUMPRODUCT(--($C7:$N7<=S$3),S$3-$C7:$N7)","v":5546},{"$f":"T$3*12-SUM($Q7:S7)-SUMPRODUCT(--($C7:$N7<=T$3),T$3-$C7:$N7)","v":0},{"$f":"U$3*12-SUM($Q7:T7)-SUMPRODUCT(--($C7:$N7<=U$3),U$3-$C7:$N7)","v":0},null,{"$f":"IF(O7<250000,(250000-O7)*RD!$E$56,0)","v":0},{"$f":"IF(O7<250000,(250000-O7)*RD!$J$56,0)","v":0},{"$f":"Q7*RD!$D$51+'Big Schedules'!R7*RD!$D$52+'Big Schedules'!S7*RD!$D$53+'Big Schedules'!T7*RD!$D$54+'Big Schedules'!U7*RD!$D$55+RD!$D$49*12+W7","v":52551.568220000001},{"$f":"Q7*RD!$J$51+'Big Schedules'!R7*RD!$J$52+'Big Schedules'!S7*RD!$J$53+'Big Schedules'!T7*RD!$J$54+'Big Schedules'!U7*RD!$J$55+RD!$J$49*12+X7","v":57263.484619999996},8.966271720520691E-2]
[4,null,81743,80049,295451,72830,70934,58560,57728,12876,1,57429,46472,52903,886976,null,212877,{"$f":"R$3*12-SUM($Q8:Q8)-SUMPRODUCT(--($C8:$N8<=R$3),R$3-$C8:$N8)","v":296472},{"$f":"S$3*12-SUM($Q8:R8)-SUMPRODUCT(--($C8:$N8<=S$3),S$3-$C8:$N8)","v":377627},{"$f":"T$3*12-SUM($Q8:S8)-SUMPRODUCT(--($C8:$N8<=T$3),T$3-$C8:$N8)","v":0},{"$f":"U$3*12-SUM($Q8:T8)-SUMPRODUCT(--($C8:$N8<=U$3),U$3-$C8:$N8)","v":0},null,{"$f":"IF(O8<250000,(250000-O8)*RD!$E$56,0)","v":0},{"$f":"IF(O8<250000,(250000-O8)*RD!$J$56,0)","v":0},{"$f":"Q8*RD!$D$51+'Big Schedules'!R8*RD!$D$52+'Big Schedules'!S8*RD!$D$53+'Big Schedules'!T8*RD!$D$54+'Big Schedules'!U8*RD!$D$55+RD!$D$49*12+W8","v":82143.3554},{"$f":"Q8*RD!$J$51+'Big Schedules'!R8*RD!$J$52+'Big Schedules'!S8*RD!$J$53+'Big Schedules'!T8*RD!$J$54+'Big Schedules'!U8*RD!$J$55+RD!$J$49*12+X8","v":89310.355429999996},8.7249905912657688E-2]
[5,null,187858,315909,74565,295108,254949,209473,195550,173782,174513,178584,227343,248944,2536578,null,240000,{"$f":"R$3*12-SUM($Q9:Q9)-SUMPRODUCT(--($C9:$N9<=R$3),R$3-$C9:$N9)","v":360000},{"$f":"S$3*12-SUM($Q9:R9)-SUMPRODUCT(--($C9:$N9<=S$3),S$3-$C9:$N9)","v":1920669},{"$f":"T$3*12-SUM($Q9:S9)-SUMPRODUCT(--($C9:$N9<=T$3),T$3-$C9:$N9)","v":15909},{"$f":"U$3*12-SUM($Q9:T9)-SUMPRODUCT(--($C9:$N9<=U$3),U$3-$C9:$N9)","v":0},null,{"$f":"IF(O9<250000,(250000-O9)*RD!$E$56,0)","v":0},{"$f":"IF(O9<250000,(250000-O9)*RD!$J$56,0)","v":0},{"$f":"Q9*RD!$D$51+'Big Schedules'!R9*RD!$D$52+'Big Schedules'!S9*RD!$D$53+'Big Schedules'!T9*RD!$D$54+'Big Schedules'!U9*RD!$D$55+RD!$D$49*12+W9","v":211348.10607000001},{"$f":"Q9*RD!$J$51+'Big Schedules'!R9*RD!$J$52+'Big Schedules'!S9*RD!$J$53+'Big Schedules'!T9*RD!$J$54+'Big Schedules'!U9*RD!$J$55+RD!$J$49*12+X9","v":229234.83875999998},8.463162042282879E-2]
[6,null,25890,29852,30418,27395,34025,33509,33213,20214,26937,29499,35889,29919,356760,null,240000,{"$f":"R$3*12-SUM($Q10:Q10)-SUMPRODUCT(--($C10:$N10<=R$3),R$3-$C10:$N10)","v":116760},{"$f":"S$3*12-SUM($Q10:R10)-SUMPRODUCT(--($C10:$N10<=S$3),S$3-$C10:$N10)","v":0},{"$f":"T$3*12-SUM($Q10:S10)-SUMPRODUCT(--($C10:$N10<=T$3),T$3-$C10:$N10)","v":0},{"$f":"U$3*12-SUM($Q10:T10)-SUMPRODUCT(--($C10:$N10<=U$3),U$3-$C10:$N10)","v":0},null,{"$f":"IF(O10<250000,(250000-O10)*RD!$E$56,0)","v":0},{"$f":"IF(O10<250000,(250000-O10)*RD!$J$56,0)","v":0},{"$f":"Q10*RD!$D$51+'Big Schedules'!R10*RD!$D$52+'Big Schedules'!S10*RD!$D$53+'Big Schedules'!T10*RD!$D$54+'Big Schedules'!U10*RD!$D$55+RD!$D$49*12+W10","v":39921.8796},{"$f":"Q10*RD!$J$51+'Big Schedules'!R10*RD!$J$52+'Big Schedules'!S10*RD!$J$53+'Big Schedules'!T10*RD!$J$54+'Big Schedules'!U10*RD!$J$55+RD!$J$49*12+X10","v":43586.313599999994},9.1790117016434136E-2]
[7,null,74026,64095,62508,49499,34727,13478,11610,6509,4925,14482,34543,52756,423158,null,191004,{"$f":"R$3*12-SUM($Q11:Q11)-SUMPRODUCT(--($C11:$N11<=R$3),R$3-$C11:$N11)","v":178769},{"$f":"S$3*12-SUM($Q11:R11)-SUMPRODUCT(--($C11:$N11<=S$3),S$3-$C11:$N11)","v":53385},{"$f":"T$3*12-SUM($Q11:S11)-SUMPRODUCT(--($C11:$N11<=T$3),T$3-$C11:$N11)","v":0},{"$f":"U$3*12-SUM($Q11:T11)-SUMPRODUCT(--($C11:$N11<=U$3),U$3-$C11:$N11)","v":0},null,{"$f":"IF(O11<250000,(250000-O11)*RD!$E$56,0)","v":0},{"$f":"IF(O11<250000,(250000-O11)*RD!$J$56,0)","v":0},{"$f":"Q11*RD!$D$51+'Big Schedules'!R11*RD!$D$52+'Big Schedules'!S11*RD!$D$53+'Big Schedules'!T11*RD!$D$54+'Big Schedules'!U11*RD!$D$55+RD!$D$49*12+W11","v":44670.112990000009},{"$f":"Q11*RD!$J$51+'Big Schedules'!R11*RD!$J$52+'Big Schedules'!S11*RD!$J$53+'Big Schedules'!T11*RD!$J$54+'Big Schedules'!U11*RD!$J$55+RD!$J$49*12+X11","v":48728.316749999998},9.0848298523634075E-2]
[8,null,59623,52612,48793,38697,47195,10478,7975,3054,4538,9777,26679,40299,349720,null,175822,{"$f":"R$3*12-SUM($Q12:Q12)-SUMPRODUCT(--($C12:$N12<=R$3),R$3-$C12:$N12)","v":161663},{"$f":"S$3*12-SUM($Q12:R12)-SUMPRODUCT(--($C12:$N12<=S$3),S$3-$C12:$N12)","v":12235},{"$f":"T$3*12-SUM($Q12:S12)-SUMPRODUCT(--($C12:$N12<=T$3),T$3-$C12:$N12)","v":0},{"$f":"U$3*12-SUM($Q12:T12)-SUMPRODUCT(--($C12:$N12<=U$3),U$3-$C12:$N12)","v":0},null,{"$f":"IF(O12<250000,(250000-O12)*RD!$E$56,0)","v":0},{"$f":"IF(O12<250000,(250000-O12)*RD!$J$56,0)","v":0},{"$f":"Q12*RD!$D$51+'Big Schedules'!R12*RD!$D$52+'Big Schedules'!S12*RD!$D$53+'Big Schedules'!T12*RD!$D$54+'Big Schedules'!U12*RD!$D$55+RD!$D$49*12+W12","v":38525.267930000002},{"$f":"Q12*RD!$J$51+'Big Schedules'!R12*RD!$J$52+'Big Schedules'!S12*RD!$J$53+'Big Schedules'!T12*RD!$J$54+'Big Schedules'!U12*RD!$J$55+RD!$J$49*12+X12","v":42073.683010000001},9.210617526262066E-2]
[9,null,51551,46018,67808,56634,31853,7077,2848,2564,5446,14802,27901,38402,352904,null,172737,{"$f":"R$3*12-SUM($Q13:Q13)-SUMPRODUCT(--($C13:$N13<=R$3),R$3-$C13:$N13)","v":154174},{"$f":"S$3*12-SUM($Q13:R13)-SUMPRODUCT(--($C13:$N13<=S$3),S$3-$C13:$N13)","v":25993},{"$f":"T$3*12-SUM($Q13:S13)-SUMPRODUCT(--($C13:$N13<=T$3),T$3-$C13:$N13)","v":0},{"$f":"U$3*12-SUM($Q13:T13)-SUMPRODUCT(--($C13:$N13<=U$3),U$3-$C13:$N13)","v":0},null,{"$f":"IF(O13<250000,(250000-O13)*RD!$E$56,0)","v":0},{"$f":"IF(O13<250000,(250000-O13)*RD!$J$56,0)","v":0},{"$f":"Q13*RD!$D$51+'Big Schedules'!R13*RD!$D$52+'Big Schedules'!S13*RD!$D$53+'Big Schedules'!T13*RD!$D$54+'Big Schedules'!U13*RD!$D$55+RD!$D$49*12+W13","v":38650.251660000002},{"$f":"Q13*RD!$J$51+'Big Schedules'!R13*RD!$J$52+'Big Schedules'!S13*RD!$J$53+'Big Schedules'!T13*RD!$J$54+'Big Schedules'!U13*RD!$J$55+RD!$J$49*12+X13","v":42209.056089999998},9.207713474432766E-2]
[10,null,155038,122263,130738,115527,100866,86970,81265,79250,79026,83941,99424,121890,1256198,null,240000,{"$f":"R$3*12-SUM($Q14:Q14)-SUMPRODUCT(--($C14:$N14<=R$3),R$3-$C14:$N14)","v":360000},{"$f":"S$3*12-SUM($Q14:R14)-SUMPRODUCT(--($C14:$N14<=S$3),S$3-$C14:$N14)","v":656198},{"$f":"T$3*12-SUM($Q14:S14)-SUMPRODUCT(--($C14:$N14<=T$3),T$3-$C14:$N14)","v":0},{"$f":"U$3*12-SUM($Q14:T14)-SUMPRODUCT(--($C14:$N14<=U$3),U$3-$C14:$N14)","v":0},null,{"$f":"IF(O14<250000,(250000-O14)*RD!$E$56,0)","v":0},{"$f":"IF(O14<250000,(250000-O14)*RD!$J$56,0)","v":0},{"$f":"Q14*RD!$D$51+'Big Schedules'!R14*RD!$D$52+'Big Schedules'!S14*RD!$D$53+'Big Schedules'!T14*RD!$D$54+'Big Schedules'!U14*RD!$D$55+RD!$D$49*12+W14","v":111904.43252},{"$f":"Q14*RD!$J$51+'Big Schedules'!R14*RD!$J$52+'Big Schedules'!S14*RD!$J$53+'Big Schedules'!T14*RD!$J$54+'Big Schedules'!U14*RD!$J$55+RD!$J$49*12+X14","v":121540.50962},8.6109878608050749E-2]
[11,null,54040,45826,47017,43274,35110,18145,15826,11521,12756,19720,32408,45467,381110,null,217968,{"$f":"R$3*12-SUM($Q15:Q15)-SUMPRODUCT(--($C15:$N15<=R$3),R$3-$C15:$N15)","v":159102},{"$f":"S$3*12-SUM($Q15:R15)-SUMPRODUCT(--($C15:$N15<=S$3),S$3-$C15:$N15)","v":4040},{"$f":"T$3*12-SUM($Q15:S15)-SUMPRODUCT(--($C15:$N15<=T$3),T$3-$C15:$N15)","v":0},{"$f":"U$3*12-SUM($Q15:T15)-SUMPRODUCT(--($C15:$N15<=U$3),U$3-$C15:$N15)","v":0},null,{"$f":"IF(O15<250000,(250000-O15)*RD!$E$56,0)","v":0},{"$f":"IF(O15<250000,(250000-O15)*RD!$J$56,0)","v":0},{"$f":"Q15*RD!$D$51+'Big Schedules'!R15*RD!$D$52+'Big Schedules'!S15*RD!$D$53+'Big Schedules'!T15*RD!$D$54+'Big Schedules'!U15*RD!$D$55+RD!$D$49*12+W15","v":41751.352220000001},{"$f":"Q15*RD!$J$51+'Big Schedules'!R15*RD!$J$52+'Big Schedules'!S15*RD!$J$53+'Big Schedules'!T15*RD!$J$54+'Big Schedules'!U15*RD!$J$55+RD!$J$49*12+X15","v":45567.452239999999},9.1400632963738682E-2]
[12,null,367242,309912,304591,251712,198683,123392,111823,98040,106498,115130,178837,254657,2420517,null,240000,{"$f":"R$3*12-SUM($Q16:Q16)-SUMPRODUCT(--($C16:$N16<=R$3),R$3-$C16:$N16)","v":360000},{"$f":"S$3*12-SUM($Q16:R16)-SUMPRODUCT(--($C16:$N16<=S$3),S$3-$C16:$N16)","v":1738772},{"$f":"T$3*12-SUM($Q16:S16)-SUMPRODUCT(--($C16:$N16<=T$3),T$3-$C16:$N16)","v":81745},{"$f":"U$3*12-SUM($Q16:T16)-SUMPRODUCT(--($C16:$N16<=U$3),U$3-$C16:$N16)","v":0},null,{"$f":"IF(O16<250000,(250000-O16)*RD!$E$56,0)","v":0},{"$f":"IF(O16<250000,(250000-O16)*RD!$J$56,0)","v":0},{"$f":"Q16*RD!$D$51+'Big Schedules'!R16*RD!$D$52+'Big Schedules'!S16*RD!$D$53+'Big Schedules'!T16*RD!$D$54+'Big Schedules'!U16*RD!$D$55+RD!$D$49*12+W16","v":201940.38333000001},{"$f":"Q16*RD!$J$51+'Big Schedules'!R16*RD!$J$52+'Big Schedules'!S16*RD!$J$53+'Big Schedules'!T16*RD!$J$54+'Big Schedules'!U16*RD!$J$55+RD!$J$49*12+X16","v":219046.26293},8.470757219494085E-2]
[13,null,42207,42601,38142,41796,38846,34020,33750,34378,36391,32085,37404,35238,446858,null,240000,{"$f":"R$3*12-SUM($Q17:Q17)-SUMPRODUCT(--($C17:$N17<=R$3),R$3-$C17:$N17)","v":206858},{"$f":"S$3*12-SUM($Q17:R17)-SUMPRODUCT(--($C17:$N17<=S$3),S$3-$C17:$N17)","v":0},{"$f":"T$3*12-SUM($Q17:S17)-SUMPRODUCT(--($C17:$N17<=T$3),T$3-$C17:$N17)","v":0},{"$f":"U$3*12-SUM($Q17:T17)-SUMPRODUCT(--($C17:$N17<=U$3),U$3-$C17:$N17)","v":0},null,{"$f":"IF(O17<250000,(250000-O17)*RD!$E$56,0)","v":0},{"$f":"IF(O17<250000,(250000-O17)*RD!$J$56,0)","v":0},{"$f":"Q17*RD!$D$51+'Big Schedules'!R17*RD!$D$52+'Big Schedules'!S17*RD!$D$53+'Big Schedules'!T17*RD!$D$54+'Big Schedules'!U17*RD!$D$55+RD!$D$49*12+W17","v":47689.228180000006},{"$f":"Q17*RD!$J$51+'Big Schedules'!R17*RD!$J$52+'Big Schedules'!S17*RD!$J$53+'Big Schedules'!T17*RD!$J$54+'Big Schedules'!U17*RD!$J$55+RD!$J$49*12+X17","v":51997.862880000001},9.0348174303373607E-2]
[14,null,111973,97947,99930,78657,55276,14701,8600,5252,7147,23904,61739,89537,654663,null,195700,{"$f":"R$3*12-SUM($Q18:Q18)-SUMPRODUCT(--($C18:$N18<=R$3),R$3-$C18:$N18)","v":213904},{"$f":"S$3*12-SUM($Q18:R18)-SUMPRODUCT(--($C18:$N18<=S$3),S$3-$C18:$N18)","v":245059},{"$f":"T$3*12-SUM($Q18:S18)-SUMPRODUCT(--($C18:$N18<=T$3),T$3-$C18:$N18)","v":0},{"$f":"U$3*12-SUM($Q18:T18)-SUMPRODUCT(--($C18:$N18<=U$3),U$3-$C18:$N18)","v":0},null,{"$f":"IF(O18<250000,(250000-O18)*RD!$E$56,0)","v":0},{"$f":"IF(O18<250000,(250000-O18)*RD!$J$56,0)","v":0},{"$f":"Q18*RD!$D$51+'Big Schedules'!R18*RD!$D$52+'Big Schedules'!S18*RD!$D$53+'Big Schedules'!T18*RD!$D$54+'Big Schedules'!U18*RD!$D$55+RD!$D$49*12+W18","v":63054.880499999999},{"$f":"Q18*RD!$J$51+'Big Schedules'!R18*RD!$J$52+'Big Schedules'!S18*RD!$J$53+'Big Schedules'!T18*RD!$J$54+'Big Schedules'!U18*RD!$J$55+RD!$J$49*12+X18","v":68638.352650000001},8.8549404990149849E-2]
[15,null,807830,675163,661036,636142,652753,655801,617696,668344,676555,557678,705742,584651,7899391,null,240000,{"$f":"R$3*12-SUM($Q19:Q19)-SUMPRODUCT(--($C19:$N19<=R$3),R$3-$C19:$N19)","v":360000},{"$f":"S$3*12-SUM($Q19:R19)-SUMPRODUCT(--($C19:$N19<=S$3),S$3-$C19:$N19)","v":3000000},{"$f":"T$3*12-SUM($Q19:S19)-SUMPRODUCT(--($C19:$N19<=T$3),T$3-$C19:$N19)","v":2400000},{"$f":"U$3*12-SUM($Q19:T19)-SUMPRODUCT(--($C19:$N19<=U$3),U$3-$C19:$N19)","v":1899391},null,{"$f":"IF(O19<250000,(250000-O19)*RD!$E$56,0)","v":0},{"$f":"IF(O19<250000,(250000-O19)*RD!$J$56,0)","v":0},{"$f":"Q19*RD!$D$51+'Big Schedules'!R19*RD!$D$52+'Big Schedules'!S19*RD!$D$53+'Big Schedules'!T19*RD!$D$54+'Big Schedules'!U19*RD!$D$55+RD!$D$49*12+W19","v":569271.69572999992},{"$f":"Q19*RD!$J$51+'Big Schedules'!R19*RD!$J$52+'Big Schedules'!S19*RD!$J$53+'Big Schedules'!T19*RD!$J$54+'Big Schedules'!U19*RD!$J$55+RD!$J$49*12+X19","v":616838.56741000002},8.3557415618570552E-2]
[16,null,46254,41983,42213,37378,37182,36955,35584,33437,33335,31314,36615,42481,{"$f":"SUM(C20:N20)","v":454731},null,240000,{"$f":"R$3*12-SUM($Q20:Q20)-SUMPRODUCT(--($C20:$N20<=R$3),R$3-$C20:$N20)","v":214731},{"$f":"S$3*12-SUM($Q20:R20)-SUMPRODUCT(--($C20:$N20<=S$3),S$3-$C20:$N20)","v":0},{"$f":"T$3*12-SUM($Q20:S20)-SUMPRODUCT(--($C20:$N20<=T$3),T$3-$C20:$N20)","v":0},{"$f":"U$3*12-SUM($Q20:T20)-SUMPRODUCT(--($C20:$N20<=U$3),U$3-$C20:$N20)","v":0},null,{"$f":"IF(O20<250000,(250000-O20)*RD!$E$56,0)","v":0},{"$f":"IF(O20<250000,(250000-O20)*RD!$J$56,0)","v":0},{"$f":"Q20*RD!$D$51+'Big Schedules'!R20*RD!$D$52+'Big Schedules'!S20*RD!$D$53+'Big Schedules'!T20*RD!$D$54+'Big Schedules'!U20*RD!$D$55+RD!$D$49*12+W20","v":48367.959510000001},{"$f":"Q20*RD!$J$51+'Big Schedules'!R20*RD!$J$52+'Big Schedules'!S20*RD!$J$53+'Big Schedules'!T20*RD!$J$54+'Big Schedules'!U20*RD!$J$55+RD!$J$49*12+X20","v":52732.886159999995},{"$f":"Z20/Y20-1","v":9.0244175983846375E-2}]
[17,null,81649,70225,65964,61934,49857,43563,42033,39518,39386,42238,50682,63188,650237,null,240000,{"$f":"R$3*12-SUM($Q21:Q21)-SUMPRODUCT(--($C21:$N21<=R$3),R$3-$C21:$N21)","v":316595},{"$f":"S$3*12-SUM($Q21:R21)-SUMPRODUCT(--($C21:$N21<=S$3),S$3-$C21:$N21)","v":93642},{"$f":"T$3*12-SUM($Q21:S21)-SUMPRODUCT(--($C21:$N21<=T$3),T$3-$C21:$N21)","v":0},{"$f":"U$3*12-SUM($Q21:T21)-SUMPRODUCT(--($C21:$N21<=U$3),U$3-$C21:$N21)","v":0},null,{"$f":"IF(O21<250000,(250000-O21)*RD!$E$56,0)","v":0},{"$f":"IF(O21<250000,(250000-O21)*RD!$J$56,0)","v":0},{"$f":"Q21*RD!$D$51+'Big Schedules'!R21*RD!$D$52+'Big Schedules'!S21*RD!$D$53+'Big Schedules'!T21*RD!$D$54+'Big Schedules'!U21*RD!$D$55+RD!$D$49*12+W21","v":64429.384030000001},{"$f":"Q21*RD!$J$51+'Big Schedules'!R21*RD!$J$52+'Big Schedules'!S21*RD!$J$53+'Big Schedules'!T21*RD!$J$54+'Big Schedules'!U21*RD!$J$55+RD!$J$49*12+X21","v":70126.629179999989},8.8426193044887746E-2]
[18,null,65695,72429,69009,66905,58765,46676,45148,39851,44290,45166,61506,66593,682033,null,240000,{"$f":"R$3*12-SUM($Q22:Q22)-SUMPRODUCT(--($C22:$N22<=R$3),R$3-$C22:$N22)","v":331131},{"$f":"S$3*12-SUM($Q22:R22)-SUMPRODUCT(--($C22:$N22<=S$3),S$3-$C22:$N22)","v":110902},{"$f":"T$3*12-SUM($Q22:S22)-SUMPRODUCT(--($C22:$N22<=T$3),T$3-$C22:$N22)","v":0},{"$f":"U$3*12-SUM($Q22:T22)-SUMPRODUCT(--($C22:$N22<=U$3),U$3-$C22:$N22)","v":0},null,{"$f":"IF(O22<250000,(250000-O22)*RD!$E$56,0)","v":0},{"$f":"IF(O22<250000,(250000-O22)*RD!$J$56,0)","v":0},{"$f":"Q22*RD!$D$51+'Big Schedules'!R22*RD!$D$52+'Big Schedules'!S22*RD!$D$53+'Big Schedules'!T22*RD!$D$54+'Big Schedules'!U22*RD!$D$55+RD!$D$49*12+W22","v":67024.324989999994},{"$f":"Q22*RD!$J$51+'Big Schedules'!R22*RD!$J$52+'Big Schedules'!S22*RD!$J$53+'Big Schedules'!T22*RD!$J$54+'Big Schedules'!U22*RD!$J$55+RD!$J$49*12+X22","v":72936.829540000006},8.8214309519449197E-2]
[19,null,0,0,0,0,13654,31739,24516,35436,51233,59820,72174,33953,322525,null,153654,{"$f":"R$3*12-SUM($Q23:Q23)-SUMPRODUCT(--($C23:$N23<=R$3),R$3-$C23:$N23)","v":135644},{"$f":"S$3*12-SUM($Q23:R23)-SUMPRODUCT(--($C23:$N23<=S$3),S$3-$C23:$N23)","v":33227},{"$f":"T$3*12-SUM($Q23:S23)-SUMPRODUCT(--($C23:$N23<=T$3),T$3-$C23:$N23)","v":0},{"$f":"U$3*12-SUM($Q23:T23)-SUMPRODUCT(--($C23:$N23<=U$3),U$3-$C23:$N23)","v":0},null,{"$f":"IF(O23<250000,(250000-O23)*RD!$E$56,0)","v":0},{"$f":"IF(O23<250000,(250000-O23)*RD!$J$56,0)","v":0},{"$f":"Q23*RD!$D$51+'Big Schedules'!R23*RD!$D$52+'Big Schedules'!S23*RD!$D$53+'Big Schedules'!T23*RD!$D$54+'Big Schedules'!U23*RD!$D$55+RD!$D$49*12+W23","v":35766.008820000003},{"$f":"Q23*RD!$J$51+'Big Schedules'!R23*RD!$J$52+'Big Schedules'!S23*RD!$J$53+'Big Schedules'!T23*RD!$J$54+'Big Schedules'!U23*RD!$J$55+RD!$J$49*12+X23","v":39085.55573},9.2812897483370849E-2]
[20,null,10,9,9,8,22701,70591,108708,41231,43416,19233,47674,6544,360134,null,145813,{"$f":"R$3*12-SUM($Q24:Q24)-SUMPRODUCT(--($C24:$N24<=R$3),R$3-$C24:$N24)","v":135022},{"$f":"S$3*12-SUM($Q24:R24)-SUMPRODUCT(--($C24:$N24<=S$3),S$3-$C24:$N24)","v":79299},{"$f":"T$3*12-SUM($Q24:S24)-SUMPRODUCT(--($C24:$N24<=T$3),T$3-$C24:$N24)","v":0},{"$f":"U$3*12-SUM($Q24:T24)-SUMPRODUCT(--($C24:$N24<=U$3),U$3-$C24:$N24)","v":0},null,{"$f":"IF(O24<250000,(250000-O24)*RD!$E$56,0)","v":0},{"$f":"IF(O24<250000,(250000-O24)*RD!$J$56,0)","v":0},{"$f":"Q24*RD!$D$51+'Big Schedules'!R24*RD!$D$52+'Big Schedules'!S24*RD!$D$53+'Big Schedules'!T24*RD!$D$54+'Big Schedules'!U24*RD!$D$55+RD!$D$49*12+W24","v":38534.230580000003},{"$f":"Q24*RD!$J$51+'Big Schedules'!R24*RD!$J$52+'Big Schedules'!S24*RD!$J$53+'Big Schedules'!T24*RD!$J$54+'Big Schedules'!U24*RD!$J$55+RD!$J$49*12+X24","v":42083.452949999999},9.2105702295820935E-2]
[21,null,0,0,0,0,0,0,42351,0,0,34918,0,0,77269,null,40000,{"$f":"R$3*12-SUM($Q25:Q25)-SUMPRODUCT(--($C25:$N25<=R$3),R$3-$C25:$N25)","v":37269},{"$f":"S$3*12-SUM($Q25:R25)-SUMPRODUCT(--($C25:$N25<=S$3),S$3-$C25:$N25)","v":0},{"$f":"T$3*12-SUM($Q25:S25)-SUMPRODUCT(--($C25:$N25<=T$3),T$3-$C25:$N25)","v":0},{"$f":"U$3*12-SUM($Q25:T25)-SUMPRODUCT(--($C25:$N25<=U$3),U$3-$C25:$N25)","v":0},null,{"$f":"IF(O25<250000,(250000-O25)*RD!$E$56,0)","v":15381.69555},{"$f":"IF(O25<250000,(250000-O25)*RD!$J$56,0)","v":16126.166159999999},{"$f":"Q25*RD!$D$51+'Big Schedules'!R25*RD!$D$52+'Big Schedules'!S25*RD!$D$53+'Big Schedules'!T25*RD!$D$54+'Big Schedules'!U25*RD!$D$55+RD!$D$49*12+W25","v":29070.656040000002},{"$f":"Q25*RD!$J$51+'Big Schedules'!R25*RD!$J$52+'Big Schedules'!S25*RD!$J$53+'Big Schedules'!T25*RD!$J$54+'Big Schedules'!U25*RD!$J$55+RD!$J$49*12+X25","v":31303.199999999997},7.679716470547171E-2]
[22,null,28868,28455,25144,25018,23445,21107,17889,18960,19584,21198,25600,27547,{"$f":"SUM(C26:N26)","v":282815},null,236433,{"$f":"R$3*12-SUM($Q26:Q26)-SUMPRODUCT(--($C26:$N26<=R$3),R$3-$C26:$N26)","v":46382},{"$f":"S$3*12-SUM($Q26:R26)-SUMPRODUCT(--($C26:$N26<=S$3),S$3-$C26:$N26)","v":0},{"$f":"T$3*12-SUM($Q26:S26)-SUMPRODUCT(--($C26:$N26<=T$3),T$3-$C26:$N26)","v":0},{"$f":"U$3*12-SUM($Q26:T26)-SUMPRODUCT(--($C26:$N26<=U$3),U$3-$C26:$N26)","v":0},null,{"$f":"IF(O26<250000,(250000-O26)*RD!$E$56,0)","v":0},{"$f":"IF(O26<250000,(250000-O26)*RD!$J$56,0)","v":0},{"$f":"Q26*RD!$D$51+'Big Schedules'!R26*RD!$D$52+'Big Schedules'!S26*RD!$D$53+'Big Schedules'!T26*RD!$D$54+'Big Schedules'!U26*RD!$D$55+RD!$D$49*12+W26","v":33508.949919999999},{"$f":"Q26*RD!$J$51+'Big Schedules'!R26*RD!$J$52+'Big Schedules'!S26*RD!$J$53+'Big Schedules'!T26*RD!$J$54+'Big Schedules'!U26*RD!$J$55+RD!$J$49*12+X26","v":36641.502540000001},{"$f":"Z26/Y26-1","v":9.3484058064449149E-2}]
[23,null,31278,31635,26464,30730,26552,26212,20305,21439,23178,23432,25946,26251,313422,null,240000,{"$f":"R$3*12-SUM($Q27:Q27)-SUMPRODUCT(--($C27:$N27<=R$3),R$3-$C27:$N27)","v":73422},{"$f":"S$3*12-SUM($Q27:R27)-SUMPRODUCT(--($C27:$N27<=S$3),S$3-$C27:$N27)","v":0},null,null,null,{"$f":"IF(O27<250000,(250000-O27)*RD!$E$56,0)","v":0},{"$f":"IF(O27<250000,(250000-O27)*RD!$J$56,0)","v":0},{"$f":"Q27*RD!$D$51+'Big Schedules'!R27*RD!$D$52+'Big Schedules'!S27*RD!$D$53+'Big Schedules'!T27*RD!$D$54+'Big Schedules'!U27*RD!$D$55+RD!$D$49*12+W27","v":36185.710619999998},{"$f":"Q27*RD!$J$51+'Big Schedules'!R27*RD!$J$52+'Big Schedules'!S27*RD!$J$53+'Big Schedules'!T27*RD!$J$54+'Big Schedules'!U27*RD!$J$55+RD!$J$49*12+X27","v":39540.27792},9.2704198495024759E-2]
[24,null,59709,53492,52311,49051,41604,30067,27983,26574,25781,29674,41931,48898,487075,null,240000,{"$f":"R$3*12-SUM($Q28:Q28)-SUMPRODUCT(--($C28:$N28<=R$3),R$3-$C28:$N28)","v":231563},{"$f":"S$3*12-SUM($Q28:R28)-SUMPRODUCT(--($C28:$N28<=S$3),S$3-$C28:$N28)","v":15512},null,null,null,{"$f":"IF(O28<250000,(250000-O28)*RD!$E$56,0)","v":0},{"$f":"IF(O28<250000,(250000-O28)*RD!$J$56,0)","v":0},{"$f":"Q28*RD!$D$51+'Big Schedules'!R28*RD!$D$52+'Big Schedules'!S28*RD!$D$53+'Big Schedules'!T28*RD!$D$54+'Big Schedules'!U28*RD!$D$55+RD!$D$49*12+W28","v":51024.949110000009},{"$f":"Q28*RD!$J$51+'Big Schedules'!R28*RD!$J$52+'Big Schedules'!S28*RD!$J$53+'Big Schedules'!T28*RD!$J$54+'Big Schedules'!U28*RD!$J$55+RD!$J$49*12+X28","v":55610.276959999996},8.9864427696241256E-2]
[25,null,85078,61661,52373,30857,21199,2580,18,13,0,9,9304,59982,323074,null,131924,{"$f":"R$3*12-SUM($Q29:Q29)-SUMPRODUCT(--($C29:$N29<=R$3),R$3-$C29:$N29)","v":132056},{"$f":"S$3*12-SUM($Q29:R29)-SUMPRODUCT(--($C29:$N29<=S$3),S$3-$C29:$N29)","v":59094},null,null,null,{"$f":"IF(O29<250000,(250000-O29)*RD!$E$56,0)","v":0},{"$f":"IF(O29<250000,(250000-O29)*RD!$J$56,0)","v":0},{"$f":"Q29*RD!$D$51+'Big Schedules'!R29*RD!$D$52+'Big Schedules'!S29*RD!$D$53+'Big Schedules'!T29*RD!$D$54+'Big Schedules'!U29*RD!$D$55+RD!$D$49*12+W29","v":35361.950920000003},{"$f":"Q29*RD!$J$51+'Big Schedules'!R29*RD!$J$52+'Big Schedules'!S29*RD!$J$53+'Big Schedules'!T29*RD!$J$54+'Big Schedules'!U29*RD!$J$55+RD!$J$49*12+X29","v":38647.976580000002},9.2925462948411308E-2]
[26,null,118668,99286,96607,108132,119798,116471,96310,100563,117072,100107,111292,100581,1284887,null,240000,{"$f":"R$3*12-SUM($Q30:Q30)-SUMPRODUCT(--($C30:$N30<=R$3),R$3-$C30:$N30)","v":360000},{"$f":"S$3*12-SUM($Q30:R30)-SUMPRODUCT(--($C30:$N30<=S$3),S$3-$C30:$N30)","v":684887},null,null,null,{"$f":"IF(O30<250000,(250000-O30)*RD!$E$56,0)","v":0},{"$f":"IF(O30<250000,(250000-O30)*RD!$J$56,0)","v":0},{"$f":"Q30*RD!$D$51+'Big Schedules'!R30*RD!$D$52+'Big Schedules'!S30*RD!$D$53+'Big Schedules'!T30*RD!$D$54+'Big Schedules'!U30*RD!$D$55+RD!$D$49*12+W30","v":114134.71538000001},{"$f":"Q30*RD!$J$51+'Big Schedules'!R30*RD!$J$52+'Big Schedules'!S30*RD!$J$53+'Big Schedules'!T30*RD!$J$54+'Big Schedules'!U30*RD!$J$55+RD!$J$49*12+X30","v":123955.83653},8.6048500820294249E-2]
[27,null,{"$f":"24623+65807","v":90430},{"$f":"24358+59468","v":83826},{"$f":"22818+62767","v":85585},{"$f":"23314+53136","v":76450},{"$f":"21904+34989","v":56893},{"$f":"21379+14574","v":35953},{"$f":"21194+12982","v":34176},{"$f":"22435+10886","v":33321},{"$f":"22330+11246","v":33576},43798,58978,84791,{"$f":"SUM(C31:N31)","v":717777},null,240000,{"$f":"R$3*12-SUM($Q31:Q31)-SUMPRODUCT(--($C31:$N31<=R$3),R$3-$C31:$N31)","v":290824},{"$f":"S$3*12-SUM($Q31:R31)-SUMPRODUCT(--($C31:$N31<=S$3),S$3-$C31:$N31)","v":186953},null,null,null,{"$f":"IF(O31<250000,(250000-O31)*RD!$E$56,0)","v":0},{"$f":"IF(O31<250000,(250000-O31)*RD!$J$56,0)","v":0},{"$f":"Q31*RD!$D$51+'Big Schedules'!R31*RD!$D$52+'Big Schedules'!S31*RD!$D$53+'Big Schedules'!T31*RD!$D$54+'Big Schedules'!U31*RD!$D$55+RD!$D$49*12+W31","v":69461.663260000001},{"$f":"Q31*RD!$J$51+'Big Schedules'!R31*RD!$J$52+'Big Schedules'!S31*RD!$J$53+'Big Schedules'!T31*RD!$J$54+'Big Schedules'!U31*RD!$J$55+RD!$J$49*12+X31","v":75576.501709999997},{"$f":"Z31/Y31-1","v":8.8031846100657285E-2}]
[28,null,15540,16383,13817,14529,12534,11480,10030,11037,11109,11131,13098,14070,154758,null,154758,{"$f":"R$3*12-SUM($Q32:Q32)-SUMPRODUCT(--($C32:$N32<=R$3),R$3-$C32:$N32)","v":0},{"$f":"S$3*12-SUM($Q32:R32)-SUMPRODUCT(--($C32:$N32<=S$3),S$3-$C32:$N32)","v":0},null,null,null,{"$f":"IF(O32<250000,(250000-O32)*RD!$E$56,0)","v":8481.3001000000004},{"$f":"IF(O32<250000,(250000-O32)*RD!$J$56,0)","v":8891.7931200000003},{"$f":"Q32*RD!$D$51+'Big Schedules'!R32*RD!$D$52+'Big Schedules'!S32*RD!$D$53+'Big Schedules'!T32*RD!$D$54+'Big Schedules'!U32*RD!$D$55+RD!$D$49*12+W32","v":30077.350299999998},{"$f":"Q32*RD!$J$51+'Big Schedules'!R32*RD!$J$52+'Big Schedules'!S32*RD!$J$53+'Big Schedules'!T32*RD!$J$54+'Big Schedules'!U32*RD!$J$55+RD!$J$49*12+X32","v":32632.09764},8.4939242137962001E-2]
[29,null,67790,65192,60050,66297,60171,59349,54925,54459,59638,57257,62663,51122,718913,null,240000,{"$f":"R$3*12-SUM($Q33:Q33)-SUMPRODUCT(--($C33:$N33<=R$3),R$3-$C33:$N33)","v":360000},{"$f":"S$3*12-SUM($Q33:R33)-SUMPRODUCT(--($C33:$N33<=S$3),S$3-$C33:$N33)","v":118913},{"$f":"T$3*12-SUM($Q33:S33)-SUMPRODUCT(--($C33:$N33<=T$3),T$3-$C33:$N33)","v":0},{"$f":"U$3*12-SUM($Q33:T33)-SUMPRODUCT(--($C33:$N33<=U$3),U$3-$C33:$N33)","v":0},null,{"$f":"IF(O33<250000,(250000-O33)*RD!$E$56,0)","v":0},{"$f":"IF(O33<250000,(250000-O33)*RD!$J$56,0)","v":0},{"$f":"Q33*RD!$D$51+'Big Schedules'!R33*RD!$D$52+'Big Schedules'!S33*RD!$D$53+'Big Schedules'!T33*RD!$D$54+'Big Schedules'!U33*RD!$D$55+RD!$D$49*12+W33","v":70135.896620000014},{"$f":"Q33*RD!$J$51+'Big Schedules'!R33*RD!$J$52+'Big Schedules'!S33*RD!$J$53+'Big Schedules'!T33*RD!$J$54+'Big Schedules'!U33*RD!$J$55+RD!$J$49*12+X33","v":76306.48547},8.7980465743990655E-2]
[30,null,287849,244777,244177,222571,183293,144374,142559,136064,132251,147275,182065,232024,2299279,null,240000,{"$f":"R$3*12-SUM($Q34:Q34)-SUMPRODUCT(--($C34:$N34<=R$3),R$3-$C34:$N34)","v":360000},{"$f":"S$3*12-SUM($Q34:R34)-SUMPRODUCT(--($C34:$N34<=S$3),S$3-$C34:$N34)","v":1699279},{"$f":"T$3*12-SUM($Q34:S34)-SUMPRODUCT(--($C34:$N34<=T$3),T$3-$C34:$N34)","v":0},{"$f":"U$3*12-SUM($Q34:T34)-SUMPRODUCT(--($C34:$N34<=U$3),U$3-$C34:$N34)","v":0},null,{"$f":"IF(O34<250000,(250000-O34)*RD!$E$56,0)","v":0},{"$f":"IF(O34<250000,(250000-O34)*RD!$J$56,0)","v":0},{"$f":"Q34*RD!$D$51+'Big Schedules'!R34*RD!$D$52+'Big Schedules'!S34*RD!$D$53+'Big Schedules'!T34*RD!$D$54+'Big Schedules'!U34*RD!$D$55+RD!$D$49*12+W34","v":192993.54946000001},{"$f":"Q34*RD!$J$51+'Big Schedules'!R34*RD!$J$52+'Big Schedules'!S34*RD!$J$53+'Big Schedules'!T34*RD!$J$54+'Big Schedules'!U34*RD!$J$55+RD!$J$49*12+X34","v":209357.49900999997},8.4790137265139842E-2]
[31,null,0,0,0,3360,17474,26379,43698,23860,23696,41230,18934,9297,207928,null,149065,{"$f":"R$3*12-SUM($Q35:Q35)-SUMPRODUCT(--($C35:$N35<=R$3),R$3-$C35:$N35)","v":58863},{"$f":"S$3*12-SUM($Q35:R35)-SUMPRODUCT(--($C35:$N35<=S$3),S$3-$C35:$N35)","v":0},{"$f":"T$3*12-SUM($Q35:S35)-SUMPRODUCT(--($C35:$N35<=T$3),T$3-$C35:$N35)","v":0},{"$f":"U$3*12-SUM($Q35:T35)-SUMPRODUCT(--($C35:$N35<=U$3),U$3-$C35:$N35)","v":0},null,{"$f":"IF(O35<250000,(250000-O35)*RD!$E$56,0)","v":3746.5116000000003},{"$f":"IF(O35<250000,(250000-O35)*RD!$J$56,0)","v":3927.8419199999998},{"$f":"Q35*RD!$D$51+'Big Schedules'!R35*RD!$D$52+'Big Schedules'!S35*RD!$D$53+'Big Schedules'!T35*RD!$D$54+'Big Schedules'!U35*RD!$D$55+RD!$D$49*12+W35","v":29865.48933},{"$f":"Q35*RD!$J$51+'Big Schedules'!R35*RD!$J$52+'Big Schedules'!S35*RD!$J$53+'Big Schedules'!T35*RD!$J$54+'Big Schedules'!U35*RD!$J$55+RD!$J$49*12+X35","v":32566.172699999996},9.0428231064915154E-2]
[32,null,42343,43417,38087,45516,41584,36688,33290,33813,36429,36676,43634,23830,455307,null,240000,{"$f":"R$3*12-SUM($Q36:Q36)-SUMPRODUCT(--($C36:$N36<=R$3),R$3-$C36:$N36)","v":215307},{"$f":"S$3*12-SUM($Q36:R36)-SUMPRODUCT(--($C36:$N36<=S$3),S$3-$C36:$N36)","v":0},{"$f":"T$3*12-SUM($Q36:S36)-SUMPRODUCT(--($C36:$N36<=T$3),T$3-$C36:$N36)","v":0},{"$f":"U$3*12-SUM($Q36:T36)-SUMPRODUCT(--($C36:$N36<=U$3),U$3-$C36:$N36)","v":0},null,{"$f":"IF(O36<250000,(250000-O36)*RD!$E$56,0)","v":0},{"$f":"IF(O36<250000,(250000-O36)*RD!$J$56,0)","v":0},{"$f":"Q36*RD!$D$51+'Big Schedules'!R36*RD!$D$52+'Big Schedules'!S36*RD!$D$53+'Big Schedules'!T36*RD!$D$54+'Big Schedules'!U36*RD!$D$55+RD!$D$49*12+W36","v":48417.616470000001},{"$f":"Q36*RD!$J$51+'Big Schedules'!R36*RD!$J$52+'Big Schedules'!S36*RD!$J$53+'Big Schedules'!T36*RD!$J$54+'Big Schedules'!U36*RD!$J$55+RD!$J$49*12+X36","v":52786.661519999994},9.0236681781043382E-2]
[33,null,122651,134343,131414,145440,141771,144651,137666,137490,136687,120335,135021,64922,1552391,null,240000,{"$f":"R$3*12-SUM($Q37:Q37)-SUMPRODUCT(--($C37:$N37<=R$3),R$3-$C37:$N37)","v":360000},{"$f":"S$3*12-SUM($Q37:R37)-SUMPRODUCT(--($C37:$N37<=S$3),S$3-$C37:$N37)","v":952391},{"$f":"T$3*12-SUM($Q37:S37)-SUMPRODUCT(--($C37:$N37<=T$3),T$3-$C37:$N37)","v":0},{"$f":"U$3*12-SUM($Q37:T37)-SUMPRODUCT(--($C37:$N37<=U$3),U$3-$C37:$N37)","v":0},null,{"$f":"IF(O37<250000,(250000-O37)*RD!$E$56,0)","v":0},{"$f":"IF(O37<250000,(250000-O37)*RD!$J$56,0)","v":0},{"$f":"Q37*RD!$D$51+'Big Schedules'!R37*RD!$D$52+'Big Schedules'!S37*RD!$D$53+'Big Schedules'!T37*RD!$D$54+'Big Schedules'!U37*RD!$D$55+RD!$D$49*12+W37","v":134930.47633999999},{"$f":"Q37*RD!$J$51+'Big Schedules'!R37*RD!$J$52+'Big Schedules'!S37*RD!$J$53+'Big Schedules'!T37*RD!$J$54+'Big Schedules'!U37*RD!$J$55+RD!$J$49*12+X37","v":146476.99829000002},8.5573861911707017E-2]
[34,null,74688,57156,59600,45227,32266,15687,15282,10608,11408,17361,34171,55012,{"$f":"SUM(C38:N38)","v":428466},null,210346,{"$f":"R$3*12-SUM($Q38:Q38)-SUMPRODUCT(--($C38:$N38<=R$3),R$3-$C38:$N38)","v":171664},{"$f":"S$3*12-SUM($Q38:R38)-SUMPRODUCT(--($C38:$N38<=S$3),S$3-$C38:$N38)","v":46456},{"$f":"T$3*12-SUM($Q38:S38)-SUMPRODUCT(--($C38:$N38<=T$3),T$3-$C38:$N38)","v":0},{"$f":"U$3*12-SUM($Q38:T38)-SUMPRODUCT(--($C38:$N38<=U$3),U$3-$C38:$N38)","v":0},null,{"$f":"IF(O38<250000,(250000-O38)*RD!$E$56,0)","v":0},{"$f":"IF(O38<250000,(250000-O38)*RD!$J$56,0)","v":0},{"$f":"Q38*RD!$D$51+'Big Schedules'!R38*RD!$D$52+'Big Schedules'!S38*RD!$D$53+'Big Schedules'!T38*RD!$D$54+'Big Schedules'!U38*RD!$D$55+RD!$D$49*12+W38","v":45393.170279999998},{"$f":"Q38*RD!$J$51+'Big Schedules'!R38*RD!$J$52+'Big Schedules'!S38*RD!$J$53+'Big Schedules'!T38*RD!$J$54+'Big Schedules'!U38*RD!$J$55+RD!$J$49*12+X38","v":49511.390919999998},{"$f":"Z38/Y38-1","v":9.0723353636625426E-2}]
[35,null,40172,34573,34920,31919,26433,18572,18672,16744,17202,21385,29893,35260,325745,null,231190,{"$f":"R$3*12-SUM($Q39:Q39)-SUMPRODUCT(--($C39:$N39<=R$3),R$3-$C39:$N39)","v":94555},{"$f":"S$3*12-SUM($Q39:R39)-SUMPRODUCT(--($C39:$N39<=S$3),S$3-$C39:$N39)","v":0},{"$f":"T$3*12-SUM($Q39:S39)-SUMPRODUCT(--($C39:$N39<=T$3),T$3-$C39:$N39)","v":0},{"$f":"U$3*12-SUM($Q39:T39)-SUMPRODUCT(--($C39:$N39<=U$3),U$3-$C39:$N39)","v":0},null,{"$f":"IF(O39<250000,(250000-O39)*RD!$E$56,0)","v":0},{"$f":"IF(O39<250000,(250000-O39)*RD!$J$56,0)","v":0},{"$f":"Q39*RD!$D$51+'Big Schedules'!R39*RD!$D$52+'Big Schedules'!S39*RD!$D$53+'Big Schedules'!T39*RD!$D$54+'Big Schedules'!U39*RD!$D$55+RD!$D$49*12+W39","v":37153.897550000002},{"$f":"Q39*RD!$J$51+'Big Schedules'!R39*RD!$J$52+'Big Schedules'!S39*RD!$J$53+'Big Schedules'!T39*RD!$J$54+'Big Schedules'!U39*RD!$J$55+RD!$J$49*12+X39","v":40588.733399999997},9.2448870145522388E-2]
[36,null,68000,59107,55442,54416,46482,40362,39883,38970,42582,44942,56784,59064,606034,null,240000,{"$f":"R$3*12-SUM($Q40:Q40)-SUMPRODUCT(--($C40:$N40<=R$3),R$3-$C40:$N40)","v":313221},{"$f":"S$3*12-SUM($Q40:R40)-SUMPRODUCT(--($C40:$N40<=S$3),S$3-$C40:$N40)","v":52813},{"$f":"T$3*12-SUM($Q40:S40)-SUMPRODUCT(--($C40:$N40<=T$3),T$3-$C40:$N40)","v":0},{"$f":"U$3*12-SUM($Q40:T40)-SUMPRODUCT(--($C40:$N40<=U$3),U$3-$C40:$N40)","v":0},null,{"$f":"IF(O40<250000,(250000-O40)*RD!$E$56,0)","v":0},{"$f":"IF(O40<250000,(250000-O40)*RD!$J$56,0)","v":0},{"$f":"Q40*RD!$D$51+'Big Schedules'!R40*RD!$D$52+'Big Schedules'!S40*RD!$D$53+'Big Schedules'!T40*RD!$D$54+'Big Schedules'!U40*RD!$D$55+RD!$D$49*12+W40","v":60964.465029999999},{"$f":"Q40*RD!$J$51+'Big Schedules'!R40*RD!$J$52+'Big Schedules'!S40*RD!$J$53+'Big Schedules'!T40*RD!$J$54+'Big Schedules'!U40*RD!$J$55+RD!$J$49*12+X40","v":66374.239029999997},8.8736512283637659E-2]
[37,null,37843,41129,37385,43995,46157,50833,50980,49152,51464,44118,50191,48052,551299,null,240000,{"$f":"R$3*12-SUM($Q41:Q41)-SUMPRODUCT(--($C41:$N41<=R$3),R$3-$C41:$N41)","v":307831},{"$f":"S$3*12-SUM($Q41:R41)-SUMPRODUCT(--($C41:$N41<=S$3),S$3-$C41:$N41)","v":3468},{"$f":"T$3*12-SUM($Q41:S41)-SUMPRODUCT(--($C41:$N41<=T$3),T$3-$C41:$N41)","v":0},{"$f":"U$3*12-SUM($Q41:T41)-SUMPRODUCT(--($C41:$N41<=U$3),U$3-$C41:$N41)","v":0},null,{"$f":"IF(O41<250000,(250000-O41)*RD!$E$56,0)","v":0},{"$f":"IF(O41<250000,(250000-O41)*RD!$J$56,0)","v":0},{"$f":"Q41*RD!$D$51+'Big Schedules'!R41*RD!$D$52+'Big Schedules'!S41*RD!$D$53+'Big Schedules'!T41*RD!$D$54+'Big Schedules'!U41*RD!$D$55+RD!$D$49*12+W41","v":56663.712829999997},{"$f":"Q41*RD!$J$51+'Big Schedules'!R41*RD!$J$52+'Big Schedules'!S41*RD!$J$53+'Big Schedules'!T41*RD!$J$54+'Big Schedules'!U41*RD!$J$55+RD!$J$49*12+X41","v":61716.67308},8.9174535123733856E-2]
[38,null,35912,38156,17670,91185,78420,78423,72714,72848,76572,66694,12102,65796,706492,null,229772,{"$f":"R$3*12-SUM($Q42:Q42)-SUMPRODUCT(--($C42:$N42<=R$3),R$3-$C42:$N42)","v":274068},{"$f":"S$3*12-SUM($Q42:R42)-SUMPRODUCT(--($C42:$N42<=S$3),S$3-$C42:$N42)","v":202652},{"$f":"T$3*12-SUM($Q42:S42)-SUMPRODUCT(--($C42:$N42<=T$3),T$3-$C42:$N42)","v":0},{"$f":"U$3*12-SUM($Q42:T42)-SUMPRODUCT(--($C42:$N42<=U$3),U$3-$C42:$N42)","v":0},null,{"$f":"IF(O42<250000,(250000-O42)*RD!$E$56,0)","v":0},{"$f":"IF(O42<250000,(250000-O42)*RD!$J$56,0)","v":0},{"$f":"Q42*RD!$D$51+'Big Schedules'!R42*RD!$D$52+'Big Schedules'!S42*RD!$D$53+'Big Schedules'!T42*RD!$D$54+'Big Schedules'!U42*RD!$D$55+RD!$D$49*12+W42","v":68246.475560000006},{"$f":"Q42*RD!$J$51+'Big Schedules'!R42*RD!$J$52+'Big Schedules'!S42*RD!$J$53+'Big Schedules'!T42*RD!$J$54+'Big Schedules'!U42*RD!$J$55+RD!$J$49*12+X42","v":74260.534039999999},8.8122623632229002E-2]
[39,null,1002,795,32865,810,14791,22318,22065,22410,18466,15988,85407,26,236943,null,151878,{"$f":"R$3*12-SUM($Q43:Q43)-SUMPRODUCT(--($C43:$N43<=R$3),R$3-$C43:$N43)","v":49658},{"$f":"S$3*12-SUM($Q43:R43)-SUMPRODUCT(--($C43:$N43<=S$3),S$3-$C43:$N43)","v":35407},{"$f":"T$3*12-SUM($Q43:S43)-SUMPRODUCT(--($C43:$N43<=T$3),T$3-$C43:$N43)","v":0},{"$f":"U$3*12-SUM($Q43:T43)-SUMPRODUCT(--($C43:$N43<=U$3),U$3-$C43:$N43)","v":0},null,{"$f":"IF(O43<250000,(250000-O43)*RD!$E$56,0)","v":1162.72585},{"$f":"IF(O43<250000,(250000-O43)*RD!$J$56,0)","v":1219.00152},{"$f":"Q43*RD!$D$51+'Big Schedules'!R43*RD!$D$52+'Big Schedules'!S43*RD!$D$53+'Big Schedules'!T43*RD!$D$54+'Big Schedules'!U43*RD!$D$55+RD!$D$49*12+W43","v":29513.260409999999},{"$f":"Q43*RD!$J$51+'Big Schedules'!R43*RD!$J$52+'Big Schedules'!S43*RD!$J$53+'Big Schedules'!T43*RD!$J$54+'Big Schedules'!U43*RD!$J$55+RD!$J$49*12+X43","v":32274.065050000001},9.354454918388333E-2]
[40,null,56114,54725,51863,44918,36482,21351,18150,12937,13551,20144,38614,53171,422020,null,224638,{"$f":"R$3*12-SUM($Q44:Q44)-SUMPRODUCT(--($C44:$N44<=R$3),R$3-$C44:$N44)","v":181509},{"$f":"S$3*12-SUM($Q44:R44)-SUMPRODUCT(--($C44:$N44<=S$3),S$3-$C44:$N44)","v":15873},{"$f":"T$3*12-SUM($Q44:S44)-SUMPRODUCT(--($C44:$N44<=T$3),T$3-$C44:$N44)","v":0},{"$f":"U$3*12-SUM($Q44:T44)-SUMPRODUCT(--($C44:$N44<=U$3),U$3-$C44:$N44)","v":0},null,{"$f":"IF(O44<250000,(250000-O44)*RD!$E$56,0)","v":0},{"$f":"IF(O44<250000,(250000-O44)*RD!$J$56,0)","v":0},{"$f":"Q44*RD!$D$51+'Big Schedules'!R44*RD!$D$52+'Big Schedules'!S44*RD!$D$53+'Big Schedules'!T44*RD!$D$54+'Big Schedules'!U44*RD!$D$55+RD!$D$49*12+W44","v":45249.280110000007},{"$f":"Q44*RD!$J$51+'Big Schedules'!R44*RD!$J$52+'Big Schedules'!S44*RD!$J$53+'Big Schedules'!T44*RD!$J$54+'Big Schedules'!U44*RD!$J$55+RD!$J$49*12+X44","v":49355.539829999994},9.0747514877977276E-2]
[]
[]
[]
[null,"Total WA Sch 146",{"$f":"SUM(C5:C47)","v":3967685},3629622,3567188,3349134,3031743,2500055,2416869,2200204,2275935,2340543,3067907,3261051,{"$f":"IF(ROUND(SUM(O5:O47),3)<>ROUND(SUM(C48:N48),3),#VALUE!,SUM(C48:N48))","v":35607936},null,{"$f":"SUM(Q5:Q47)","v":8493795},{"$f":"SUM(R5:R47)","v":8514233},{"$f":"SUM(S5:S47)","v":13953929},{"$f":"SUM(T5:T47)","v":2746588},{"$f":"SUM(U5:U47)","v":1899391},null,{"$f":"SUM(W5:W47)","v":29697.462599999999},{"$f":"SUM(X5:X47)","v":31134.813120000003},{"$f":"SUM(Y5:Y47)","v":3235612.97254},{"$f":"SUM(Z5:Z47)","v":3517098.979019999},8.6996191716659066E-2]
[null,null,null,null,null,null,null,null,null,null,null,null,null,null,null,null,null,null,null,null,{"$f":"SUM(Q48:U48)","v":35607936},null,null,null,{"$f":"(Y48/1000)-RS!D18","v":-1.0060000022349413E-5},{"$f":"(Z48/1000)-RS!F18","v":-4.1000007513503078E-6}]
[null,"Revenue Runs",{"$f":"'12MEDEC18'!D166","v":3967685},{"$f":"'12MEDEC18'!E166","v":3629622},{"$f":"'12MEDEC18'!F166","v":3567188},{"$f":"'12MEDEC18'!G166","v":3349134},{"$f":"'12MEDEC18'!H166","v":3031743},{"$f":"'12MEDEC18'!I166","v":2500055},{"$f":"'12MEDEC18'!J166","v":2416869},{"$f":"'12MEDEC18'!K166","v":2200204},{"$f":"'12MEDEC18'!L166","v":2275935},{"$f":"'12MEDEC18'!M166","v":2340543},{"$f":"'12MEDEC18'!N166","v":3067907},{"$f":"'12MEDEC18'!O166","v":3261051},{"$f":"SUM(C50:N50)","v":35607936},{"$f":"#REF!","v":{"$error":"#REF!"}},500,1000,10000,25000,99999999]
[null,null,null,null,null,null,null,null,null,null,null,null,null,null,{"$f":"SUM(C51:N51)","v":0},null,200,1000,99999999,{"$f":"T$62*12-SUM($Q51:S51)-SUMPRODUCT(--($C51:$N51<=T$62),T$62-$C51:$N51)","v":-100001199},{"$f":"U$62*12-SUM($Q51:T51)-SUMPRODUCT(--($C51:$N51<=U$62),U$62-$C51:$N51)","v":0}]
[null,null,null,null,null,null,null,null,null,null,null,null,null,null,0,null,{"$f":"Q$62*12-SUMPRODUCT(--($C52:$N52<=Q$62),Q$62-$C52:$N52)","v":0},{"$f":"R$62*12-SUM($Q52:Q52)-SUMPRODUCT(--($C52:$N52<=R$62),R$62-$C52:$N52)","v":0},{"$f":"S$62*12-SUM($Q52:R52)-SUMPRODUCT(--($C52:$N52<=S$62),S$62-$C52:$N52)","v":0},{"$f":"T$62*12-SUM($Q52:S52)-SUMPRODUCT(--($C52:$N52<=T$62),T$62-$C52:$N52)","v":0},{"$f":"U$62*12-SUM($Q52:T52)-SUMPRODUCT(--($C52:$N52<=U$62),U$62-$C52:$N52)","v":0}]
[null,null,null,null,null,null,null,null,null,null,null,null,null,null,0,null,{"$f":"Q$62*12-SUMPRODUCT(--($C53:$N53<=Q$62),Q$62-$C53:$N53)","v":0},{"$f":"R$62*12-SUM($Q53:Q53)-SUMPRODUCT(--($C53:$N53<=R$62),R$62-$C53:$N53)","v":0},{"$f":"S$62*12-SUM($Q53:R53)-SUMPRODUCT(--($C53:$N53<=S$62),S$62-$C53:$N53)","v":0},{"$f":"T$62*12-SUM($Q53:S53)-SUMPRODUCT(--($C53:$N53<=T$62),T$62-$C53:$N53)","v":0},{"$f":"U$62*12-SUM($Q53:T53)-SUMPRODUCT(--($C53:$N53<=U$62),U$62-$C53:$N53)","v":0}]
[null,null,null,null,null,null,null,null,null,null,null,null,null,null,0,null,{"$f":"Q$62*12-SUMPRODUCT(--($C54:$N54<=Q$62),Q$62-$C54:$N54)","v":0},{"$f":"R$62*12-SUM($Q54:Q54)-SUMPRODUCT(--($C54:$N54<=R$62),R$62-$C54:$N54)","v":0},{"$f":"S$62*12-SUM($Q54:R54)-SUMPRODUCT(--($C54:$N54<=S$62),S$62-$C54:$N54)","v":0},{"$f":"T$62*12-SUM($Q54:S54)-SUMPRODUCT(--($C54:$N54<=T$62),T$62-$C54:$N54)","v":0},{"$f":"U$62*12-SUM($Q54:T54)-SUMPRODUCT(--($C54:$N54<=U$62),U$62-$C54:$N54)","v":0}]
[null,null,null,null,null,null,null,null,null,null,null,null,null,null,0,null,{"$f":"Q$62*12-SUMPRODUCT(--($C55:$N55<=Q$62),Q$62-$C55:$N55)","v":0},{"$f":"R$62*12-SUM($Q55:Q55)-SUMPRODUCT(--($C55:$N55<=R$62),R$62-$C55:$N55)","v":0},{"$f":"S$62*12-SUM($Q55:R55)-SUMPRODUCT(--($C55:$N55<=S$62),S$62-$C55:$N55)","v":0},null,null,null,null,null,{"$f":"COUNT(O5:P46)","v":40}]
[null,null,null,null,null,null,null,null,null,null,null,null,null,null,{"$f":"SUM(C56:N56)","v":0},null,{"$f":"SUM(Q52:Q55)","v":0},{"$f":"SUM(R52:R55)","v":0},0,0,0]
[null,null,null,null,null,null,null,null,null,null,null,null,null,null,{"$f":"SUM(C57:N57)","v":0},null,{"$f":"Q$51*12-SUMPRODUCT(--($C57:$N57<=Q$51),Q$51-$C57:$N57)","v":0},{"$f":"R$51*12-SUM($Q57:Q57)-SUMPRODUCT(--($C57:$N57<=R$51),R$51-$C57:$N57)","v":0},{"$f":"S$51*12-SUM($Q57:R57)-SUMPRODUCT(--($C57:$N57<=S$51),S$51-$C57:$N57)","v":0}]
[null,null,null,null,null,null,null,null,null,null,null,null,null,null,0]
[null,"Total Sch 146",{"$f":"SUM(C50:C58)","v":3967685},{"$f":"SUM(D50:D58)","v":3629622},{"$f":"SUM(E50:E58)","v":3567188},3349134,3031743,2500055,2416869,2200204,2275935,2340543,3067907,3261051,{"$f":"SUM(O50:O58)","v":35607936},null,{"$f":"SUM(Q52:Q55)","v":0},{"$f":"SUM(R52:R55)","v":0},{"$f":"SUM(S52:S55)","v":0},0,0,{"$f":"SUM(Q59:U59)","v":0}]
[null,null,{"$f":"C48-C59","v":0},0,{"$f":"E48-E59","v":0},0,0,0,0,0,0,0,0,0,0,null,{"$f":"SUM(Q56:Q57)","v":0},{"$f":"SUM(R56:R57)","v":0},{"$f":"SUM(S56:S57)","v":0}]
[null,null,{"$f":"COUNT(C5:C44)","v":40},{"$f":"COUNT(D5:D44)","v":40},40,40,40,40,40,40,40,40,{"$f":"COUNT(M5:M44)","v":40},{"$f":"COUNT(N5:N44)","v":40},null,null,"1st",{"$f":"Q62","v":500},{"$f":"R62","v":1000},{"$f":"S62","v":10000},{"$f":"T62","v":25000}]
[null,"ANNUAL USAGE, Sch 121/122",null,null,null,null,null,null,null,null,null,null,null,null,null,null,500,1000,10000,25000,99999999]
[null,"Washington",{"$f":"C4","v":"2018-01-01"},{"$f":"D4","v":"2018-02-01"},"2018-03-01","2018-04-01","2018-05-01","2018-06-01","2018-07-01","2018-08-01","2018-09-01","2018-10-01","2018-11-01","2018-12-01","Total",null,"thms/mo","thms/mo","thms/mo","thms/mo","thms/mo",null,null,"2014-10-01",null,null,null,null,null,"2014-11-01",null,null,null,null,null,"2014-12-01",null,null,null,null,null,"2015-01-01"]
[null,"AIRWAY HEIGHTS CORRECTION CENTER (122)",null,null,null,null,null,null,null,null,null,null,null,null,{"$f":"SUM(C64:N64)","v":0},null,{"$f":"Q$62*12-SUMPRODUCT(--($C64:$N64<=Q$62),Q$62-$C64:$N64)","v":0},{"$f":"R$62*12-SUM($Q64:Q64)-SUMPRODUCT(--($C64:$N64<=R$62),R$62-$C64:$N64)","v":0},{"$f":"S$62*12-SUM($Q64:R64)-SUMPRODUCT(--($C64:$N64<=S$62),S$62-$C64:$N64)","v":0},{"$f":"T$62*12-SUM($Q64:S64)-SUMPRODUCT(--($C64:$N64<=T$62),T$62-$C64:$N64)","v":0},{"$f":"U$62*12-SUM($Q64:T64)-SUMPRODUCT(--($C64:$N64<=U$62),U$62-$C64:$N64)","v":0},null,null,{"$f":"Q$62-SUMPRODUCT(--($C64<=Q$62),Q$62-$C64)","v":0},{"$f":"R$62-X64-SUMPRODUCT(--($C64<=R$62),R$62-$C64)","v":0},{"$f":"S$62-SUM(X64:Y64)-SUMPRODUCT(--($C64<=S$62),S$62-$C64)","v":0},{"$f":"T$62-SUM(X64:Z64)-SUMPRODUCT(--($C64<=T$62),T$62-$C64)","v":0},{"$f":"U$62-SUM($X64:AA64)-SUMPRODUCT(--($C64<=U$62),U$62-$C64)","v":0},null,{"$f":"Q$62-SUMPRODUCT(--($D64<=Q$62),Q$62-$D64)","v":0},{"$f":"R$62-AD64-SUMPRODUCT(--($D64<=R$62),R$62-$D64)","v":0},{"$f":"S$62-SUM(AD64:AE64)-SUMPRODUCT(--($D64<=S$62),S$62-$D64)","v":0},{"$f":"T$62-SUM(AD64:AF64)-SUMPRODUCT(--($D64<=T$62),T$62-$D64)","v":0},{"$f":"U$62-SUM($AD64:AG64)-SUMPRODUCT(--($D64<=U$62),U$62-$D64)","v":0},null,{"$f":"Q$62-SUMPRODUCT(--($E64<=Q$62),Q$62-$E64)","v":0},{"$f":"R$62-AJ64-SUMPRODUCT(--($E64<=R$62),R$62-$E64)","v":0},{"$f":"S$62-SUM(AJ64:AK64)-SUMPRODUCT(--($E64<=S$62),S$62-$E64)","v":0},{"$f":"T$62-SUM(AJ64:AL64)-SUMPRODUCT(--($E64<=T$62),T$62-$E64)","v":0},{"$f":"U$62-SUM($AJ64:AM64)-SUMPRODUCT(--($E64<=U$62),U$62-$E64)","v":0},null,{"$f":"Q$62-SUMPRODUCT(--($F64<=Q$62),Q$62-$F64)","v":0},{"$f":"R$62-AP64-SUMPRODUCT(--($F64<=R$62),R$62-$F64)","v":0},{"$f":"S$62-SUM(AP64:AQ64)-SUMPRODUCT(--($F64<=S$62),S$62-$F64)","v":0},{"$f":"T$62-SUM(AP64:AR64)-SUMPRODUCT(--($F64<=T$62),T$62-$F64)","v":0},{"$f":"U$62-SUM($AP64:AS64)-SUMPRODUCT(--($F64<=U$62),U$62-$F64)","v":0}]
[null,"CAMELBACK HOTEL CORP",null,null,null,null,null,null,null,null,null,null,null,null,0,null,0,{"$f":"R$62*12-SUM($Q65:Q65)-SUMPRODUCT(--($C65:$N65<=R$62),R$62-$C65:$N65)","v":0},{"$f":"S$62*12-SUM($Q65:R65)-SUMPRODUCT(--($C65:$N65<=S$62),S$62-$C65:$N65)","v":0},{"$f":"T$62*12-SUM($Q65:S65)-SUMPRODUCT(--($C65:$N65<=T$62),T$62-$C65:$N65)","v":0},{"$f":"U$62*12-SUM($Q65:T65)-SUMPRODUCT(--($C65:$N65<=U$62),U$62-$C65:$N65)","v":0},null,null,{"$f":"Q$62-SUMPRODUCT(--($C65<=Q$62),Q$62-$C65)","v":0},{"$f":"R$62-X65-SUMPRODUCT(--($C65<=R$62),R$62-$C65)","v":0},{"$f":"S$62-SUM(X65:Y65)-SUMPRODUCT(--($C65<=S$62),S$62-$C65)","v":0},{"$f":"T$62-SUM(X65:Z65)-SUMPRODUCT(--($C65<=T$62),T$62-$C65)","v":0},{"$f":"U$62-SUM($X65:AA65)-SUMPRODUCT(--($C65<=U$62),U$62-$C65)","v":0},null,{"$f":"Q$62-SUMPRODUCT(--($D65<=Q$62),Q$62-$D65)","v":0},{"$f":"R$62-AD65-SUMPRODUCT(--($D65<=R$62),R$62-$D65)","v":0},{"$f":"S$62-SUM(AD65:AE65)-SUMPRODUCT(--($D65<=S$62),S$62-$D65)","v":0},{"$f":"T$62-SUM(AD65:AF65)-SUMPRODUCT(--($D65<=T$62),T$62-$D65)","v":0},{"$f":"U$62-SUM($AD65:AG65)-SUMPRODUCT(--($D65<=U$62),U$62-$D65)","v":0},null,{"$f":"Q$62-SUMPRODUCT(--($E65<=Q$62),Q$62-$E65)","v":0},{"$f":"R$62-AJ65-SUMPRODUCT(--($E65<=R$62),R$62-$E65)","v":0},{"$f":"S$62-SUM(AJ65:AK65)-SUMPRODUCT(--($E65<=S$62),S$62-$E65)","v":0},{"$f":"T$62-SUM(AJ65:AL65)-SUMPRODUCT(--($E65<=T$62),T$62-$E65)","v":0},{"$f":"U$62-SUM($AJ65:AM65)-SUMPRODUCT(--($E65<=U$62),U$62-$E65)","v":0},null,{"$f":"Q$62-SUMPRODUCT(--($F65<=Q$62),Q$62-$F65)","v":0},{"$f":"R$62-AP65-SUMPRODUCT(--($F65<=R$62),R$62-$F65)","v":0},{"$f":"S$62-SUM(AP65:AQ65)-SUMPRODUCT(--($F65<=S$62),S$62-$F65)","v":0},{"$f":"T$62-SUM(AP65:AR65)-SUMPRODUCT(--($F65<=T$62),T$62-$F65)","v":0},{"$f":"U$62-SUM($AP65:AS65)-SUMPRODUCT(--($F65<=U$62),U$62-$F65)","v":0}]
[null,"COYOTE RIDGE CORRECTION",null,null,null,null,null,null,null,null,null,null,null,null,0,null,0,{"$f":"R$62*12-SUM($Q66:Q66)-SUMPRODUCT(--($C66:$N66<=R$62),R$62-$C66:$N66)","v":0},{"$f":"S$62*12-SUM($Q66:R66)-SUMPRODUCT(--($C66:$N66<=S$62),S$62-$C66:$N66)","v":0},{"$f":"T$62*12-SUM($Q66:S66)-SUMPRODUCT(--($C66:$N66<=T$62),T$62-$C66:$N66)","v":0},{"$f":"U$62*12-SUM($Q66:T66)-SUMPRODUCT(--($C66:$N66<=U$62),U$62-$C66:$N66)","v":0},null,null,0,0,0,0,{"$f":"U$62-SUM($X66:AA66)-SUMPRODUCT(--($C66<=U$62),U$62-$C66)","v":0},null,0,0,0,0,{"$f":"U$62-SUM($AD66:AG66)-SUMPRODUCT(--($D66<=U$62),U$62-$D66)","v":0},null,0,0,0,0,{"$f":"U$62-SUM($AJ66:AM66)-SUMPRODUCT(--($E66<=U$62),U$62-$E66)","v":0},null,0,0,0,0,{"$f":"U$62-SUM($AP66:AS66)-SUMPRODUCT(--($F66<=U$62),U$62-$F66)","v":0}]
[null,"DAVENPORT 2000 LLC",null,null,null,null,null,null,null,null,null,null,null,null,0,null,0,{"$f":"R$62*12-SUM($Q67:Q67)-SUMPRODUCT(--($C67:$N67<=R$62),R$62-$C67:$N67)","v":0},{"$f":"S$62*12-SUM($Q67:R67)-SUMPRODUCT(--($C67:$N67<=S$62),S$62-$C67:$N67)","v":0},{"$f":"T$62*12-SUM($Q67:S67)-SUMPRODUCT(--($C67:$N67<=T$62),T$62-$C67:$N67)","v":0},{"$f":"U$62*12-SUM($Q67:T67)-SUMPRODUCT(--($C67:$N67<=U$62),U$62-$C67:$N67)","v":0},null,null,0,0,0,0,{"$f":"U$62-SUM($X67:AA67)-SUMPRODUCT(--($C67<=U$62),U$62-$C67)","v":0},null,0,0,0,0,{"$f":"U$62-SUM($AD67:AG67)-SUMPRODUCT(--($D67<=U$62),U$62-$D67)","v":0},null,0,0,0,0,{"$f":"U$62-SUM($AJ67:AM67)-SUMPRODUCT(--($E67<=U$62),U$62-$E67)","v":0},null,0,0,0,0,{"$f":"U$62-SUM($AP67:AS67)-SUMPRODUCT(--($F67<=U$62),U$62-$F67)","v":0}]
[null,"DOUBLETREE HOTEL",null,null,null,null,null,null,null,null,null,null,null,null,0,null,0,{"$f":"R$62*12-SUM($Q68:Q68)-SUMPRODUCT(--($C68:$N68<=R$62),R$62-$C68:$N68)","v":0},{"$f":"S$62*12-SUM($Q68:R68)-SUMPRODUCT(--($C68:$N68<=S$62),S$62-$C68:$N68)","v":0},{"$f":"T$62*12-SUM($Q68:S68)-SUMPRODUCT(--($C68:$N68<=T$62),T$62-$C68:$N68)","v":0},{"$f":"U$62*12-SUM($Q68:T68)-SUMPRODUCT(--($C68:$N68<=U$62),U$62-$C68:$N68)","v":0},null,null,0,0,0,0,{"$f":"U$62-SUM($X68:AA68)-SUMPRODUCT(--($C68<=U$62),U$62-$C68)","v":0},null,0,0,0,0,{"$f":"U$62-SUM($AD68:AG68)-SUMPRODUCT(--($D68<=U$62),U$62-$D68)","v":0},null,0,0,0,0,{"$f":"U$62-SUM($AJ68:AM68)-SUMPRODUCT(--($E68<=U$62),U$62-$E68)","v":0},null,0,0,0,0,{"$f":"U$62-SUM($AP68:AS68)-SUMPRODUCT(--($F68<=U$62),U$62-$F68)","v":0}]
[null,"ECOLITE",null,null,null,null,null,null,null,null,null,null,null,null,0,null,0,{"$f":"R$62*12-SUM($Q69:Q69)-SUMPRODUCT(--($C69:$N69<=R$62),R$62-$C69:$N69)","v":0},{"$f":"S$62*12-SUM($Q69:R69)-SUMPRODUCT(--($C69:$N69<=S$62),S$62-$C69:$N69)","v":0},{"$f":"T$62*12-SUM($Q69:S69)-SUMPRODUCT(--($C69:$N69<=T$62),T$62-$C69:$N69)","v":0},{"$f":"U$62*12-SUM($Q69:T69)-SUMPRODUCT(--($C69:$N69<=U$62),U$62-$C69:$N69)","v":0},null,null,0,0,0,0,{"$f":"U$62-SUM($X69:AA69)-SUMPRODUCT(--($C69<=U$62),U$62-$C69)","v":0},null,0,0,0,0,{"$f":"U$62-SUM($AD69:AG69)-SUMPRODUCT(--($D69<=U$62),U$62-$D69)","v":0},null,0,0,0,0,{"$f":"U$62-SUM($AJ69:AM69)-SUMPRODUCT(--($E69<=U$62),U$62-$E69)","v":0},null,0,0,0,0,{"$f":"U$62-SUM($AP69:AS69)-SUMPRODUCT(--($F69<=U$62),U$62-$F69)","v":0}]
[null,"GOOD SAMARITAN VILLAGE",null,null,null,null,null,null,null,null,null,null,null,null,0,null,0,{"$f":"R$62*12-SUM($Q70:Q70)-SUMPRODUCT(--($C70:$N70<=R$62),R$62-$C70:$N70)","v":0},{"$f":"S$62*12-SUM($Q70:R70)-SUMPRODUCT(--($C70:$N70<=S$62),S$62-$C70:$N70)","v":0},{"$f":"T$62*12-SUM($Q70:S70)-SUMPRODUCT(--($C70:$N70<=T$62),T$62-$C70:$N70)","v":0},{"$f":"U$62*12-SUM($Q70:T70)-SUMPRODUCT(--($C70:$N70<=U$62),U$62-$C70:$N70)","v":0},null,null,0,0,0,0,{"$f":"U$62-SUM($X70:AA70)-SUMPRODUCT(--($C70<=U$62),U$62-$C70)","v":0},null,0,0,0,0,{"$f":"U$62-SUM($AD70:AG70)-SUMPRODUCT(--($D70<=U$62),U$62-$D70)","v":0},null,0,0,0,0,{"$f":"U$62-SUM($AJ70:AM70)-SUMPRODUCT(--($E70<=U$62),U$62-$E70)","v":0},null,0,0,0,0,{"$f":"U$62-SUM($AP70:AS70)-SUMPRODUCT(--($F70<=U$62),U$62-$F70)","v":0}]
[null,"GREENACRES GYPSUM & LIME CO",null,null,null,null,null,null,null,null,null,null,null,null,0,null,0,{"$f":"R$62*12-SUM($Q71:Q71)-SUMPRODUCT(--($C71:$N71<=R$62),R$62-$C71:$N71)","v":0},{"$f":"S$62*12-SUM($Q71:R71)-SUMPRODUCT(--($C71:$N71<=S$62),S$62-$C71:$N71)","v":0},{"$f":"T$62*12-SUM($Q71:S71)-SUMPRODUCT(--($C71:$N71<=T$62),T$62-$C71:$N71)","v":0},{"$f":"U$62*12-SUM($Q71:T71)-SUMPRODUCT(--($C71:$N71<=U$62),U$62-$C71:$N71)","v":0},null,null,0,0,0,0,{"$f":"U$62-SUM($X71:AA71)-SUMPRODUCT(--($C71<=U$62),U$62-$C71)","v":0},null,0,0,0,0,{"$f":"U$62-SUM($AD71:AG71)-SUMPRODUCT(--($D71<=U$62),U$62-$D71)","v":0},null,0,0,0,0,{"$f":"U$62-SUM($AJ71:AM71)-SUMPRODUCT(--($E71<=U$62),U$62-$E71)","v":0},null,0,0,0,0,{"$f":"U$62-SUM($AP71:AS71)-SUMPRODUCT(--($F71<=U$62),U$62-$F71)","v":0}]
[null,"HOLLISTER-STIER LABORATORIES",null,null,null,null,null,null,null,null,null,null,null,null,0,null,0,{"$f":"R$62*12-SUM($Q72:Q72)-SUMPRODUCT(--($C72:$N72<=R$62),R$62-$C72:$N72)","v":0},{"$f":"S$62*12-SUM($Q72:R72)-SUMPRODUCT(--($C72:$N72<=S$62),S$62-$C72:$N72)","v":0},{"$f":"T$62*12-SUM($Q72:S72)-SUMPRODUCT(--($C72:$N72<=T$62),T$62-$C72:$N72)","v":0},{"$f":"U$62*12-SUM($Q72:T72)-SUMPRODUCT(--($C72:$N72<=U$62),U$62-$C72:$N72)","v":0},null,null,0,0,0,0,{"$f":"U$62-SUM($X72:AA72)-SUMPRODUCT(--($C72<=U$62),U$62-$C72)","v":0},null,0,0,0,0,{"$f":"U$62-SUM($AD72:AG72)-SUMPRODUCT(--($D72<=U$62),U$62-$D72)","v":0},null,0,0,0,0,{"$f":"U$62-SUM($AJ72:AM72)-SUMPRODUCT(--($E72<=U$62),U$62-$E72)","v":0},null,0,0,0,0,{"$f":"U$62-SUM($AP72:AS72)-SUMPRODUCT(--($F72<=U$62),U$62-$F72)","v":0}]
[null,"JOHANNA BEVERAGE CO",null,null,null,null,null,null,null,null,null,null,null,null,0,null,0,{"$f":"R$62*12-SUM($Q73:Q73)-SUMPRODUCT(--($C73:$N73<=R$62),R$62-$C73:$N73)","v":0},{"$f":"S$62*12-SUM($Q73:R73)-SUMPRODUCT(--($C73:$N73<=S$62),S$62-$C73:$N73)","v":0},{"$f":"T$62*12-SUM($Q73:S73)-SUMPRODUCT(--($C73:$N73<=T$62),T$62-$C73:$N73)","v":0},{"$f":"U$62*12-SUM($Q73:T73)-SUMPRODUCT(--($C73:$N73<=U$62),U$62-$C73:$N73)","v":0},null,null,0,0,0,0,{"$f":"U$62-SUM($X73:AA73)-SUMPRODUCT(--($C73<=U$62),U$62-$C73)","v":0},null,0,0,0,0,{"$f":"U$62-SUM($AD73:AG73)-SUMPRODUCT(--($D73<=U$62),U$62-$D73)","v":0},null,0,0,0,0,{"$f":"U$62-SUM($AJ73:AM73)-SUMPRODUCT(--($E73<=U$62),U$62-$E73)","v":0},null,0,0,0,0,{"$f":"U$62-SUM($AP73:AS73)-SUMPRODUCT(--($F73<=U$62),U$62-$F73)","v":0}]
[null,"KALISPEL TRIBAL ECONOMIC AUTHOR\n",null,null,null,null,null,null,null,null,null,null,null,null,0,null,0,{"$f":"R$62*12-SUM($Q74:Q74)-SUMPRODUCT(--($C74:$N74<=R$62),R$62-$C74:$N74)","v":0},{"$f":"S$62*12-SUM($Q74:R74)-SUMPRODUCT(--($C74:$N74<=S$62),S$62-$C74:$N74)","v":0},{"$f":"T$62*12-SUM($Q74:S74)-SUMPRODUCT(--($C74:$N74<=T$62),T$62-$C74:$N74)","v":0},{"$f":"U$62*12-SUM($Q74:T74)-SUMPRODUCT(--($C74:$N74<=U$62),U$62-$C74:$N74)","v":0},null,null,0,0,0,0,{"$f":"U$62-SUM($X74:AA74)-SUMPRODUCT(--($C74<=U$62),U$62-$C74)","v":0},null,0,0,0,0,{"$f":"U$62-SUM($AD74:AG74)-SUMPRODUCT(--($D74<=U$62),U$62-$D74)","v":0},null,0,0,0,0,{"$f":"U$62-SUM($AJ74:AM74)-SUMPRODUCT(--($E74<=U$62),U$62-$E74)","v":0},null,0,0,0,0,{"$f":"U$62-SUM($AP74:AS74)-SUMPRODUCT(--($F74<=U$62),U$62-$F74)","v":0}]
[null,"MIRABEAU PARK HOTEL",null,null,null,null,null,null,null,null,null,null,null,null,0,null,0,{"$f":"R$62*12-SUM($Q75:Q75)-SUMPRODUCT(--($C75:$N75<=R$62),R$62-$C75:$N75)","v":0},{"$f":"S$62*12-SUM($Q75:R75)-SUMPRODUCT(--($C75:$N75<=S$62),S$62-$C75:$N75)","v":0},{"$f":"T$62*12-SUM($Q75:S75)-SUMPRODUCT(--($C75:$N75<=T$62),T$62-$C75:$N75)","v":0},{"$f":"U$62*12-SUM($Q75:T75)-SUMPRODUCT(--($C75:$N75<=U$62),U$62-$C75:$N75)","v":0},null,null,0,0,0,0,{"$f":"U$62-SUM($X75:AA75)-SUMPRODUCT(--($C75<=U$62),U$62-$C75)","v":0},null,0,0,0,0,{"$f":"U$62-SUM($AD75:AG75)-SUMPRODUCT(--($D75<=U$62),U$62-$D75)","v":0},null,0,0,0,0,{"$f":"U$62-SUM($AJ75:AM75)-SUMPRODUCT(--($E75<=U$62),U$62-$E75)","v":0},null,0,0,0,0,{"$f":"U$62-SUM($AP75:AS75)-SUMPRODUCT(--($F75<=U$62),U$62-$F75)","v":0}]
[null,"MOUNT CARMEL HOSPITAL",null,null,null,null,null,null,null,null,null,null,null,null,0,null,0,{"$f":"R$62*12-SUM($Q76:Q76)-SUMPRODUCT(--($C76:$N76<=R$62),R$62-$C76:$N76)","v":0},{"$f":"S$62*12-SUM($Q76:R76)-SUMPRODUCT(--($C76:$N76<=S$62),S$62-$C76:$N76)","v":0},{"$f":"T$62*12-SUM($Q76:S76)-SUMPRODUCT(--($C76:$N76<=T$62),T$62-$C76:$N76)","v":0},{"$f":"U$62*12-SUM($Q76:T76)-SUMPRODUCT(--($C76:$N76<=U$62),U$62-$C76:$N76)","v":0},null,null,0,0,0,0,{"$f":"U$62-SUM($X76:AA76)-SUMPRODUCT(--($C76<=U$62),U$62-$C76)","v":0},null,0,0,0,0,{"$f":"U$62-SUM($AD76:AG76)-SUMPRODUCT(--($D76<=U$62),U$62-$D76)","v":0},null,0,0,0,0,{"$f":"U$62-SUM($AJ76:AM76)-SUMPRODUCT(--($E76<=U$62),U$62-$E76)","v":0},null,0,0,0,0,{"$f":"U$62-SUM($AP76:AS76)-SUMPRODUCT(--($F76<=U$62),U$62-$F76)","v":0}]
[null,"NORTHERN QUEST CASINO",null,null,null,null,null,null,null,null,null,null,null,null,0,null,0,{"$f":"R$62*12-SUM($Q77:Q77)-SUMPRODUCT(--($C77:$N77<=R$62),R$62-$C77:$N77)","v":0},{"$f":"S$62*12-SUM($Q77:R77)-SUMPRODUCT(--($C77:$N77<=S$62),S$62-$C77:$N77)","v":0},{"$f":"T$62*12-SUM($Q77:S77)-SUMPRODUCT(--($C77:$N77<=T$62),T$62-$C77:$N77)","v":0},{"$f":"U$62*12-SUM($Q77:T77)-SUMPRODUCT(--($C77:$N77<=U$62),U$62-$C77:$N77)","v":0},null,null,0,0,0,0,{"$f":"U$62-SUM($X77:AA77)-SUMPRODUCT(--($C77<=U$62),U$62-$C77)","v":0},null,0,0,0,0,{"$f":"U$62-SUM($AD77:AG77)-SUMPRODUCT(--($D77<=U$62),U$62-$D77)","v":0},null,0,0,0,0,{"$f":"U$62-SUM($AJ77:AM77)-SUMPRODUCT(--($E77<=U$62),U$62-$E77)","v":0},null,0,0,0,0,{"$f":"U$62-SUM($AP77:AS77)-SUMPRODUCT(--($F77<=U$62),U$62-$F77)","v":0}]
[null,"NORTHERN QUEST CASINO",null,null,null,null,null,null,null,null,null,null,null,null,0,null,0,{"$f":"R$62*12-SUM($Q78:Q78)-SUMPRODUCT(--($C78:$N78<=R$62),R$62-$C78:$N78)","v":0},{"$f":"S$62*12-SUM($Q78:R78)-SUMPRODUCT(--($C78:$N78<=S$62),S$62-$C78:$N78)","v":0},{"$f":"T$62*12-SUM($Q78:S78)-SUMPRODUCT(--($C78:$N78<=T$62),T$62-$C78:$N78)","v":0},{"$f":"U$62*12-SUM($Q78:T78)-SUMPRODUCT(--($C78:$N78<=U$62),U$62-$C78:$N78)","v":0},null,null,0,0,0,0,{"$f":"U$62-SUM($X78:AA78)-SUMPRODUCT(--($C78<=U$62),U$62-$C78)","v":0},null,0,0,0,0,{"$f":"U$62-SUM($AD78:AG78)-SUMPRODUCT(--($D78<=U$62),U$62-$D78)","v":0},null,0,0,0,0,{"$f":"U$62-SUM($AJ78:AM78)-SUMPRODUCT(--($E78<=U$62),U$62-$E78)","v":0},null,0,0,0,0,{"$f":"U$62-SUM($AP78:AS78)-SUMPRODUCT(--($F78<=U$62),U$62-$F78)","v":0}]
[null,"PHILADELPHIA MACARONI CO",null,null,null,null,null,null,null,null,null,null,null,null,0,null,0,{"$f":"R$62*12-SUM($Q79:Q79)-SUMPRODUCT(--($C79:$N79<=R$62),R$62-$C79:$N79)","v":0},{"$f":"S$62*12-SUM($Q79:R79)-SUMPRODUCT(--($C79:$N79<=S$62),S$62-$C79:$N79)","v":0},{"$f":"T$62*12-SUM($Q79:S79)-SUMPRODUCT(--($C79:$N79<=T$62),T$62-$C79:$N79)","v":0},{"$f":"U$62*12-SUM($Q79:T79)-SUMPRODUCT(--($C79:$N79<=U$62),U$62-$C79:$N79)","v":0},null,null,0,0,0,0,{"$f":"U$62-SUM($X79:AA79)-SUMPRODUCT(--($C79<=U$62),U$62-$C79)","v":0},null,0,0,0,0,{"$f":"U$62-SUM($AD79:AG79)-SUMPRODUCT(--($D79<=U$62),U$62-$D79)","v":0},null,0,0,0,0,{"$f":"U$62-SUM($AJ79:AM79)-SUMPRODUCT(--($E79<=U$62),U$62-$E79)","v":0},null,0,0,0,0,{"$f":"U$62-SUM($AP79:AS79)-SUMPRODUCT(--($F79<=U$62),U$62-$F79)","v":0}]
[null,"PIZZA CRUST INC",null,null,null,null,null,null,null,null,null,null,null,null,0,null,0,{"$f":"R$62*12-SUM($Q80:Q80)-SUMPRODUCT(--($C80:$N80<=R$62),R$62-$C80:$N80)","v":0},{"$f":"S$62*12-SUM($Q80:R80)-SUMPRODUCT(--($C80:$N80<=S$62),S$62-$C80:$N80)","v":0},{"$f":"T$62*12-SUM($Q80:S80)-SUMPRODUCT(--($C80:$N80<=T$62),T$62-$C80:$N80)","v":0},{"$f":"U$62*12-SUM($Q80:T80)-SUMPRODUCT(--($C80:$N80<=U$62),U$62-$C80:$N80)","v":0},null,null,0,0,0,0,{"$f":"U$62-SUM($X80:AA80)-SUMPRODUCT(--($C80<=U$62),U$62-$C80)","v":0},null,0,0,0,0,{"$f":"U$62-SUM($AD80:AG80)-SUMPRODUCT(--($D80<=U$62),U$62-$D80)","v":0},null,0,0,0,0,{"$f":"U$62-SUM($AJ80:AM80)-SUMPRODUCT(--($E80<=U$62),U$62-$E80)","v":0},null,0,0,0,0,{"$f":"U$62-SUM($AP80:AS80)-SUMPRODUCT(--($F80<=U$62),U$62-$F80)","v":0}]
[null,"PULLMAN REGIONAL HOSPITAL",null,null,null,null,null,null,null,null,null,null,null,null,0,null,0,{"$f":"R$62*12-SUM($Q81:Q81)-SUMPRODUCT(--($C81:$N81<=R$62),R$62-$C81:$N81)","v":0},{"$f":"S$62*12-SUM($Q81:R81)-SUMPRODUCT(--($C81:$N81<=S$62),S$62-$C81:$N81)","v":0},{"$f":"T$62*12-SUM($Q81:S81)-SUMPRODUCT(--($C81:$N81<=T$62),T$62-$C81:$N81)","v":0},{"$f":"U$62*12-SUM($Q81:T81)-SUMPRODUCT(--($C81:$N81<=U$62),U$62-$C81:$N81)","v":0},null,null,0,0,0,0,{"$f":"U$62-SUM($X81:AA81)-SUMPRODUCT(--($C81<=U$62),U$62-$C81)","v":0},null,0,0,0,0,{"$f":"U$62-SUM($AD81:AG81)-SUMPRODUCT(--($D81<=U$62),U$62-$D81)","v":0},null,0,0,0,0,{"$f":"U$62-SUM($AJ81:AM81)-SUMPRODUCT(--($E81<=U$62),U$62-$E81)","v":0},null,0,0,0,0,{"$f":"U$62-SUM($AP81:AS81)-SUMPRODUCT(--($F81<=U$62),U$62-$F81)","v":0}]
[null,"RED LION HOTEL AT THE PARK",null,null,null,null,null,null,null,null,null,null,null,null,0,null,0,{"$f":"R$62*12-SUM($Q82:Q82)-SUMPRODUCT(--($C82:$N82<=R$62),R$62-$C82:$N82)","v":0},{"$f":"S$62*12-SUM($Q82:R82)-SUMPRODUCT(--($C82:$N82<=S$62),S$62-$C82:$N82)","v":0},{"$f":"T$62*12-SUM($Q82:S82)-SUMPRODUCT(--($C82:$N82<=T$62),T$62-$C82:$N82)","v":0},{"$f":"U$62*12-SUM($Q82:T82)-SUMPRODUCT(--($C82:$N82<=U$62),U$62-$C82:$N82)","v":0},null,null,0,0,0,0,{"$f":"U$62-SUM($X82:AA82)-SUMPRODUCT(--($C82<=U$62),U$62-$C82)","v":0},null,0,0,0,0,{"$f":"U$62-SUM($AD82:AG82)-SUMPRODUCT(--($D82<=U$62),U$62-$D82)","v":0},null,0,0,0,0,{"$f":"U$62-SUM($AJ82:AM82)-SUMPRODUCT(--($E82<=U$62),U$62-$E82)","v":0},null,0,0,0,0,{"$f":"U$62-SUM($AP82:AS82)-SUMPRODUCT(--($F82<=U$62),U$62-$F82)","v":0}]
[null,"SACRED HEART MED CENTER",null,null,null,null,null,null,null,null,null,null,null,null,0,null,0,{"$f":"R$62*12-SUM($Q83:Q83)-SUMPRODUCT(--($C83:$N83<=R$62),R$62-$C83:$N83)","v":0},{"$f":"S$62*12-SUM($Q83:R83)-SUMPRODUCT(--($C83:$N83<=S$62),S$62-$C83:$N83)","v":0},{"$f":"T$62*12-SUM($Q83:S83)-SUMPRODUCT(--($C83:$N83<=T$62),T$62-$C83:$N83)","v":0},{"$f":"U$62*12-SUM($Q83:T83)-SUMPRODUCT(--($C83:$N83<=U$62),U$62-$C83:$N83)","v":0},null,null,0,0,0,0,{"$f":"U$62-SUM($X83:AA83)-SUMPRODUCT(--($C83<=U$62),U$62-$C83)","v":0},null,0,0,0,0,{"$f":"U$62-SUM($AD83:AG83)-SUMPRODUCT(--($D83<=U$62),U$62-$D83)","v":0},null,0,0,0,0,{"$f":"U$62-SUM($AJ83:AM83)-SUMPRODUCT(--($E83<=U$62),U$62-$E83)","v":0},null,0,0,0,0,{"$f":"U$62-SUM($AP83:AS83)-SUMPRODUCT(--($F83<=U$62),U$62-$F83)","v":0}]
[null,"SAINT LUKES REHAB INSTITUTE (122)",null,null,null,null,null,null,null,null,null,null,null,null,{"$f":"SUM(C84:N84)","v":0},null,0,{"$f":"R$62*12-SUM($Q84:Q84)-SUMPRODUCT(--($C84:$N84<=R$62),R$62-$C84:$N84)","v":0},{"$f":"S$62*12-SUM($Q84:R84)-SUMPRODUCT(--($C84:$N84<=S$62),S$62-$C84:$N84)","v":0},{"$f":"T$62*12-SUM($Q84:S84)-SUMPRODUCT(--($C84:$N84<=T$62),T$62-$C84:$N84)","v":0},{"$f":"U$62*12-SUM($Q84:T84)-SUMPRODUCT(--($C84:$N84<=U$62),U$62-$C84:$N84)","v":0},null,null,0,0,0,0,{"$f":"U$62-SUM($X84:AA84)-SUMPRODUCT(--($C84<=U$62),U$62-$C84)","v":0},null,0,0,0,0,{"$f":"U$62-SUM($AD84:AG84)-SUMPRODUCT(--($D84<=U$62),U$62-$D84)","v":0},null,0,0,0,0,{"$f":"U$62-SUM($AJ84:AM84)-SUMPRODUCT(--($E84<=U$62),U$62-$E84)","v":0},null,0,0,0,0,{"$f":"U$62-SUM($AP84:AS84)-SUMPRODUCT(--($F84<=U$62),U$62-$F84)","v":0}]
[null,"SHRINERS HOSPITAL",null,null,null,null,null,null,null,null,null,null,null,null,0,null,0,{"$f":"R$62*12-SUM($Q85:Q85)-SUMPRODUCT(--($C85:$N85<=R$62),R$62-$C85:$N85)","v":0},{"$f":"S$62*12-SUM($Q85:R85)-SUMPRODUCT(--($C85:$N85<=S$62),S$62-$C85:$N85)","v":0},{"$f":"T$62*12-SUM($Q85:S85)-SUMPRODUCT(--($C85:$N85<=T$62),T$62-$C85:$N85)","v":0},{"$f":"U$62*12-SUM($Q85:T85)-SUMPRODUCT(--($C85:$N85<=U$62),U$62-$C85:$N85)","v":0},null,null,0,0,0,0,{"$f":"U$62-SUM($X85:AA85)-SUMPRODUCT(--($C85<=U$62),U$62-$C85)","v":0},null,0,0,0,0,{"$f":"U$62-SUM($AD85:AG85)-SUMPRODUCT(--($D85<=U$62),U$62-$D85)","v":0},null,0,0,0,0,{"$f":"U$62-SUM($AJ85:AM85)-SUMPRODUCT(--($E85<=U$62),U$62-$E85)","v":0},null,0,0,0,0,{"$f":"U$62-SUM($AP85:AS85)-SUMPRODUCT(--($F85<=U$62),U$62-$F85)","v":0}]
[null,"SKAMANIA LODGE",null,null,null,null,null,null,null,null,null,null,null,null,0,null,0,{"$f":"R$62*12-SUM($Q86:Q86)-SUMPRODUCT(--($C86:$N86<=R$62),R$62-$C86:$N86)","v":0},{"$f":"S$62*12-SUM($Q86:R86)-SUMPRODUCT(--($C86:$N86<=S$62),S$62-$C86:$N86)","v":0},{"$f":"T$62*12-SUM($Q86:S86)-SUMPRODUCT(--($C86:$N86<=T$62),T$62-$C86:$N86)","v":0},{"$f":"U$62*12-SUM($Q86:T86)-SUMPRODUCT(--($C86:$N86<=U$62),U$62-$C86:$N86)","v":0},null,null,0,0,0,0,{"$f":"U$62-SUM($X86:AA86)-SUMPRODUCT(--($C86<=U$62),U$62-$C86)","v":0},null,0,0,0,0,{"$f":"U$62-SUM($AD86:AG86)-SUMPRODUCT(--($D86<=U$62),U$62-$D86)","v":0},null,0,0,0,0,{"$f":"U$62-SUM($AJ86:AM86)-SUMPRODUCT(--($E86<=U$62),U$62-$E86)","v":0},null,0,0,0,0,{"$f":"U$62-SUM($AP86:AS86)-SUMPRODUCT(--($F86<=U$62),U$62-$F86)","v":0}]
[null,"SPOKANE CLUB",null,null,null,null,null,null,null,null,null,null,null,null,0,null,0,{"$f":"R$62*12-SUM($Q87:Q87)-SUMPRODUCT(--($C87:$N87<=R$62),R$62-$C87:$N87)","v":0},{"$f":"S$62*12-SUM($Q87:R87)-SUMPRODUCT(--($C87:$N87<=S$62),S$62-$C87:$N87)","v":0},{"$f":"T$62*12-SUM($Q87:S87)-SUMPRODUCT(--($C87:$N87<=T$62),T$62-$C87:$N87)","v":0},{"$f":"U$62*12-SUM($Q87:T87)-SUMPRODUCT(--($C87:$N87<=U$62),U$62-$C87:$N87)","v":0},null,null,0,0,0,0,{"$f":"U$62-SUM($X87:AA87)-SUMPRODUCT(--($C87<=U$62),U$62-$C87)","v":0},null,0,0,0,0,{"$f":"U$62-SUM($AD87:AG87)-SUMPRODUCT(--($D87<=U$62),U$62-$D87)","v":0},null,0,0,0,0,{"$f":"U$62-SUM($AJ87:AM87)-SUMPRODUCT(--($E87<=U$62),U$62-$E87)","v":0},null,0,0,0,0,{"$f":"U$62-SUM($AP87:AS87)-SUMPRODUCT(--($F87<=U$62),U$62-$F87)","v":0}]
[null,"SPOKANE GALVANIZING INC",null,null,null,null,null,null,null,null,null,null,null,null,0,null,0,{"$f":"R$62*12-SUM($Q88:Q88)-SUMPRODUCT(--($C88:$N88<=R$62),R$62-$C88:$N88)","v":0},{"$f":"S$62*12-SUM($Q88:R88)-SUMPRODUCT(--($C88:$N88<=S$62),S$62-$C88:$N88)","v":0},{"$f":"T$62*12-SUM($Q88:S88)-SUMPRODUCT(--($C88:$N88<=T$62),T$62-$C88:$N88)","v":0},{"$f":"U$62*12-SUM($Q88:T88)-SUMPRODUCT(--($C88:$N88<=U$62),U$62-$C88:$N88)","v":0},null,null,0,0,0,0,{"$f":"U$62-SUM($X88:AA88)-SUMPRODUCT(--($C88<=U$62),U$62-$C88)","v":0},null,0,0,0,0,{"$f":"U$62-SUM($AD88:AG88)-SUMPRODUCT(--($D88<=U$62),U$62-$D88)","v":0},null,0,0,0,0,{"$f":"U$62-SUM($AJ88:AM88)-SUMPRODUCT(--($E88<=U$62),U$62-$E88)","v":0},null,0,0,0,0,{"$f":"U$62-SUM($AP88:AS88)-SUMPRODUCT(--($F88<=U$62),U$62-$F88)","v":0}]
[null,"TRI STATE MEMORIAL HOSPITAL",null,null,null,null,null,null,null,null,null,null,null,null,0,null,0,{"$f":"R$62*12-SUM($Q89:Q89)-SUMPRODUCT(--($C89:$N89<=R$62),R$62-$C89:$N89)","v":0},{"$f":"S$62*12-SUM($Q89:R89)-SUMPRODUCT(--($C89:$N89<=S$62),S$62-$C89:$N89)","v":0},{"$f":"T$62*12-SUM($Q89:S89)-SUMPRODUCT(--($C89:$N89<=T$62),T$62-$C89:$N89)","v":0},{"$f":"U$62*12-SUM($Q89:T89)-SUMPRODUCT(--($C89:$N89<=U$62),U$62-$C89:$N89)","v":0},null,null,0,0,0,0,{"$f":"U$62-SUM($X89:AA89)-SUMPRODUCT(--($C89<=U$62),U$62-$C89)","v":0},null,0,0,0,0,{"$f":"U$62-SUM($AD89:AG89)-SUMPRODUCT(--($D89<=U$62),U$62-$D89)","v":0},null,0,0,0,0,{"$f":"U$62-SUM($AJ89:AM89)-SUMPRODUCT(--($E89<=U$62),U$62-$E89)","v":0},null,0,0,0,0,{"$f":"U$62-SUM($AP89:AS89)-SUMPRODUCT(--($F89<=U$62),U$62-$F89)","v":0}]
[null,"WAGSTAFF INC",null,null,null,null,null,null,null,null,null,null,null,null,0,null,0,{"$f":"R$62*12-SUM($Q90:Q90)-SUMPRODUCT(--($C90:$N90<=R$62),R$62-$C90:$N90)","v":0},{"$f":"S$62*12-SUM($Q90:R90)-SUMPRODUCT(--($C90:$N90<=S$62),S$62-$C90:$N90)","v":0},{"$f":"T$62*12-SUM($Q90:S90)-SUMPRODUCT(--($C90:$N90<=T$62),T$62-$C90:$N90)","v":0},{"$f":"U$62*12-SUM($Q90:T90)-SUMPRODUCT(--($C90:$N90<=U$62),U$62-$C90:$N90)","v":0},null,null,0,0,0,0,{"$f":"U$62-SUM($X90:AA90)-SUMPRODUCT(--($C90<=U$62),U$62-$C90)","v":0},null,0,0,0,0,{"$f":"U$62-SUM($AD90:AG90)-SUMPRODUCT(--($D90<=U$62),U$62-$D90)","v":0},null,0,0,0,0,{"$f":"U$62-SUM($AJ90:AM90)-SUMPRODUCT(--($E90<=U$62),U$62-$E90)","v":0},null,0,0,0,0,{"$f":"U$62-SUM($AP90:AS90)-SUMPRODUCT(--($F90<=U$62),U$62-$F90)","v":0}]
[null,"WSU HOUSING",null,null,null,null,null,null,null,null,null,null,null,null,0,null,0,{"$f":"R$62*12-SUM($Q91:Q91)-SUMPRODUCT(--($C91:$N91<=R$62),R$62-$C91:$N91)","v":0},{"$f":"S$62*12-SUM($Q91:R91)-SUMPRODUCT(--($C91:$N91<=S$62),S$62-$C91:$N91)","v":0},{"$f":"T$62*12-SUM($Q91:S91)-SUMPRODUCT(--($C91:$N91<=T$62),T$62-$C91:$N91)","v":0},{"$f":"U$62*12-SUM($Q91:T91)-SUMPRODUCT(--($C91:$N91<=U$62),U$62-$C91:$N91)","v":0},null,null,0,0,0,0,{"$f":"U$62-SUM($X91:AA91)-SUMPRODUCT(--($C91<=U$62),U$62-$C91)","v":0},null,0,0,0,0,{"$f":"U$62-SUM($AD91:AG91)-SUMPRODUCT(--($D91<=U$62),U$62-$D91)","v":0},null,0,0,0,0,{"$f":"U$62-SUM($AJ91:AM91)-SUMPRODUCT(--($E91<=U$62),U$62-$E91)","v":0},null,0,0,0,0,{"$f":"U$62-SUM($AP91:AS91)-SUMPRODUCT(--($F91<=U$62),U$62-$F91)","v":0}]
[null,null,null,null,null,null,null,null,null,null,null,null,null,null,0,null,0,{"$f":"R$62*12-SUM($Q92:Q92)-SUMPRODUCT(--($C92:$N92<=R$62),R$62-$C92:$N92)","v":0},{"$f":"S$62*12-SUM($Q92:R92)-SUMPRODUCT(--($C92:$N92<=S$62),S$62-$C92:$N92)","v":0},{"$f":"T$62*12-SUM($Q92:S92)-SUMPRODUCT(--($C92:$N92<=T$62),T$62-$C92:$N92)","v":0},{"$f":"U$62*12-SUM($Q92:T92)-SUMPRODUCT(--($C92:$N92<=U$62),U$62-$C92:$N92)","v":0}]
[null,null,null,null,null,null,null,null,null,null,null,null,null,null,{"$f":"SUM(C93:N93)","v":0},null,0,{"$f":"R$62*12-SUM($Q93:Q93)-SUMPRODUCT(--($C93:$N93<=R$62),R$62-$C93:$N93)","v":0},{"$f":"S$62*12-SUM($Q93:R93)-SUMPRODUCT(--($C93:$N93<=S$62),S$62-$C93:$N93)","v":0},{"$f":"T$62*12-SUM($Q93:S93)-SUMPRODUCT(--($C93:$N93<=T$62),T$62-$C93:$N93)","v":0},{"$f":"U$62*12-SUM($Q93:T93)-SUMPRODUCT(--($C93:$N93<=U$62),U$62-$C93:$N93)","v":0}]
[null,"Total WA Sch 121/122",{"$f":"SUM(C64:C92)","v":0},{"$f":"SUM(D64:D93)","v":0},{"$f":"SUM(E64:E93)","v":0},{"$f":"SUM(F64:F93)","v":0},{"$f":"SUM(G64:G93)","v":0},{"$f":"SUM(H64:H93)","v":0},{"$f":"SUM(I64:I93)","v":0},0,0,0,0,0,{"$f":"IF(ROUND(SUM(O64:O93),3)<>ROUND(SUM(C94:N94),3),#VALUE!,SUM(C94:N94))","v":0},null,{"$f":"SUM(Q64:Q93)","v":0},{"$f":"SUM(R64:R93)","v":0},{"$f":"SUM(S64:S93)","v":0},{"$f":"SUM(T64:T93)","v":0},{"$f":"SUM(U64:U93)","v":0},null,null,{"$f":"SUM(X64:X93)","v":0},{"$f":"SUM(Y64:Y93)","v":0},0,0,0,null,{"$f":"SUM(AD64:AD93)","v":0},{"$f":"SUM(AE64:AE93)","v":0},{"$f":"SUM(AF64:AF93)","v":0},{"$f":"SUM(AG64:AG93)","v":0},{"$f":"SUM(AH64:AH93)","v":0},null,{"$f":"SUM(AJ64:AJ93)","v":0},{"$f":"SUM(AK64:AK93)","v":0},{"$f":"SUM(AL64:AL93)","v":0},{"$f":"SUM(AM64:AM93)","v":0},{"$f":"SUM(AN64:AN93)","v":0},null,{"$f":"SUM(AP64:AP93)","v":0},{"$f":"SUM(AQ64:AQ93)","v":0},{"$f":"SUM(AR64:AR93)","v":0},{"$f":"SUM(AS64:AS93)","v":0},{"$f":"SUM(AT64:AT93)","v":0}]
[null,null,null,null,null,null,null,null,null,null,null,null,null,null,null,null,null,null,null,null,{"$f":"SUM(Q94:U94)","v":0}]
[null,"Revenue Runs",{"$f":"'12MEDEC18'!D164","v":547570.59900000005},{"$f":"'12MEDEC18'!E164","v":455180.02499999997},{"$f":"'12MEDEC18'!F164","v":474318.03700000001},{"$f":"'12MEDEC18'!G164","v":397963.42600000004},{"$f":"'12MEDEC18'!H164","v":332257.02400000003},{"$f":"'12MEDEC18'!I164","v":303322.93700000003},{"$f":"'12MEDEC18'!J164","v":280882.29972999997},{"$f":"'12MEDEC18'!K164","v":293436.32699999999},{"$f":"'12MEDEC18'!L164","v":292153.11600000004},{"$f":"'12MEDEC18'!M164","v":342720.66100000002},{"$f":"'12MEDEC18'!N164","v":412245.14099999995},{"$f":"'12MEDEC18'!O164","v":-2363729.2920099623},{"$f":"SUM(C96:N96)","v":1768320.3007200374}]
[null,"Johanna Beverage Co",26922,27843,30552,31759,25318,28411,26106,0,20184,null,null,null,{"$f":"SUM(C97:N97)","v":217095},null,{"$f":"Q$62*12-SUMPRODUCT(--($C97:$N97<=Q$62),Q$62-$C97:$N97)","v":4000},{"$f":"R$62*12-SUM($Q97:Q97)-SUMPRODUCT(--($C97:$N97<=R$62),R$62-$C97:$N97)","v":4000},{"$f":"S$62*12-SUM($Q97:R97)-SUMPRODUCT(--($C97:$N97<=S$62),S$62-$C97:$N97)","v":72000},{"$f":"T$62*12-SUM($Q97:S97)-SUMPRODUCT(--($C97:$N97<=T$62),T$62-$C97:$N97)","v":115184},{"$f":"U$62*12-SUM($Q97:T97)-SUMPRODUCT(--($C97:$N97<=U$62),U$62-$C97:$N97)","v":21911}]
[null,null,null,null,null,null,null,null,null,null,null,null,null,null,{"$f":"SUM(C98:N98)","v":0},null,null,null,null,null,null,null,null,null,{"$f":"COUNT(O64:O91)","v":28}]
[null,null,null,null,null,null,null,null,null,null,null,null,null,null,0]
[null,"Total WA Sch 121/122",{"$f":"C96-SUM(C97:C99)","v":520648.59900000005},{"$f":"D96-SUM(D97:D99)","v":427337.02499999997},443766.03700000001,366204.42600000004,306939.02400000003,274911.93700000003,254776.29972999997,293436.32699999999,271969.11600000004,342720.66100000002,412245.14099999995,-2363729.2920099623,{"$f":"IF(ROUND(O96-SUM(O97:O99),3)<>ROUND(SUM(C100:N100),3),#VALUE!,SUM(C100:N100))","v":1551225.3007200374}]
[null,null,{"$f":"C94-C100","v":-520648.59900000005},-427337.02499999997,-443766.03700000001,-366204.42600000004,-306939.02400000003,-274911.93700000003,-254776.29972999997,-293436.32699999999,-271969.11600000004,{"$f":"L94-L100","v":-342720.66100000002},-412245.14099999995,2363729.2920099623,-1551225.3007200374]
[null,null,null,null,null,null,null,null,null,null,null,{"$f":"COUNT(L64:L91)","v":0},{"$f":"COUNT(M64:M91)","v":0},0]
[null,"ANNUAL USAGE, Sch 132",null,null,null,null,null,null,null,null,null,null,null,null,"12-mo ended",null,10000,25000,50000,99999999]
[null,"Washington",{"$f":"C4","v":"2018-01-01"},{"$f":"D4","v":"2018-02-01"},"2018-03-01","2018-04-01","2018-05-01","2018-06-01","2018-07-01","2018-08-01","2018-09-01","2018-10-01","2018-11-01","2018-12-01","Total",null,"thms/mo","thms/mo","thms/mo","thms/mo"]
[null,null,72359,48424,56958,43898,37416,15435,14115,11257,11438,17735,27417,51773,{"$f":"SUM(C105:N105)","v":408225},null,{"$f":"Q$103*12-SUMPRODUCT(--($C105:$N105<=Q$103),Q$103-$C105:$N105)","v":120000},{"$f":"R$103*12-SUM($Q105:Q105)-SUMPRODUCT(--($C105:$N105<=R$103),R$103-$C105:$N105)","v":124980},{"$f":"S$103*12-SUM($Q105:R105)-SUMPRODUCT(--($C105:$N105<=S$103),S$103-$C105:$N105)","v":132155},{"$f":"T$103*12-SUM($Q105:S105)-SUMPRODUCT(--($C105:$N105<=T$103),T$103-$C105:$N105)","v":31090}]
[null,null,66743,68904,56159,49321,35485,32035,27622,32258,33396,50959,61102,63058,{"$f":"SUM(C106:N106)","v":577042},null,{"$f":"Q$103*12-SUMPRODUCT(--($C106:$N106<=Q$103),Q$103-$C106:$N106)","v":120000},{"$f":"R$103*12-SUM($Q106:Q106)-SUMPRODUCT(--($C106:$N106<=R$103),R$103-$C106:$N106)","v":180000},{"$f":"S$103*12-SUM($Q106:R106)-SUMPRODUCT(--($C106:$N106<=S$103),S$103-$C106:$N106)","v":210117},{"$f":"T$103*12-SUM($Q106:S106)-SUMPRODUCT(--($C106:$N106<=T$103),T$103-$C106:$N106)","v":66925}]
[]
[null,null,{"$f":"SUM(C105:C107)","v":139102},{"$f":"SUM(D105:D107)","v":117328},113117,93219,72901,47470,41737,43515,44834,68694,88519,114831,{"$f":"IF(ROUND(SUM(O105:O107),3)<>ROUND(SUM(C108:N108),3),#VALUE!,SUM(C108:N108))","v":985267},null,{"$f":"SUM(Q105:Q107)","v":240000},{"$f":"SUM(R105:R107)","v":304980},{"$f":"SUM(S105:S107)","v":342272},{"$f":"SUM(T105:T107)","v":98015}]
[]
[null,"Revenue Runs",{"$f":"'12MEDEC18'!D165","v":139102.27900000001},{"$f":"'12MEDEC18'!E165","v":117327.56},{"$f":"'12MEDEC18'!F165","v":113117.076},{"$f":"'12MEDEC18'!G165","v":93219.127999999997},{"$f":"'12MEDEC18'!H165","v":72900.841},{"$f":"'12MEDEC18'!I165","v":47469.584999999992},{"$f":"'12MEDEC18'!J165","v":41737.258000000002},{"$f":"'12MEDEC18'!K165","v":43515.435999999994},{"$f":"'12MEDEC18'!L165","v":44833.752},{"$f":"'12MEDEC18'!M165","v":68693.988999999987},{"$f":"'12MEDEC18'!N165","v":88518.618999999992},{"$f":"'12MEDEC18'!O165","v":114831.204},{"$f":"SUM(C110:N110)","v":985266.72699999996}]
[null,"SPOKANE COUNTY COURTHOUSE (122 to 132)",0,0,0,0,0,null,null,null,null,null,null,null,{"$f":"SUM(C111:N111)","v":0}]
[null,"     Total WA Sch 132",{"$f":"SUM(C110:C111)","v":139102.27900000001},{"$f":"SUM(D110:D111)","v":117327.56},113117.076,93219.127999999997,72900.841,47469.584999999992,41737.258000000002,43515.435999999994,44833.752,68693.988999999987,88518.618999999992,114831.204,985266.72699999996,null,null,null,null,{"$f":"SUM(Q108:T108)","v":985267}]
[null,null,{"$f":"C108-C112","v":-0.27900000000954606},{"$f":"D108-D112","v":0.44000000000232831},-7.6000000000931323E-2,-0.1279999999969732,0.15899999999965075,0.41500000000814907,-0.25800000000162981,-0.43599999999423744,0.24799999999959255,1.1000000013154931E-2,{"$f":"M108-M112","v":0.38100000000849832},-0.20399999999790452,0.27300000004470348]
[null,"ANNUAL USAGE, Sch 148",null,null,null,null,null,null,null,null,null,null,null,null,"12-mo ended"]
[null,"Washington",{"$f":"C4","v":"2018-01-01"},{"$f":"D4","v":"2018-02-01"},"2018-03-01","2018-04-01","2018-05-01","2018-06-01","2018-07-01","2018-08-01","2018-09-01","2018-10-01","2018-11-01","2018-12-01","Total"]
[null,null,2263003,2323468,2069022,2145109,1947509,1988089,1901441,1894548,1929184,1920478,1974243,2176024,{"$f":"SUM(C116:N116)","v":24532118}]
[null,null,500013,552172,461294,337409,485342,532181,556951,565213,536353,554306,607830,548144,{"$f":"SUM(C117:N117)","v":6237208}]
[null,null,194662,187274,172931,139365,170191,185361,177692,168237,164761,168526,180639,180886,{"$f":"SUM(C118:N118)","v":2090525}]
[null,null,509509,567802,459179,506796,433132,406894,449872,500550,448257,421795,485250,463727,{"$f":"SUM(C119:N119)","v":5652763}]
[null,null,1515959,1242619,1250208,1118302,889368,577568,525822,442848,455422,632550,863885,1084907,{"$f":"SUM(C120:N120)","v":10599458}]
[]
[null,"Total WA Sch 148",{"$f":"SUM(C116:C121)","v":4983146},4873335,4412634,4246981,3925542,3690093,3611778,3571396,3533977,3697655,4111847,4453688,{"$f":"IF(ROUND(SUM(O116:O121),3)<>ROUND(SUM(C122:N122),3),#VALUE!,SUM(C122:N122))","v":49112072}]
[]
[null,"Revenue Runs",{"$f":"'12MEDEC18'!D168","v":4983146},{"$f":"'12MEDEC18'!E168","v":4873335},{"$f":"'12MEDEC18'!F168","v":4412634},{"$f":"'12MEDEC18'!G168","v":4246981},{"$f":"'12MEDEC18'!H168","v":3925542},{"$f":"'12MEDEC18'!I168","v":3690093},{"$f":"'12MEDEC18'!J168","v":3611778},{"$f":"'12MEDEC18'!K168","v":3571396},{"$f":"'12MEDEC18'!L168","v":3533977},{"$f":"'12MEDEC18'!M168","v":3697655},{"$f":"'12MEDEC18'!N168","v":4111847},{"$f":"'12MEDEC18'!O168","v":4453688},{"$f":"SUM(C124:N124)","v":49112072}]
[null,null,{"$f":"C122-C124","v":0},{"$f":"D122-D124","v":0},0,0,0,0,0,0,0,0,0,0,0]
[]
[null,"ANNUAL USAGE, Sch 147",null,null,null,null,null,null,null,null,null,null,null,null,"12-mo ended"]
[null,"Washington",{"$f":"C4","v":"2018-01-01"},{"$f":"D4","v":"2018-02-01"},"2018-03-01","2018-04-01","2018-05-01","2018-06-01","2018-07-01","2018-08-01","2018-09-01","2018-10-01","2018-11-01","2018-12-01","Total"]
[null,null,253287,37658,115812,46787,72960,231323,115510,739213,774467,562471,1000573,493719,{"$f":"SUM(C129:N129)","v":4443780}]
[null,null,{"$f":"19515+9275","v":28790},1515,{"$f":"15220+3381","v":18601},{"$f":"7642+48","v":7690},{"$f":"23296+21","v":23317},9105,{"$f":"8173+20770","v":28943},{"$f":"222649+5380","v":228029},{"$f":"254269+14","v":254283},{"$f":"133285+31","v":133316},{"$f":"61410+22","v":61432},{"$f":"160428+6304","v":166732},{"$f":"SUM(C130:N130)","v":961753}]
[]
[null,"Total WA Sch 147",{"$f":"SUM(C129:C131)","v":282077},39173,{"$f":"SUM(E129:E131)","v":134413},54477,96277,240428,144453,967242,1028750,695787,1062005,660451,{"$f":"IF(ROUND(SUM(O129:O131),3)<>ROUND(SUM(C132:N132),3),#VALUE!,SUM(C132:N132))","v":5405533}]
[]
[null,"Revenue Runs",{"$f":"'12MEDEC18'!D167","v":282077},{"$f":"'12MEDEC18'!E167","v":39173},{"$f":"'12MEDEC18'!F167","v":134413},{"$f":"'12MEDEC18'!G167","v":54477},{"$f":"'12MEDEC18'!H167","v":96277},{"$f":"'12MEDEC18'!I167","v":240428},{"$f":"'12MEDEC18'!J167","v":144453},{"$f":"'12MEDEC18'!K167","v":967242},{"$f":"'12MEDEC18'!L167","v":1028750},{"$f":"'12MEDEC18'!M167","v":695787},{"$f":"'12MEDEC18'!N167","v":1062005},{"$f":"'12MEDEC18'!O167","v":660451},{"$f":"SUM(C134:N134)","v":5405533}]
[null,null,{"$f":"C132-C134","v":0},0,0,0,0,0,0,0,0,0,0,0,0]
[]
[null,"Sch 147 Revenue from Rev. Runs",5898,819,2811,1139,2013,5027,3021,20225,21511,14549,22207,13810,{"$f":"SUM(C137:N137)","v":113030}]
[null,"check",{"$f":"C132*0.02091","v":5898.2300700000005},{"$f":"D132*0.02091","v":819.10743000000002},2810.5758300000002,1139.1140700000001,2013.1520700000001,5027.3494800000008,3020.5122300000003,20225.030220000001,21511.162500000002,14548.90617,{"$f":"M132*0.02091","v":22206.524550000002},13810.030410000001,{"$f":"SUM(C138:N138)","v":113029.69503000002}]

{"sheet":"12MEDEC18","index":11,"n_rows":214,"n_cols":18,"rows_kept":214,"cut":false,"hidden":false,"merged":[]}
[]
[]
["Gas Revenue Meters Report by Location  Twelve Months Ended  for Report Date : '12/31/2018'"]
[]
["State Cde:WA"]
[]
[null,null,"Meters"]
[null,"Period",201801,201802,201803,201804,201805,201806,201807,201808,201809,201810,201811,201812,"12 Month Average","12 Month Total"]
["Rate Schedule Num"]
["0101",null,160426,160194,161042,160754,161195,161073,161417,161730,160225,164438,163219,163683,{"$f":"AVERAGE(C10:N10)","v":161616.33333333334},{"$f":"SUM(C10:N10)","v":1939396}]
["0102",null,185,184,186,181,176,174,171,170,170,168,167,167,{"$f":"AVERAGE(C11:N11)","v":174.91666666666666},{"$f":"SUM(C11:N11)","v":2099},null,{"$f":"N10+N11","v":163850}]
["0111",null,2999,3013,3073,3062,3042,3065,3054,3045,2975,3121,3054,{"$f":"3716-'121 to 111'!T35","v":3325},3069,36828]
["0112",null,1,1,1,1,1,1,1,1,1,1,1,1,1,12,null,{"$f":"N12+N13-211","v":3115}]
["0121",null,22,22,22,22,22,22,22,23,19,24,22,{"$f":"-608+'121 to 111'!T35+8","v":-209},2.75,33]
["0122",null,1,1,1,1,1,1,1,1,1,1,1,1,1,12,null,{"$f":"N15+N14+211","v":3}]
["0132",null,2,2,2,2,2,2,2,2,2,2,2,2,2,24,null,{"$f":"N16","v":2}]
["0146",null,41,41,41,41,41,41,41,41,41,38,40,39,40.5,486]
["0147",null,3,2,3,3,3,2,3,3,3,3,3,3,2.8333333333333335,34]
["0148",null,5,5,5,5,5,5,5,5,5,5,5,5,5,60,null,{"$f":"N19+N18+N17","v":47}]
["0158",null,0,0,0,0,0,0,0,0,0,0,0,0,0,0]
["0158A",null,0,0,0,0,0,0,0,0,0,0,0,0,0,0]
["0199",null,0,0,0,0,0,0,0,0,0,0,0,0,0,0]
["Total for WA",null,{"$f":"SUM(C10:C22)","v":163685},{"$f":"SUM(D10:D22)","v":163465},164376,164072,164488,164386,164717,165021,163442,167801,166514,167017,null,{"$f":"SUM(C23:N23)","v":1978984}]
[]
[null,null,null,null,null,null,null,null,null,null,null,null,null,null,"Total","Avg"]
[null,"101/102",{"$f":"C10+C11","v":160611},{"$f":"D10+D11","v":160378},161228,160935,161371,161247,161588,161900,160395,164606,163386,163850,{"$f":"SUM(C26:N26)","v":1941495},{"$f":"AVERAGE(C26:N26)","v":161791.25}]
[null,"111/112",{"$f":"C12+C13","v":3000},{"$f":"D12+D13","v":3014},3074,3063,3043,3066,3055,3046,2976,3122,3055,3326,{"$f":"SUM(C27:N27)","v":36840},{"$f":"AVERAGE(C27:N27)","v":3070}]
[null,"121/122",{"$f":"C14+C15","v":23},{"$f":"D14+D15","v":23},23,23,23,23,23,24,20,25,23,-208,45,3.75]
[null,132,{"$f":"C16","v":2},{"$f":"D16","v":2},2,2,2,2,2,2,2,2,2,2,24,2]
[null,146,{"$f":"C17","v":41},{"$f":"D17","v":41},41,41,41,41,41,41,41,38,40,39,486,40.5]
[null,147,{"$f":"C18","v":3},{"$f":"D18","v":2},3,3,3,2,3,3,3,3,3,3,34,2.8333333333333335]
[null,148,{"$f":"C19","v":5},{"$f":"D19","v":5},5,5,5,5,5,5,5,5,5,5,60,5]
[null,"Total",{"$f":"SUM(C26:C32)","v":163685},{"$f":"SUM(D26:D32)","v":163465},164376,164072,164488,164386,164717,165021,163442,167801,166514,167017,1978984]
[]
[null,null,{"$f":"C23-C33","v":0},{"$f":"D23-D33","v":0},0,0,0,0,0,0,0,0,0,0]
[]
["Gas Revenue Meters Report by Location  Twelve Months Ended  for Report Date : '12/31/2018'  "]
[]
["State Cde:WA"]
[]
[null,null,null,"Usage"]
[null,null,"Period",201801,201802,201803,201804,201805,201806,201807,201808,201809,201810,201811,201812,"12 Month Total"]
["Rate Schedule Num","Billing Determinant"]
["0101","BASIC CHARGE GAS",null,0,0,0,0,0,0,0,0,0,0,0,0,{"$f":"SUM(D44:O44)","v":0}]
[null,"NA",null,0,0,0,0,0,0,0,0,0,0,0,0,0]
[null,"RIDER 150",null,0,0,0,0,0,0,0,0,0,-60,-76,-793,{"$f":"SUM(D46:O46)","v":-929}]
[null,"RIDER 155",null,0,0,0,0,0,0,0,0,0,0,0,0,0]
[null,"RIDER 156",null,0,0,0,0,0,0,0,0,0,0,0,0,0]
[null,"RIDER 159",null,0,0,0,0,0,0,0,0,0,0,0,0,0]
[null,"RIDER 175",null,null,null,null,null,null,null,null,null,null,0,0,0,0]
[null,"RIDER 191",null,0,0,0,0,0,0,0,0,0,0,0,0,0]
[null,"RIDER 192",null,0,0,0,0,0,0,0,0,0,0,0,0,0]
[null,"RIDER 197",null,null,null,null,null,null,null,null,null,null,0,0,0,0]
[null,"THERMS BLOCK 1",null,10511482.62308,10049624.60839,10243312.527489999,9176707.0646199994,5505649.1254599998,2693969.4138500001,2253001.4621000001,1948689.3013599999,2249107.1272900002,4816783.3785600001,8240250.7399800001,10351024.27854,{"$f":"SUM(D54:O54)","v":78039601.65072}]
[null,"THERMS BLOCK 2",null,13368593.30824,7338796.2040400002,8507127.0372899994,3621992.3377700001,608026.02044999995,191623.98951000001,188173.66170999999,135167.25104999999,190638.63987000001,472390.70867000002,2590409.4317700001,8575589.0742899999,{"$f":"SUM(D55:O55)","v":45788527.664660007}]
[null,"Total for 0101",null,{"$f":"SUM(D44:D55)","v":23880075.93132},{"$f":"SUM(E44:E55)","v":17388420.812430002},18750439.564779997,12798699.402389999,6113675.1459099995,2885593.4033600003,2441175.1238100003,2083856.55241,2439745.7671600003,5289114.0872299997,10830584.17175,18925820.35283,{"$f":"SUM(D56:O56)","v":123827200.31537998}]
["0102","BASIC CHARGE GAS",null,0,0,0,0,0,0,0,0,0,0,0,0,{"$f":"SUM(D57:O57)","v":0}]
[null,"NA",null,0,0,0,0,0,0,0,0,0,0,0,0,0]
[null,"RIDER 150",null,0,0,0,0,0,0,0,0,0,0,0,0,0]
[null,"RIDER 155",null,0,0,0,0,0,0,0,0,0,0,0,0,0]
[null,"RIDER 156",null,0,0,0,0,0,0,0,0,0,0,0,0,0]
[null,"RIDER 159",null,0,0,0,0,0,0,0,0,0,0,0,0,0]
[null,"RIDER 175",null,null,null,null,null,null,null,null,null,null,null,0,0,0]
[null,"RIDER 189",null,0,0,0,0,0,0,0,0,0,0,0,0,0]
[null,"RIDER 191",null,0,0,0,0,0,0,0,0,0,0,0,0,0]
[null,"RIDER 192",null,0,0,0,0,0,0,0,0,0,0,0,0,0]
[null,"THERMS BLOCK 1",null,12749.866,12067.186,12466.224,11391.098029999999,6809.5044399999997,2937.3789700000002,2271.8530000000001,1786.32419,2305.5538900000001,5760.7520000000004,9703.7005399999998,11231.50662,91480.947679999997]
[null,"THERMS BLOCK 2",null,14655.608,7980.8459999999995,9773.1669999999995,3940.7950000000001,760.255,187.36099999999999,285.23,165.15,116.518,464.10500000000002,2387.6030599999999,8944.1890899999999,49660.827149999997]
[null,"Total for 0102",null,{"$f":"SUM(D57:D68)","v":27405.474000000002},{"$f":"SUM(E57:E68)","v":20048.031999999999},22239.391,15331.893029999999,7569.7594399999998,3124.7399700000001,2557.0830000000001,1951.4741900000001,2422.0718900000002,6224.857,12091.303599999999,20175.69571,{"$f":"SUM(D69:O69)","v":141141.77483000001}]
["0111","BASIC CHARGE GAS",null,0,0,0,0,0,0,0,0,0,0,0,0,{"$f":"SUM(D70:O70)","v":0}]
[null,"NA",null,0,0,0,0,0,0,0,0,0,0,0,0,{"$f":"SUM(D71:O71)","v":0}]
[null,"RIDER 150",null,0,0,0,0,0,0,0,0,0,0,0,-241,-241]
[null,"RIDER 155",null,0,0,0,0,0,0,0,0,0,0,0,0,0]
[null,"RIDER 156",null,0,0,0,0,0,0,0,0,0,0,0,0,0]
[null,"RIDER 175",null,null,null,null,null,null,null,null,null,null,0,0,0,0]
[null,"RIDER 191",null,0,0,0,0,0,0,0,0,0,0,0,0,0]
[null,"RIDER 192",null,0,0,0,0,0,0,0,0,0,0,0,0,0]
[null,"THERMS BLOCK 1",null,589934.13208000001,590810.42694000003,603524.18038000003,598823.42938999995,554355.24927999999,457385.41934000002,406432.06326999998,369191.69267000002,401055.14079999999,544518.68382000003,589843.81619000004,{"$f":"729831.33662-'121 to 111'!R26","v":651631.33661999996},6357505.5707799997]
[null,"THERMS BLOCK 2",null,2084775.2813500001,1987647.6339,2037283.4333800001,1803319.13485,1207255.9927099999,735033.10869000002,625181.92593999999,560486.23004000005,636511.38428,1024196.78307,1602247.2423700001,{"$f":"2530797.93761-'121 to 111'!S26","v":2217997.9376099999},16521936.088190001]
[null,"THERMS BLOCK 3",null,5325802.2349800002,3964960.8490300002,4143033.33005,2753191.9021299998,1378027.18099,698319.80547000002,544971.01361999998,516705.80326000002,569053.90060000005,985638.28654999996,2122581.5898899999,{"$f":"10889850.43692-'121 to 111'!T26","v":6624153.7486400008},29626439.645210002]
[null,"Total for 0111",null,{"$f":"SUM(D70:D80)","v":8000511.6484099999},{"$f":"SUM(E70:E80)","v":6543418.9098700006},6783840.9438100001,5155334.4663699996,3139638.4229800003,1890738.3335000002,1576585.0028300001,1446383.72597,1606620.4256800001,2554353.7534400001,4314672.6484500002,9493542.0228700005,52505640.304179996]
["0112","BASIC CHARGE GAS",null,0,0,0,0,0,0,0,0,0,0,0,0,{"$f":"SUM(D82:O82)","v":0}]
[null,"NA",null,0,0,0,0,0,0,0,0,0,0,0,0,{"$f":"SUM(D83:O83)","v":0}]
[null,"RIDER 150",null,0,0,0,0,0,0,0,0,0,0,0,0,0]
[null,"RIDER 155",null,0,0,0,0,0,0,0,0,0,0,0,0,0]
[null,"RIDER 156",null,0,0,0,0,0,0,0,0,0,0,0,0,0]
[null,"RIDER 175",null,null,null,null,null,null,null,null,null,null,0,0,0,0]
[null,"RIDER 191",null,0,0,0,0,0,0,0,0,0,0,0,0,0]
[null,"RIDER 192",null,0,0,0,0,0,0,0,0,0,0,0,0,0]
[null,"THERMS BLOCK 1",null,200,200,200,200,200,200,200,200,200,200,200,200,2400]
[null,"THERMS BLOCK 2",null,800,800,800,800,800,800,800,800,800,800,800,800,9600]
[null,"THERMS BLOCK 3",null,16696.583999999999,16941.822,12354.004999999999,10289.879999999999,4892.768,4577.3599999999997,3704.0810000000001,3652.5619999999999,6056.8819999999996,8923.3799999999992,16155.088,16027.964,120272.37600000002]
[null,"Total for 0112",null,{"$f":"SUM(D82:D92)","v":17696.583999999999},{"$f":"SUM(E82:E92)","v":17941.822},{"$f":"SUM(F82:F92)","v":13354.004999999999},{"$f":"SUM(G82:G92)","v":11289.88},{"$f":"SUM(H82:H92)","v":5892.768},{"$f":"SUM(I82:I92)","v":5577.36},{"$f":"SUM(J82:J92)","v":4704.0810000000001},{"$f":"SUM(K82:K92)","v":4652.5619999999999},{"$f":"SUM(L82:L92)","v":7056.8819999999996},{"$f":"SUM(M82:M92)","v":9923.3799999999992},{"$f":"SUM(N82:N92)","v":17155.088},{"$f":"SUM(O82:O92)","v":17027.964},132272.37600000002]
["0121","BASIC CHARGE GAS",null,null,null,null,null,null,null,null,null,0,0,0,0,{"$f":"SUM(D94:O94)","v":0}]
[null,"NA",null,0,0,0,0,0,0,0,0,0,0,0,0,{"$f":"SUM(D95:O95)","v":0}]
[null,"RIDER 150",null,0,0,0,0,0,0,0,0,0,0,0,0,0]
[null,"RIDER 155",null,0,0,0,0,0,0,0,0,0,0,0,0,0]
[null,"RIDER 156",null,0,0,0,0,0,0,0,0,0,0,0,0,0]
[null,"RIDER 175",null,null,null,null,null,null,null,null,null,null,null,0,0,0]
[null,"RIDER 191",null,0,0,0,0,0,0,0,0,0,0,0,0,0]
[null,"RIDER 192",null,0,0,0,0,0,0,0,0,0,0,0,0,0]
[null,"THERMS BLOCK 1",null,11000,11000,11000,11000,11000,11000,11050,11500,9500,12000,11000,{"$f":"-302285.10833+'121 to 111'!R33+181235","v":-104550.10833000002},16499.891669999983]
[null,"THERMS BLOCK 2",null,11000,11000,11000,11000,10879.079,10715.103999999999,10766.876,11144.273999999999,9500,11841.027,11000,{"$f":"-300329.69334+'121 to 111'!S33+180483","v":-103346.69334},16499.666660000003]
[null,"THERMS BLOCK 3",null,194386.443,189441.93900000001,194480.45800000001,182875.011,176869.25200000001,166428.223,160184.98431999999,161892.52499999999,151240.04500000001,183242.52900000001,187830.56899999999,{"$f":"-4736100.755+'121 to 111'!T33+2787229","v":-1657907.7280000001},290964.25031999964]
[null,"THERMS BLOCK 4",null,169426.15900000001,126925.306,141602.019,98584.650999999998,87398.334000000003,62470.241999999998,55080.647409999998,63258.228999999999,61319.764999999999,72527.107000000004,98532.716,{"$f":"-1813880.40134+'121 to 111'!U33+776755","v":-634986.62933999998},402138.54607000004]
[null,"THERMS BLOCK 5",null,96463.384999999995,67986.991999999998,64588.205000000002,48065.684000000001,6598.7,24255.81,19810.513999999999,22671.181,35739.872000000003,37314.25,72413.203999999998,{"$f":"79049.718+'121 to 111'!V33-574958","v":83940.67800003814},579848.47500003816]
[null,"Total for 0121",null,{"$f":"SUM(D95:D106)","v":482275.98700000002},{"$f":"SUM(E95:E106)","v":406354.23699999996},422670.68200000003,351525.34600000002,292745.36500000005,274869.37900000002,256893.02172999998,270466.20899999997,267299.68200000003,316924.913,380776.48899999994,-2416850.481009962,1305950.829720038]
["0122","BASIC CHARGE GAS",null,null,null,null,null,null,null,null,null,null,null,0,0,{"$f":"SUM(D108:O108)","v":0}]
[null,"NA",null,0,0,0,0,0,0,0,0,0,0,0,0,{"$f":"SUM(D109:O109)","v":0}]
[null,"RIDER 150",null,0,0,0,0,0,0,0,0,0,0,0,0,0]
[null,"RIDER 155",null,0,0,0,0,0,0,0,0,0,0,0,0,0]
[null,"RIDER 156",null,0,0,0,0,0,0,0,0,0,0,0,0,0]
[null,"RIDER 175",null,null,null,null,null,null,null,null,null,null,null,0,0,0]
[null,"RIDER 191",null,0,0,0,0,0,0,0,0,0,0,0,0,0]
[null,"RIDER 192",null,0,0,0,0,0,0,0,0,0,0,0,0,0]
[null,"THERMS BLOCK 1",null,500,500,500,500,500,500,500,500,500,500,500,500,6000]
[null,"THERMS BLOCK 2",null,500,500,500,500,500,500,500,500,500,500,500,500,6000]
[null,"THERMS BLOCK 3",null,9000,9000,9000,9000,9000,9000,9000,9000,9000,9000,9000,9000,108000]
[null,"THERMS BLOCK 4",null,15000,15000,15000,15000,15000,15000,13989.278,12970.118,14853.433999999999,15000,15000,15000,176812.83000000002]
[null,"THERMS BLOCK 5",null,40294.612000000001,23825.788,26647.355,21438.080000000002,14511.659,3453.558,0,0,0,795.74800000000005,6468.652,28121.188999999998,165556.641]
[null,"Total for 0122",null,{"$f":"SUM(D109:D120)","v":65294.612000000001},{"$f":"SUM(E109:E120)","v":48825.788},51647.354999999996,46438.080000000002,39511.659,28453.558000000001,23989.277999999998,22970.118000000002,24853.434000000001,25795.748,31468.652000000002,53121.188999999998,462369.47100000002]
["0132","NA",null,0,0,0,0,0,0,0,0,0,0,0,0,{"$f":"SUM(D122:O122)","v":0}]
[null,"RIDER 150",null,0,0,0,0,0,0,0,0,0,0,0,0,{"$f":"SUM(D123:O123)","v":0}]
[null,"RIDER 155",null,0,0,0,0,0,0,0,0,0,0,0,0,0]
[null,"RIDER 156",null,0,0,0,0,0,0,0,0,0,0,0,0,0]
[null,"RIDER 175",null,null,null,null,null,null,null,null,null,null,null,0,0,0]
[null,"RIDER 191",null,0,0,0,0,0,0,0,0,0,0,0,0,0]
[null,"RIDER 192",null,0,0,0,0,0,0,0,0,0,0,0,0,0]
[null,"THERMS BLOCK 1",null,20000,20000,20000,20000,20000,20000,20000,20000,20000,20000,20000,20000,240000]
[null,"THERMS BLOCK 2",null,30000,30000,30000,30000,30000,20435.105,19114.88,16257.2,16438.28,22735.305,30000,30000,304980.77]
[null,"THERMS BLOCK 3",null,50000,48424.267999999996,50000,43219.127999999997,22900.841,7034.48,2622.3780000000002,7258.2359999999999,8395.4719999999998,25000,27417.124,50000,342271.92699999997]
[null,"THERMS BLOCK 4",null,39102.279000000002,18903.292000000001,13117.075999999999,0,0,0,0,0,0,958.68399999999997,11101.495000000001,14831.204,98014.029999999984]
[null,"Total for 0132",null,{"$f":"SUM(D122:D132)","v":139102.27900000001},{"$f":"SUM(E122:E132)","v":117327.56},113117.076,93219.127999999997,72900.841,47469.584999999992,41737.258000000002,43515.435999999994,44833.752,68693.988999999987,88518.618999999992,114831.204,985266.72699999996]
["0146","BASIC CHARGE GAS",null,0,0,0,0,0,0,0,0,0,0,0,0,{"$f":"SUM(D134:O134)","v":0}]
[null,"NA",null,0,0,0,0,0,0,0,0,0,0,0,0,{"$f":"SUM(D135:O135)","v":0}]
[null,"RIDER 150",null,0,0,0,0,0,0,0,0,0,0,0,0,0]
[null,"RIDER 155",null,0,0,0,0,0,0,0,0,0,0,0,0,0]
[null,"RIDER 192",null,0,0,0,0,0,0,0,0,0,0,0,0,0]
[null,"THERMS BLOCK 1",null,716552,717187,730599,718707,778453,726518,738197,656861,656123,763565,753438,729937,8686137]
[null,"THERMS BLOCK 2",null,876125,857160,833085,822080,723037,574649,550748,472503,508303,590157,777279,846200,8431326]
[null,"THERMS BLOCK 3",null,1684151,1598827,1582577,1472205,1177500,843087,810228,702496,734954,729143,1131448,1377878,13844494]
[null,"THERMS BLOCK 4",null,383027,281285,259891,200000,200000,200000,200000,200000,200000,200000,200000,222385,2746588]
[null,"THERMS BLOCK 5",null,307830,175163,161036,136142,152753,155801,117696,168344,176555,57678,205742,84651,1899391]
[null,"Total for 0146",null,{"$f":"SUM(D134:D143)","v":3967685},{"$f":"SUM(E134:E143)","v":3629622},3567188,3349134,3031743,2500055,2416869,2200204,2275935,2340543,3067907,3261051,35607936]
["0147","NA",null,0,0,0,0,0,0,0,0,0,0,0,0,0]
[null,"THERMS BLOCK 1",null,282077,39173,134413,54477,96277,240428,144453,967242,1028750,695787,1062005,660451,{"$f":"SUM(D146:O146)","v":5405533}]
[null,"Total for 0147",null,{"$f":"SUM(D145:D146)","v":282077},{"$f":"SUM(E145:E146)","v":39173},134413,54477,96277,240428,144453,967242,1028750,695787,1062005,660451,5405533]
["0148","BASIC CHARGE GAS",null,0,0,0,0,0,0,0,0,0,0,0,0,{"$f":"SUM(D148:O148)","v":0}]
[null,"NA",null,0,0,0,0,0,0,0,0,0,0,0,0,{"$f":"SUM(D149:O149)","v":0}]
[null,"THERMS BLOCK 1",null,4983146,4873335,4412634,4246981,3925542,3690093,3611778,3571396,3533977,3697655,4111847,4453688,49112072]
[null,"Total for 0148",null,{"$f":"SUM(D148:D150)","v":4983146},{"$f":"SUM(E148:E150)","v":4873335},4412634,4246981,3925542,3690093,3611778,3571396,3533977,3697655,4111847,4453688,49112072]
["0158","NA",null,0,0,0,0,0,0,0,0,0,0,0,0,0]
[null,"RIDER 158",null,0,0,0,0,0,0,0,0,0,0,0,0,0]
[null,"Total for 0158",null,0,0,0,0,0,0,0,0,0,0,0,0,0]
["0158A","RIDER 158",null,0,0,0,0,0,0,0,0,0,0,0,0,0]
[null,"Total for 0158A",null,0,0,0,0,0,0,0,0,0,0,0,0,0]
["0199","NA",null,0,0,0,0,0,0,0,0,0,0,0,0,0]
[null,"Total for 0199",null,0,0,0,0,0,0,0,0,0,0,0,0,0]
["Total for WA",null,null,{"$f":"D56+D69+D81+D93+D107+D121+D133+D144+D147+D151","v":41845270.515729994},{"$f":"E56+E69+E81+E93+E107+E121+E133+E144+E147+E151","v":33084467.161300004},34271544.017590001,26122430.195789997,16725495.961329998,11566402.358830001,10520740.848370001,10612638.077569999,11231494.014730001,15005015.727669999,23917025.971799999,34582857.947400041,269485382.79811001]
[]
["Total Usage",null,null,201801,201802,201803,201804,201805,201806,201807,201808,201809,201810,201811,201812,"12 Month Total"]
[null,null,"101/102",{"$f":"D56+D69","v":23907481.40532},17408468.844430003,18772678.955779996,12814031.29542,6121244.9053499997,2888718.1433300003,2443732.2068100004,2085808.0266,2442167.8390500001,5295338.9442299996,10842675.47535,18945996.04854,123968342.09020998]
[null,null,"111/112",{"$f":"D81+D93","v":8018208.2324099997},{"$f":"E81+E93","v":6561360.7318700003},6797194.94881,5166624.3463699995,3145531.1909800004,1896315.6935000003,1581289.0838300001,1451036.2879699999,1613677.3076800001,2564277.13344,4331827.7364500007,9510569.9868700001,52637912.680179998]
[null,null,"121/122",{"$f":"D107+D121","v":547570.59900000005},{"$f":"E107+E121","v":455180.02499999997},474318.03700000001,397963.42600000004,332257.02400000003,303322.93700000003,280882.29972999997,293436.32699999999,292153.11600000004,342720.66100000002,412245.14099999995,-2363729.2920099623,1768320.3007200379]
[null,null,132,{"$f":"D133","v":139102.27900000001},{"$f":"E133","v":117327.56},113117.076,93219.127999999997,72900.841,47469.584999999992,41737.258000000002,43515.435999999994,44833.752,68693.988999999987,88518.618999999992,114831.204,985266.72699999996]
[null,null,146,{"$f":"D144","v":3967685},{"$f":"E144","v":3629622},3567188,3349134,3031743,2500055,2416869,2200204,2275935,2340543,3067907,3261051,35607936]
[null,null,147,{"$f":"D147","v":282077},{"$f":"E147","v":39173},134413,54477,96277,240428,144453,967242,1028750,695787,1062005,660451,5405533]
[null,null,148,{"$f":"D151","v":4983146},{"$f":"E151","v":4873335},4412634,4246981,3925542,3690093,3611778,3571396,3533977,3697655,4111847,4453688,49112072]
[null,null,"Total",{"$f":"SUM(D162:D168)","v":41845270.515729994},{"$f":"SUM(E162:E168)","v":33084467.1613},34271544.017590001,26122430.195789997,16725495.96133,11566402.358830001,10520740.848370001,10612638.077570001,11231494.014730001,15005015.727669999,23917025.971800003,34582857.947400041,269485382.79811001]
[]
[null,null,null,{"$f":"D159-D169","v":0},{"$f":"E159-E169","v":0},0,0,0,0,0,0,0,0,0,0,0]
[]
[]
[]
["Gas Revenue Usage Report by Location Twelve Months Ended for Report Date : '12/31/2018'"]
[]
["Revenue Class:<All>","Jurisdiction:WA"]
[]
[null,null,null,"Unbilled Usage"]
[null,null,"Period",201801,201802,201803,201804,201805,201806,201807,201808,201809,201810,201811,201812,"12 Month Total"]
["Source Id","Rate Schedule Num"]
["REVUNBL-G","101",null,9629638,10422050,7439883,4397502,1567310,1312050,1164748,1295014,1933114,5038482,9771651,11417514,{"$f":"SUM(D182:O182)","v":65388956}]
[null,"111",null,3107754,3767306,2589731,1701302,772170,804108,704295,846222,1188000,2308113,3719804,{"$f":"7634427-3544231-134000","v":3956196},{"$f":"SUM(D183:O183)","v":25465001}]
[null,"112",null,7144,10765,5304,3881,1511,2534,2243,2890,5590,9457,15496,10281,77096]
[null,"121",null,199450,241971,164598,118764,60281,104394,103836,139424,175022,256977,297046,{"$f":"-3544231+3544231+134000","v":134000},1995763]
[null,"122",null,null,null,null,null,10130,12930,11440,14270,19687,24585,28425,32072,153539]
[null,"146",null,3629622,3567188,3349134,3031741,2500962,2374496,2194451,2275935,2309719,3067429,3267643,3542437,35110757]
[null,"147",null,null,null,null,3925542,0,0,0,0,0,0,0,0,3925542]
[null,"148",null,4873335,4412634,4246981,0,3689297,3611778,3571396,3533977,3697655,4111496,4453688,4907937,45110174]
[null,"Total for REVUNBL-G",null,{"$f":"SUM(D182:D189)","v":21446943},{"$f":"SUM(E182:E189)","v":22421914},17795631,13178732,8601661,8222290,7752409,8107732,9328787,14816539,21553753,24000437,{"$f":"SUM(P182:P189)","v":177226828}]
["REVUNBL-GR","101",null,-13256855,-9629638,-10422050,-7439883,-4397502,-1567310,-1312050,-1164748,-1295014,-1933114,-5038482,-9771651,{"$f":"SUM(D191:O191)","v":-67228297}]
[null,"111",null,-4499374,-3107754,-3767306,-2589731,-1701302,-772170,-804108,-704295,-846222,-1188000,-2308113,-3719804,-26008179]
[null,"112",null,-14283,-7144,-10765,-5304,-3881,-1511,-2534,-2243,-2890,-5590,-9457,-15496,-81098]
[null,"121",null,-318891,-199450,-241971,-164598,-118764,-60281,-104394,-103836,-139424,-175022,-256977,-297046,-2180654]
[null,"122",null,null,null,null,null,null,-10130,-12930,-11440,-14270,-19687,-24585,-28425,-121467]
[null,"146",null,-3967685,-3629622,-3567188,-3349134,-3031741,-2500962,-2374496,-2194451,-2275935,-2309719,-3067429,-3267643,-35536005]
[null,"147",null,null,null,null,null,-3925542,0,0,0,0,0,0,0,-3925542]
[null,"148",null,-4983146,-4873335,-4412634,-4246981,0,-3689297,-3611778,-3571396,-3533977,-3697655,-4111496,-4453688,-45185383]
[null,"Total for REVUNBL-GR",null,{"$f":"SUM(D191:D198)","v":-27040234},{"$f":"SUM(E191:E198)","v":-21446943},-22421914,-17795631,-13178732,-8601661,-8222290,-7752409,-8107732,-9328787,-14816539,-21553753,-180266625]
["Total for WA",null,null,{"$f":"D190+D199","v":-5593291},{"$f":"E190+E199","v":974971},-4626283,-4616899,-4577071,-379371,-469881,355323,1221055,5487752,6737214,2446684,-3039797]
[]
[]
[]
[null,null,101,{"$f":"D182+D191","v":-3627217},{"$f":"E182+E191","v":792412},-2982167,-3042381,-2830192,-255260,-147302,130266,638100,3105368,4733169,1645863,{"$f":"P182+P191","v":-1839341}]
[null,null,111,{"$f":"D183+D184+D193+D192","v":-1398759},{"$f":"E183+E184+E193+E192","v":663173},-1183036,-889852,-931502,32961,-100104,142574,344478,1123980,1417730,231177,{"$f":"P183+P184+P193+P192","v":-547180}]
[null,null,121,{"$f":"D185+D186+D195+D194","v":-119441},{"$f":"E185+E186+E195+E194","v":42521},-77373,-45834,-48353,46913,-2048,38418,41015,86853,43909,-159399,{"$f":"P185+P186+P195+P194","v":-152819}]
[null,null,146,{"$f":"D187+D196","v":-338063},{"$f":"E187+E196","v":-62434},-218054,-317393,-530779,-126466,-180045,81484,33784,757710,200214,274794,{"$f":"P187+P196","v":-425248}]
[null,null,147,{"$f":"D188+D197","v":0},{"$f":"E188+E197","v":0},0,3925542,-3925542,0,0,0,0,0,0,0,{"$f":"P188+P197","v":0}]
[null,null,148,{"$f":"D189+D198","v":-109811},{"$f":"E189+E198","v":-460701},-165653,-4246981,3689297,-77519,-40382,-37419,163678,413841,342192,454249,{"$f":"P189+P198","v":-75209}]
[null,null,"Total",{"$f":"SUM(D204:D209)","v":-5593291},{"$f":"SUM(E204:E209)","v":974971},-4626283,-4616899,-4577071,-379371,-469881,355323,1221055,5487752,6737214,2446684,{"$f":"SUM(P204:P209)","v":-3039797}]
[]
[null,null,null,{"$f":"D200-D210","v":0},{"$f":"E200-E210","v":0},0,0,0,0,0,0,0,0,0,0,0]
[]
[null,null,null,null,null,null,null,null,null,null,null,null,null,null,"101-121",{"$f":"P204+P205+P206","v":-2539340}]

{"sheet":"121 to 111","index":12,"n_rows":91,"n_cols":24,"rows_kept":91,"cut":false,"hidden":false,"merged":[]}
["Determine 2018 Pro Forma Schedule 121 and Restated 111 customers and volumes.",null,null,null,null,null,null,null,null,null,null,null,null,null,null,null,null,"1st",{"$f":"R2","v":200},{"$f":"S2","v":1000}]
[null,null,null,null,null,null,null,null,null,null,null,null,null,null,null,null,null,200,1000,99999999]
[]
["Name","Account ID","Current Schedule","2018-01-01","2018-02-01","2018-03-01","2018-04-01","2018-05-01","2018-06-01","2018-07-01","2018-08-01","2018-09-01","2018-10-01","2018-11-01","2018-12-01","2018 Total","Sch 121/111 Cancel/ Rebill usage","Block 1\n1st 200 therms","Block 2\n201 - 1,000 therms","Block 3\nover 1,000 therms"]
[null,null,111,9991.32,7030.9859999999999,8563.6919999999991,6801.2749999999996,6657.7079999999996,4715.1840000000002,4646.9390000000003,4295.991,5872.3680000000004,5495.1229999999996,6966.19,9796.0265999999992,{"$f":"SUM(D5:O5)","v":80832.802599999995},null,{"$f":"R$2*12-SUMPRODUCT(--($D5:$O5<=R$2),R$2-$D5:$O5)","v":2400},{"$f":"S$2*12-SUM(R5:$R5)-SUMPRODUCT(--($D5:$O5<=S$2),S$2-$D5:$O5)","v":9600},{"$f":"T$2*12-SUM($R5:S5)-SUMPRODUCT(--($D5:$O5<=T$2),T$2-$D5:$O5)","v":68832.802599906921}]
[null,null,111,18246.376,19070.896000000001,15059.19,13986.58,12128.208000000001,12812.796,12194.04,13033.456,12317.214,14687.68,20223.955999999998,null,{"$f":"SUM(D6:O6)","v":163760.39200000002},null,{"$f":"R$2*12-SUMPRODUCT(--($D6:$O6<=R$2),R$2-$D6:$O6)","v":2200},{"$f":"S$2*12-SUM(R6:$R6)-SUMPRODUCT(--($D6:$O6<=S$2),S$2-$D6:$O6)","v":8800},{"$f":"T$2*12-SUM($R6:S6)-SUMPRODUCT(--($D6:$O6<=T$2),T$2-$D6:$O6)","v":152760.39199995995}]
[null,null,111,18303.52,18039.72,13178.463,9973.4470000000001,879.07899999999995,715.10400000000004,716.87599999999998,644.274,841.02700000000004,4820.5200000000004,11862.956,null,79974.986000000004,null,2200,{"$f":"S$2*12-SUM(R7:$R7)-SUMPRODUCT(--($D7:$O7<=S$2),S$2-$D7:$O7)","v":7596.3600000000006},{"$f":"T$2*12-SUM($R7:S7)-SUMPRODUCT(--($D7:$O7<=T$2),T$2-$D7:$O7)","v":70178.626000165939}]
[null,null,111,14356.423000000001,10786.315000000001,11185.253000000001,10637.2,9214.59,7238.4,7529.7560000000003,6631.84,6789.64,8104.32,8760.4940000000006,11741.630999999999,112975.86199999999,null,2400,{"$f":"S$2*12-SUM(R8:$R8)-SUMPRODUCT(--($D8:$O8<=S$2),S$2-$D8:$O8)","v":9600},{"$f":"T$2*12-SUM($R8:S8)-SUMPRODUCT(--($D8:$O8<=T$2),T$2-$D8:$O8)","v":100975.86199998856}]
[null,null,111,23032.933000000001,16190.424000000001,16878.11,14298.26,13245.924999999999,9793.7520000000004,9149.2939999999999,8799.42,9597.7960000000003,10674.34,14218.82,17316.468000000001,163195.54200000002,null,2400,{"$f":"S$2*12-SUM(R9:$R9)-SUMPRODUCT(--($D9:$O9<=S$2),S$2-$D9:$O9)","v":9600},{"$f":"T$2*12-SUM($R9:S9)-SUMPRODUCT(--($D9:$O9<=T$2),T$2-$D9:$O9)","v":151195.54200005531}]
[null,null,111,18671.928,13833.152,15177.538,14898.972,9366.2469999999994,9253.5040000000008,9271.9130000000005,8414.02,9394.9240000000009,9804.6239999999998,11841.982,null,129928.804,null,2200,{"$f":"S$2*12-SUM(R10:$R10)-SUMPRODUCT(--($D10:$O10<=S$2),S$2-$D10:$O10)","v":8800},{"$f":"T$2*12-SUM($R10:S10)-SUMPRODUCT(--($D10:$O10<=T$2),T$2-$D10:$O10)","v":118928.80399990082}]
[null,null,111,19844.903999999999,16402,16526.171999999999,13906.062,11647.19,9949.9959999999992,9636.5920000000006,8459.9130000000005,8969.91,10567.335999999999,14173.59,null,140083.66500000001,null,2200,{"$f":"S$2*12-SUM(R11:$R11)-SUMPRODUCT(--($D11:$O11<=S$2),S$2-$D11:$O11)","v":8800},{"$f":"T$2*12-SUM($R11:S11)-SUMPRODUCT(--($D11:$O11<=T$2),T$2-$D11:$O11)","v":129083.66499996185}]
[null,null,111,11563.722,8312.2160000000003,9779.5079999999998,9240.7199999999993,6160.4549999999999,5500.5609999999997,5107.5959999999995,3601,5093.2259999999997,5620.549,6185.7120000000004,null,76165.265000000014,null,2200,{"$f":"S$2*12-SUM(R12:$R12)-SUMPRODUCT(--($D12:$O12<=S$2),S$2-$D12:$O12)","v":8800},{"$f":"T$2*12-SUM($R12:S12)-SUMPRODUCT(--($D12:$O12<=T$2),T$2-$D12:$O12)","v":65165.264999866486}]
[null,null,111,17966.34,16748.439999999999,21506.16,22465.344000000001,21645.974999999999,19766.616000000002,18365.263999999999,23119.036,22406.328000000001,21807.06,23135.84,null,228932.40299999999,null,2200,{"$f":"S$2*12-SUM(R13:$R13)-SUMPRODUCT(--($D13:$O13<=S$2),S$2-$D13:$O13)","v":8800},{"$f":"T$2*12-SUM($R13:S13)-SUMPRODUCT(--($D13:$O13<=T$2),T$2-$D13:$O13)","v":217932.40299987793}]
[null,null,111,22036.86,18307.25,19576.095000000001,18191.036,20698,15852.325000000001,13900.946,14545.602999999999,13986.99,14592.732,17827.79,18309.150000000001,207824.77699999997,null,2400,{"$f":"S$2*12-SUM(R14:$R14)-SUMPRODUCT(--($D14:$O14<=S$2),S$2-$D14:$O14)","v":9600},{"$f":"T$2*12-SUM($R14:S14)-SUMPRODUCT(--($D14:$O14<=T$2),T$2-$D14:$O14)","v":195824.77700018883}]
[null,null,111,18564.8,16579.939999999999,16610.928,14189.656000000001,11665.125,9830.7420000000002,7325.424,7034.866,9576.2520000000004,12195.018,13189.334999999999,null,136762.08599999998,null,2200,{"$f":"S$2*12-SUM(R15:$R15)-SUMPRODUCT(--($D15:$O15<=S$2),S$2-$D15:$O15)","v":8800},{"$f":"T$2*12-SUM($R15:S15)-SUMPRODUCT(--($D15:$O15<=T$2),T$2-$D15:$O15)","v":125762.08599996567}]
[null,null,111,7597.7730000000001,6497.9989999999998,11813.49,1550.615,12533.4,13059.007,12283.075000000001,9729.9959999999992,14442.222,13390.08,9211.3330000000005,16491.415000000001,128600.405,null,2400,{"$f":"S$2*12-SUM(R16:$R16)-SUMPRODUCT(--($D16:$O16<=S$2),S$2-$D16:$O16)","v":9600},{"$f":"T$2*12-SUM($R16:S16)-SUMPRODUCT(--($D16:$O16<=T$2),T$2-$D16:$O16)","v":116600.40500020981}]
[null,null,111,13506.28,16845.14,18835.582999999999,11840.210999999999,15288,9520.4699999999993,6885.04,8366.4840000000004,9957.4439999999995,10888.25,10957.575000000001,null,132890.47699999998,null,2200,{"$f":"S$2*12-SUM(R17:$R17)-SUMPRODUCT(--($D17:$O17<=S$2),S$2-$D17:$O17)","v":8800},{"$f":"T$2*12-SUM($R17:S17)-SUMPRODUCT(--($D17:$O17<=T$2),T$2-$D17:$O17)","v":121890.47699999809}]
[null,null,111,16831.722000000002,16265.62,14129.412,13413.312,12724.457,10581.468000000001,9568.6859999999997,10493.982,10340.82,13474.907999999999,15479.36,null,143303.74700000003,null,2200,{"$f":"S$2*12-SUM(R18:$R18)-SUMPRODUCT(--($D18:$O18<=S$2),S$2-$D18:$O18)","v":8800},{"$f":"T$2*12-SUM($R18:S18)-SUMPRODUCT(--($D18:$O18<=T$2),T$2-$D18:$O18)","v":132303.7469997406}]
[null,null,111,18898.599999999999,13095.35,18416.224999999999,13602.24,12386.904,12467.686,11172.7,8999.2080000000005,15805.928,10106.152,11199.534,17111.674999999999,163262.20199999999,null,2400,{"$f":"S$2*12-SUM(R19:$R19)-SUMPRODUCT(--($D19:$O19<=S$2),S$2-$D19:$O19)","v":9600},{"$f":"T$2*12-SUM($R19:S19)-SUMPRODUCT(--($D19:$O19<=T$2),T$2-$D19:$O19)","v":151262.20199990273}]
[null,null,111,15941,12201.259,13394.755999999999,10711.512000000001,8078.8140000000003,5961.11,6821.08,5976.8280000000004,6581.9250000000002,7957.06,10736.986000000001,null,104362.33,null,2200,{"$f":"S$2*12-SUM(R20:$R20)-SUMPRODUCT(--($D20:$O20<=S$2),S$2-$D20:$O20)","v":8800},{"$f":"T$2*12-SUM($R20:S20)-SUMPRODUCT(--($D20:$O20<=T$2),T$2-$D20:$O20)","v":93362.329999923706}]
[null,null,111,19325.736000000001,22970.145,24928.991999999998,18587.358,19289.096000000001,17008.04,17048.382000000001,17623.93,16462.485000000001,18279.751,20752.578000000001,null,212276.49299999999,null,2200,{"$f":"S$2*12-SUM(R21:$R21)-SUMPRODUCT(--($D21:$O21<=S$2),S$2-$D21:$O21)","v":8800},{"$f":"T$2*12-SUM($R21:S21)-SUMPRODUCT(--($D21:$O21<=T$2),T$2-$D21:$O21)","v":201276.49300003052}]
[null,null,111,8797.35,9600.7379999999994,8137.2579999999998,7308.9539999999997,8391.4380000000001,6269.8,6566.36,8056.9719999999998,7991.8360000000002,7377.9549999999999,8706.84,null,87205.501000000004,null,2200,{"$f":"S$2*12-SUM(R22:$R22)-SUMPRODUCT(--($D22:$O22<=S$2),S$2-$D22:$O22)","v":8800},{"$f":"T$2*12-SUM($R22:S22)-SUMPRODUCT(--($D22:$O22<=T$2),T$2-$D22:$O22)","v":76205.500999927521}]
[null,null,121,null,null,null,null,null,null,2449.5737399999998,7973.3159999999998,9263.64,11863.8,11546.603999999999,14832.072,{"$f":"SUM(D23:O23)","v":57929.005739999993},null,1200,{"$f":"S$2*12-SUM(R23:$R23)-SUMPRODUCT(--($D23:$O23<=S$2),S$2-$D23:$O23)","v":4800},{"$f":"T$2*12-SUM($R23:S23)-SUMPRODUCT(--($D23:$O23<=T$2),T$2-$D23:$O23)","v":51929.005739927292}]
[null,null,121,17335.014999999999,12361.800999999999,13983.174000000001,11127.227999999999,11367.294,10922.304,8569.2389899999998,null,null,null,null,null,{"$f":"SUM(D24:O24)","v":85666.05498999999},null,1400,{"$f":"S$2*12-SUM(R24:$R24)-SUMPRODUCT(--($D24:$O24<=S$2),S$2-$D24:$O24)","v":5600},{"$f":"T$2*12-SUM($R24:S24)-SUMPRODUCT(--($D24:$O24<=T$2),T$2-$D24:$O24)","v":78666.054989814758}]
[null,null,null,{"$f":"SUM(D5:D24)","v":310812.60199999996},{"$f":"SUM(E5:E24)","v":271139.391},287679.99899999995,236729.98199999999,223367.905,191218.86499999996,179208.77572999999,175800.13500000001,195691.97500000003,211707.25799999994,246977.47500000001,105598.4376,{"$f":"SUM(D25:O25)","v":2635932.80033},"Current Year Rebills",{"$f":"SUM(R5:R24)","v":43400},{"$f":"SUM(S5:S24)","v":172396.36},2420136.4403293133,"Current Yearr Rebills"]
[null,null,null,null,null,null,null,null,null,null,null,null,null,null,null,{"$f":"-P37-P25","v":4656696.6882799994},"Prior Years Rebills",{"$f":"(608-217)*200","v":78200},{"$f":"(608-217)*800","v":312800},{"$f":"P26-R26-S26","v":4265696.6882799994},"Prior Years Rebills"]
[null,null,null,null,null,null,null,null,null,null,null,null,null,null,null,null,null,"1st",{"$f":"R28","v":500},{"$f":"S28","v":1000},10000,{"$f":"U28","v":25000}]
[null,null,null,null,null,null,null,null,null,null,null,null,null,null,null,null,null,500,1000,10000,25000,99999999]
[null,null,null,null,null,null,null,null,null,null,null,null,null,null,null,null,"Schedule 121 not Rebilled","Block 1\n1st 500 therms","Block 2\n501 - 1,000 therms","Block 3\n1,001 - 10,000 therms","Block 4\n10,001 - 25,000 therms","Block 5\nover 25,000 therms"]
["Customer 1",2621400000,121,97094.085000000006,80333.945999999996,69364.269,57291.588000000003,31598.7,28892.99,28870.634999999998,25322.026000000002,35158.072,39392.639999999999,60010.084000000003,83606.648000000001,{"$f":"SUM(D30:O30)","v":636935.68300000008},null,{"$f":"R$28*12-SUMPRODUCT(--($D30:$O30<=R$28),R$28-$D30:$O30)","v":6000},{"$f":"S$28*12-SUM(R30:$R30)-SUMPRODUCT(--($D30:$O30<=S$28),S$28-$D30:$O30)","v":6000},{"$f":"T$28*12-SUM($R30:S30)-SUMPRODUCT(--($D30:$O30<=T$28),T$28-$D30:$O30)","v":108000},{"$f":"U$28*12-SUM($R30:T30)-SUMPRODUCT(--($D30:$O30<=U$28),U$28-$D30:$O30)","v":180000},{"$f":"V$28*12-SUM($R30:U30)-SUMPRODUCT(--($D30:$O30<=V$28),V$28-$D30:$O30)","v":336935.68300008774}]
["Customer 2",4796220000,121,47471.8,37653.046000000002,45223.936000000002,40774.095999999998,24492,45362.82,40939.879000000001,47349.154999999999,50581.8,47921.61,62403.12,50334.514999999999,540507.77699999989,null,{"$f":"R$28*12-SUMPRODUCT(--($D31:$O31<=R$28),R$28-$D31:$O31)","v":6000},{"$f":"S$28*12-SUM(R31:$R31)-SUMPRODUCT(--($D31:$O31<=S$28),S$28-$D31:$O31)","v":6000},{"$f":"T$28*12-SUM($R31:S31)-SUMPRODUCT(--($D31:$O31<=T$28),T$28-$D31:$O31)","v":108000},{"$f":"U$28*12-SUM($R31:T31)-SUMPRODUCT(--($D31:$O31<=U$28),U$28-$D31:$O31)","v":179492},{"$f":"V$28*12-SUM($R31:U31)-SUMPRODUCT(--($D31:$O31<=V$28),V$28-$D31:$O31)","v":241015.77699995041}]
["Customer 3",7275110000,121,26897.5,17227.853999999999,20402.477999999999,16729.68,13286.76,9394.7039999999997,7873.732,7552.6710000000003,9142.92,null,null,null,128508.29899999998,"Closed Account 9/2018 ",{"$f":"R$28*12-SUMPRODUCT(--($D32:$O32<=R$28),R$28-$D32:$O32)","v":4500},{"$f":"S$28*12-SUM(R32:$R32)-SUMPRODUCT(--($D32:$O32<=S$28),S$28-$D32:$O32)","v":4500},{"$f":"T$28*12-SUM($R32:S32)-SUMPRODUCT(--($D32:$O32<=T$28),T$28-$D32:$O32)","v":74964.027000000002},{"$f":"U$28*12-SUM($R32:T32)-SUMPRODUCT(--($D32:$O32<=U$28),U$28-$D32:$O32)","v":42646.771999999997},{"$f":"V$28*12-SUM($R32:U32)-SUMPRODUCT(--($D32:$O32<=V$28),V$28-$D32:$O32)","v":1897.5},null,{"$f":"COUNT(D32:L32)","v":9}]
[null,null,null,{"$f":"SUM(D30:D32)","v":171463.38500000001},135214.84599999999,134990.68299999999,114795.364,69377.459999999992,83650.513999999996,77684.245999999999,80223.851999999999,94882.792000000001,87314.25,122413.204,133941.163,{"$f":"SUM(D33:O33)","v":1305951.7589999998},null,{"$f":"SUM(R30:R32)","v":16500},{"$f":"SUM(S30:S32)","v":16500},290964.027,402138.772,{"$f":"SUM(V30:V32)","v":579848.96000003815}]
[]
["Total Former and Present ","Schedule 121",null,{"$f":"D25+D33","v":482275.98699999996},406354.23699999996,422670.68199999991,351525.34600000002,292745.36499999999,274869.37899999996,256893.02172999998,256023.98700000002,290574.76700000005,299021.50799999991,369390.679,239539.60060000001,{"$f":"SUM(D35:O35)","v":3941884.5593300001},"Total Current Year Bills",null,null,{"$f":"-T37-T36","v":391},"Prior period bills rebilled on Sch 111"]
["Revenue Report (Billed)","Schedule 121",null,482275.98700000002,406354.23700000002,422670.68199999997,351525.34600000002,292745.36499999999,274869.37900000002,256893.02173000001,270466.20899999997,267299.68199999997,316924.913,380776.489,-7073546.2400099998,{"$f":"SUM(D36:O36)","v":-3350744.9292799998},null,null,null,217,"2018 bills rebilled on Sch 111 "]
[null,null,null,{"$f":"D36-D35","v":0},{"$f":"E36-E35","v":0},0,0,0,0,0,14442.221999999951,-23275.085000000079,17903.405000000086,11385.809999999998,-7313085.8406099994,-7292629.4886099994,"Canceled and Rebilled usage",null,null,-608,"bills cancelled"]
[]
[]
[]
["Revenue Report (Billed)","Schedule 122",null,65294.612000000001,48825.788,51647.355000000003,46438.080000000002,39511.659,28453.558000000001,23989.277999999998,22970.117999999999,24853.434000000001,25795.748,31468.651999999998,53121.188999999998,{"$f":"SUM(D41:O41)","v":462369.47100000008}]
["Revenue Report (Billed)","Schedule 112",null,17696.583999999999,17941.822,13354.004999999999,11289.88,5892.768,5577.36,4704.0810000000001,4652.5619999999999,7056.8819999999996,9923.3799999999992,17155.088,17027.964,{"$f":"SUM(D42:O42)","v":132272.37600000002}]
[]
[]
[null,3738400000,112,17696.583999999999,17941.822,13354.004999999999,11289.88,5892.768,5577.36,4704.0810000000001,4652.5619999999999,7056.8819999999996,9923.3799999999992,17155.088,17027.964,{"$f":"SUM(D45:O45)","v":132272.37600000002}]
[null,8016850000,122,65294.612000000001,48825.788,51647.355000000003,46438.080000000002,39511.659,28453.558000000001,23989.277999999998,22970.117999999999,24853.434000000001,25795.748,31468.651999999998,53121.188999999998,{"$f":"SUM(D46:O46)","v":462369.47100000008}]
[]
[]
[]
[]
[]
["Schedule 121/122"]
[]
[]
[]
[]
[]
[]
[]
[]
[]
[]
[]
[]
[]
["Determine 2018 Pro Forma Schedule 121 and Restated 111 customers and volumes."]
[null,null,null,null,null,null,null,null,null,null,null,null,null,null,null,null,null,"1st",{"$f":"R68","v":200},{"$f":"S68","v":1000},{"$f":"T68","v":10000},{"$f":"U68","v":25000}]
[null,null,null,null,null,null,null,null,null,null,null,null,null,null,null,null,null,200,1000,10000,25000,99999999]
["Name","Account ID","Current Schedule","2018-01-01","2018-02-01","2018-03-01","2018-04-01","2018-05-01","2018-06-01","2018-07-01","2018-08-01","2018-09-01","2018-10-01","2018-11-01","2018-12-01","2018 Total","Sch 121/111 Cancel/ Rebill usage","Block 1\n1st 500 therms","Block 2\n501 - 1,000 therms","Block 3\n1,001 - 10,000 therms","Block 4\n10,001 - 25,000 therms","Block 5\nover 25,000 therms"]
[null,null,111,9991.32,7030.9859999999999,8563.6919999999991,6801.2749999999996,6657.7079999999996,4715.1840000000002,4646.9390000000003,4295.991,5872.3680000000004,5495.1229999999996,6966.19,9796.0265999999992,{"$f":"SUM(D70:O70)","v":80832.802599999995},null,{"$f":"R$68*12-SUMPRODUCT(--($D70:$O70<=R$68),R$68-$D70:$O70)","v":2400},{"$f":"S$68*12-SUM(R70:$R70)-SUMPRODUCT(--($D70:$O70<=S$68),S$68-$D70:$O70)","v":9600},{"$f":"T$68*12-SUM($R70:S70)-SUMPRODUCT(--($D70:$O70<=T$68),T$68-$D70:$O70)","v":68832.802599999995},{"$f":"U$68*12-SUM($R70:T70)-SUMPRODUCT(--($D70:$O70<=U$68),U$68-$D70:$O70)","v":0},{"$f":"V$68*12-SUM($R70:U70)-SUMPRODUCT(--($D70:$O70<=V$68),V$68-$D70:$O70)","v":0}]
[null,null,111,18246.376,19070.896000000001,15059.19,13986.58,12128.208000000001,12812.796,12194.04,13033.456,12317.214,14687.68,20223.955999999998,null,{"$f":"SUM(D71:O71)","v":163760.39200000002},null,{"$f":"R$68*12-SUMPRODUCT(--($D71:$O71<=R$68),R$68-$D71:$O71)","v":2200},{"$f":"S$68*12-SUM(R71:$R71)-SUMPRODUCT(--($D71:$O71<=S$68),S$68-$D71:$O71)","v":8800},{"$f":"T$68*12-SUM($R71:S71)-SUMPRODUCT(--($D71:$O71<=T$68),T$68-$D71:$O71)","v":99000},{"$f":"U$68*12-SUM($R71:T71)-SUMPRODUCT(--($D71:$O71<=U$68),U$68-$D71:$O71)","v":53760.392000000022},{"$f":"V$68*12-SUM($R71:U71)-SUMPRODUCT(--($D71:$O71<=V$68),V$68-$D71:$O71)","v":0}]
[null,null,111,18303.52,18039.72,13178.463,9973.4470000000001,879.07899999999995,715.10400000000004,716.87599999999998,644.274,841.02700000000004,4820.5200000000004,11862.956,null,79974.986000000004,null,2200,{"$f":"S$68*12-SUM(R72:$R72)-SUMPRODUCT(--($D72:$O72<=S$68),S$68-$D72:$O72)","v":7596.3600000000006},{"$f":"T$68*12-SUM($R72:S72)-SUMPRODUCT(--($D72:$O72<=T$68),T$68-$D72:$O72)","v":48793.967000000004},{"$f":"U$68*12-SUM($R72:T72)-SUMPRODUCT(--($D72:$O72<=U$68),U$68-$D72:$O72)","v":21384.659000000014},{"$f":"V$68*12-SUM($R72:U72)-SUMPRODUCT(--($D72:$O72<=V$68),V$68-$D72:$O72)","v":0}]
[null,null,111,14356.423000000001,10786.315000000001,11185.253000000001,10637.2,9214.59,7238.4,7529.7560000000003,6631.84,6789.64,8104.32,8760.4940000000006,11741.630999999999,112975.86199999999,null,2400,{"$f":"S$68*12-SUM(R73:$R73)-SUMPRODUCT(--($D73:$O73<=S$68),S$68-$D73:$O73)","v":9600},{"$f":"T$68*12-SUM($R73:S73)-SUMPRODUCT(--($D73:$O73<=T$68),T$68-$D73:$O73)","v":92269.04},{"$f":"U$68*12-SUM($R73:T73)-SUMPRODUCT(--($D73:$O73<=U$68),U$68-$D73:$O73)","v":8706.8220000000438},{"$f":"V$68*12-SUM($R73:U73)-SUMPRODUCT(--($D73:$O73<=V$68),V$68-$D73:$O73)","v":0}]
[null,null,111,23032.933000000001,16190.424000000001,16878.11,14298.26,13245.924999999999,9793.7520000000004,9149.2939999999999,8799.42,9597.7960000000003,10674.34,14218.82,17316.468000000001,163195.54200000002,null,2400,{"$f":"S$68*12-SUM(R74:$R74)-SUMPRODUCT(--($D74:$O74<=S$68),S$68-$D74:$O74)","v":9600},{"$f":"T$68*12-SUM($R74:S74)-SUMPRODUCT(--($D74:$O74<=T$68),T$68-$D74:$O74)","v":105340.262},{"$f":"U$68*12-SUM($R74:T74)-SUMPRODUCT(--($D74:$O74<=U$68),U$68-$D74:$O74)","v":45855.28},{"$f":"V$68*12-SUM($R74:U74)-SUMPRODUCT(--($D74:$O74<=V$68),V$68-$D74:$O74)","v":0}]
[null,null,111,18671.928,13833.152,15177.538,14898.972,9366.2469999999994,9253.5040000000008,9271.9130000000005,8414.02,9394.9240000000009,9804.6239999999998,11841.982,null,129928.804,null,2200,{"$f":"S$68*12-SUM(R75:$R75)-SUMPRODUCT(--($D75:$O75<=S$68),S$68-$D75:$O75)","v":8800},{"$f":"T$68*12-SUM($R75:S75)-SUMPRODUCT(--($D75:$O75<=T$68),T$68-$D75:$O75)","v":94505.232000000004},{"$f":"U$68*12-SUM($R75:T75)-SUMPRODUCT(--($D75:$O75<=U$68),U$68-$D75:$O75)","v":24423.571999999986},{"$f":"V$68*12-SUM($R75:U75)-SUMPRODUCT(--($D75:$O75<=V$68),V$68-$D75:$O75)","v":0}]
[null,null,111,19844.903999999999,16402,16526.171999999999,13906.062,11647.19,9949.9959999999992,9636.5920000000006,8459.9130000000005,8969.91,10567.335999999999,14173.59,null,140083.66500000001,null,2200,{"$f":"S$68*12-SUM(R76:$R76)-SUMPRODUCT(--($D76:$O76<=S$68),S$68-$D76:$O76)","v":8800},{"$f":"T$68*12-SUM($R76:S76)-SUMPRODUCT(--($D76:$O76<=T$68),T$68-$D76:$O76)","v":96016.410999999993},{"$f":"U$68*12-SUM($R76:T76)-SUMPRODUCT(--($D76:$O76<=U$68),U$68-$D76:$O76)","v":33067.254000000015},{"$f":"V$68*12-SUM($R76:U76)-SUMPRODUCT(--($D76:$O76<=V$68),V$68-$D76:$O76)","v":0}]
[null,null,111,11563.722,8312.2160000000003,9779.5079999999998,9240.7199999999993,6160.4549999999999,5500.5609999999997,5107.5959999999995,3601,5093.2259999999997,5620.549,6185.7120000000004,null,76165.265000000014,null,2200,{"$f":"S$68*12-SUM(R77:$R77)-SUMPRODUCT(--($D77:$O77<=S$68),S$68-$D77:$O77)","v":8800},{"$f":"T$68*12-SUM($R77:S77)-SUMPRODUCT(--($D77:$O77<=T$68),T$68-$D77:$O77)","v":63601.542999999998},{"$f":"U$68*12-SUM($R77:T77)-SUMPRODUCT(--($D77:$O77<=U$68),U$68-$D77:$O77)","v":1563.7220000000088},{"$f":"V$68*12-SUM($R77:U77)-SUMPRODUCT(--($D77:$O77<=V$68),V$68-$D77:$O77)","v":0}]
[null,null,111,17966.34,16748.439999999999,21506.16,22465.344000000001,21645.974999999999,19766.616000000002,18365.263999999999,23119.036,22406.328000000001,21807.06,23135.84,null,228932.40299999999,null,2200,{"$f":"S$68*12-SUM(R78:$R78)-SUMPRODUCT(--($D78:$O78<=S$68),S$68-$D78:$O78)","v":8800},{"$f":"T$68*12-SUM($R78:S78)-SUMPRODUCT(--($D78:$O78<=T$68),T$68-$D78:$O78)","v":99000},{"$f":"U$68*12-SUM($R78:T78)-SUMPRODUCT(--($D78:$O78<=U$68),U$68-$D78:$O78)","v":118932.40299999999},{"$f":"V$68*12-SUM($R78:U78)-SUMPRODUCT(--($D78:$O78<=V$68),V$68-$D78:$O78)","v":0}]
[null,null,111,22036.86,18307.25,19576.095000000001,18191.036,20698,15852.325000000001,13900.946,14545.602999999999,13986.99,14592.732,17827.79,18309.150000000001,207824.77699999997,null,2400,{"$f":"S$68*12-SUM(R79:$R79)-SUMPRODUCT(--($D79:$O79<=S$68),S$68-$D79:$O79)","v":9600},{"$f":"T$68*12-SUM($R79:S79)-SUMPRODUCT(--($D79:$O79<=T$68),T$68-$D79:$O79)","v":108000},{"$f":"U$68*12-SUM($R79:T79)-SUMPRODUCT(--($D79:$O79<=U$68),U$68-$D79:$O79)","v":87824.777000000002},{"$f":"V$68*12-SUM($R79:U79)-SUMPRODUCT(--($D79:$O79<=V$68),V$68-$D79:$O79)","v":0}]
[null,null,111,18564.8,16579.939999999999,16610.928,14189.656000000001,11665.125,9830.7420000000002,7325.424,7034.866,9576.2520000000004,12195.018,13189.334999999999,null,136762.08599999998,null,2200,{"$f":"S$68*12-SUM(R80:$R80)-SUMPRODUCT(--($D80:$O80<=S$68),S$68-$D80:$O80)","v":8800},{"$f":"T$68*12-SUM($R80:S80)-SUMPRODUCT(--($D80:$O80<=T$68),T$68-$D80:$O80)","v":92767.284},{"$f":"U$68*12-SUM($R80:T80)-SUMPRODUCT(--($D80:$O80<=U$68),U$68-$D80:$O80)","v":32994.802000000025},{"$f":"V$68*12-SUM($R80:U80)-SUMPRODUCT(--($D80:$O80<=V$68),V$68-$D80:$O80)","v":0}]
[null,null,111,7597.7730000000001,6497.9989999999998,11813.49,1550.615,12533.4,13059.007,12283.075000000001,9729.9959999999992,14442.222,13390.08,9211.3330000000005,16491.415000000001,128600.405,null,2400,{"$f":"S$68*12-SUM(R81:$R81)-SUMPRODUCT(--($D81:$O81<=S$68),S$68-$D81:$O81)","v":9600},{"$f":"T$68*12-SUM($R81:S81)-SUMPRODUCT(--($D81:$O81<=T$68),T$68-$D81:$O81)","v":92587.716},{"$f":"U$68*12-SUM($R81:T81)-SUMPRODUCT(--($D81:$O81<=U$68),U$68-$D81:$O81)","v":24012.688999999984},{"$f":"V$68*12-SUM($R81:U81)-SUMPRODUCT(--($D81:$O81<=V$68),V$68-$D81:$O81)","v":0}]
[null,null,111,13506.28,16845.14,18835.582999999999,11840.210999999999,15288,9520.4699999999993,6885.04,8366.4840000000004,9957.4439999999995,10888.25,10957.575000000001,null,132890.47699999998,null,2200,{"$f":"S$68*12-SUM(R82:$R82)-SUMPRODUCT(--($D82:$O82<=S$68),S$68-$D82:$O82)","v":8800},{"$f":"T$68*12-SUM($R82:S82)-SUMPRODUCT(--($D82:$O82<=T$68),T$68-$D82:$O82)","v":93729.437999999995},{"$f":"U$68*12-SUM($R82:T82)-SUMPRODUCT(--($D82:$O82<=U$68),U$68-$D82:$O82)","v":28161.03899999999},{"$f":"V$68*12-SUM($R82:U82)-SUMPRODUCT(--($D82:$O82<=V$68),V$68-$D82:$O82)","v":0}]
[null,null,111,16831.722000000002,16265.62,14129.412,13413.312,12724.457,10581.468000000001,9568.6859999999997,10493.982,10340.82,13474.907999999999,15479.36,null,143303.74700000003,null,2200,{"$f":"S$68*12-SUM(R83:$R83)-SUMPRODUCT(--($D83:$O83<=S$68),S$68-$D83:$O83)","v":8800},{"$f":"T$68*12-SUM($R83:S83)-SUMPRODUCT(--($D83:$O83<=T$68),T$68-$D83:$O83)","v":98568.686000000002},{"$f":"U$68*12-SUM($R83:T83)-SUMPRODUCT(--($D83:$O83<=U$68),U$68-$D83:$O83)","v":33735.061000000045},{"$f":"V$68*12-SUM($R83:U83)-SUMPRODUCT(--($D83:$O83<=V$68),V$68-$D83:$O83)","v":0}]
[null,null,111,18898.599999999999,13095.35,18416.224999999999,13602.24,12386.904,12467.686,11172.7,8999.2080000000005,15805.928,10106.152,11199.534,17111.674999999999,163262.20199999999,null,2400,{"$f":"S$68*12-SUM(R84:$R84)-SUMPRODUCT(--($D84:$O84<=S$68),S$68-$D84:$O84)","v":9600},{"$f":"T$68*12-SUM($R84:S84)-SUMPRODUCT(--($D84:$O84<=T$68),T$68-$D84:$O84)","v":106999.208},{"$f":"U$68*12-SUM($R84:T84)-SUMPRODUCT(--($D84:$O84<=U$68),U$68-$D84:$O84)","v":44262.994000000006},{"$f":"V$68*12-SUM($R84:U84)-SUMPRODUCT(--($D84:$O84<=V$68),V$68-$D84:$O84)","v":0}]
[null,null,111,15941,12201.259,13394.755999999999,10711.512000000001,8078.8140000000003,5961.11,6821.08,5976.8280000000004,6581.9250000000002,7957.06,10736.986000000001,null,104362.33,null,2200,{"$f":"S$68*12-SUM(R85:$R85)-SUMPRODUCT(--($D85:$O85<=S$68),S$68-$D85:$O85)","v":8800},{"$f":"T$68*12-SUM($R85:S85)-SUMPRODUCT(--($D85:$O85<=T$68),T$68-$D85:$O85)","v":80376.81700000001},{"$f":"U$68*12-SUM($R85:T85)-SUMPRODUCT(--($D85:$O85<=U$68),U$68-$D85:$O85)","v":12985.512999999977},{"$f":"V$68*12-SUM($R85:U85)-SUMPRODUCT(--($D85:$O85<=V$68),V$68-$D85:$O85)","v":0}]
[null,null,111,19325.736000000001,22970.145,24928.991999999998,18587.358,19289.096000000001,17008.04,17048.382000000001,17623.93,16462.485000000001,18279.751,20752.578000000001,null,212276.49299999999,null,2200,{"$f":"S$68*12-SUM(R86:$R86)-SUMPRODUCT(--($D86:$O86<=S$68),S$68-$D86:$O86)","v":8800},{"$f":"T$68*12-SUM($R86:S86)-SUMPRODUCT(--($D86:$O86<=T$68),T$68-$D86:$O86)","v":99000},{"$f":"U$68*12-SUM($R86:T86)-SUMPRODUCT(--($D86:$O86<=U$68),U$68-$D86:$O86)","v":102276.49300000002},{"$f":"V$68*12-SUM($R86:U86)-SUMPRODUCT(--($D86:$O86<=V$68),V$68-$D86:$O86)","v":0}]
[null,null,111,8797.35,9600.7379999999994,8137.2579999999998,7308.9539999999997,8391.4380000000001,6269.8,6566.36,8056.9719999999998,7991.8360000000002,7377.9549999999999,8706.84,null,87205.501000000004,null,2200,{"$f":"S$68*12-SUM(R87:$R87)-SUMPRODUCT(--($D87:$O87<=S$68),S$68-$D87:$O87)","v":8800},{"$f":"T$68*12-SUM($R87:S87)-SUMPRODUCT(--($D87:$O87<=T$68),T$68-$D87:$O87)","v":76205.501000000004},{"$f":"U$68*12-SUM($R87:T87)-SUMPRODUCT(--($D87:$O87<=U$68),U$68-$D87:$O87)","v":0},{"$f":"V$68*12-SUM($R87:U87)-SUMPRODUCT(--($D87:$O87<=V$68),V$68-$D87:$O87)","v":0}]
[null,null,121,null,null,null,null,null,null,2449.5737399999998,7973.3159999999998,9263.64,11863.8,11546.603999999999,14832.072,{"$f":"SUM(D88:O88)","v":57929.005739999993},null,1200,{"$f":"S$68*12-SUM(R88:$R88)-SUMPRODUCT(--($D88:$O88<=S$68),S$68-$D88:$O88)","v":4800},{"$f":"T$68*12-SUM($R88:S88)-SUMPRODUCT(--($D88:$O88<=T$68),T$68-$D88:$O88)","v":43686.529739999998},{"$f":"U$68*12-SUM($R88:T88)-SUMPRODUCT(--($D88:$O88<=U$68),U$68-$D88:$O88)","v":8242.4759999999369},{"$f":"V$68*12-SUM($R88:U88)-SUMPRODUCT(--($D88:$O88<=V$68),V$68-$D88:$O88)","v":0}]
[null,null,121,17335.014999999999,12361.800999999999,13983.174000000001,11127.227999999999,11367.294,10922.304,8569.2389899999998,null,null,null,null,null,{"$f":"SUM(D89:O89)","v":85666.05498999999},null,1400,{"$f":"S$68*12-SUM(R89:$R89)-SUMPRODUCT(--($D89:$O89<=S$68),S$68-$D89:$O89)","v":5600},{"$f":"T$68*12-SUM($R89:S89)-SUMPRODUCT(--($D89:$O89<=T$68),T$68-$D89:$O89)","v":61569.238989999998},{"$f":"U$68*12-SUM($R89:T89)-SUMPRODUCT(--($D89:$O89<=U$68),U$68-$D89:$O89)","v":17096.815999999992},{"$f":"V$68*12-SUM($R89:U89)-SUMPRODUCT(--($D89:$O89<=V$68),V$68-$D89:$O89)","v":0}]
[null,null,null,{"$f":"SUM(D70:D89)","v":310812.60199999996},{"$f":"SUM(E70:E89)","v":271139.391},287679.99899999995,236729.98199999999,223367.905,191218.86499999996,179208.77572999999,175800.13500000001,195691.97500000003,211707.25799999994,246977.47500000001,105598.4376,{"$f":"SUM(D90:O90)","v":2635932.80033},"Current Year Rebills",{"$f":"SUM(R70:R89)","v":43400},{"$f":"SUM(S70:S89)","v":172396.36},1720849.6763299999,699286.76399999997,0]
[null,null,null,null,null,null,null,null,null,null,null,null,null,null,null,{"$f":"-P102-P90","v":-2635932.80033}]

{"sheet":"Sch 111 Rate Design","index":13,"n_rows":73,"n_cols":24,"rows_kept":73,"cut":false,"hidden":false,"merged":[]}
[]
[null,null,null,null,null,null,null,null,null,null,null,null,null,null,null,null,200,1000,99999999]
[]
[null,null,null,null,null,null,null,null,null,null,null,null,null,null,"Annual Usage",null,500,1000,10000,25000,99999999]
["Schedule 121/122",null,"January","February","March","April","May","June","July","August","September","October","November","December"]
[null,null,null,null,null,null,null,null,null,null,null,null,null,null,null,null,"Block 1\n1st 500 therms","Block 2\n501 - 1,000 therms","Block 3\n1,001 - 10,000 therms","Block 4\n10,001 - 25,000 therms","Block 5\nover 25,000 therms"]
["Customer 1",121,97094.085000000006,80333.945999999996,69364.269,57291.588000000003,31598.7,28892.99,28870.634999999998,25322.026000000002,35158.072,39392.639999999999,60010.084000000003,83606.648000000001,{"$f":"SUM(C7:N7)","v":636935.68300000008},"Commercial",{"$f":"Q$4*12-SUMPRODUCT(--($C7:$N7<=Q$4),Q$4-$C7:$N7)","v":6000},{"$f":"R$4*12-SUM(Q7:$Q7)-SUMPRODUCT(--($C7:$N7<=R$4),R$4-$C7:$N7)","v":6000},{"$f":"S$4*12-SUM($Q7:R7)-SUMPRODUCT(--($C7:$N7<=S$4),S$4-$C7:$N7)","v":108000},{"$f":"T$4*12-SUM($Q7:S7)-SUMPRODUCT(--($C7:$N7<=T$4),T$4-$C7:$N7)","v":180000},{"$f":"U$4*12-SUM($Q7:T7)-SUMPRODUCT(--($C7:$N7<=U$4),U$4-$C7:$N7)","v":336935.68300008774}]
["Customer 2",121,47471.8,37653.046000000002,45223.936000000002,40774.095999999998,24492,45362.82,40939.879000000001,47349.154999999999,50581.8,47921.61,62403.12,50334.514999999999,540507.77699999989,"Industrial",{"$f":"Q$4*12-SUMPRODUCT(--($C8:$N8<=Q$4),Q$4-$C8:$N8)","v":6000},{"$f":"R$4*12-SUM(Q8:$Q8)-SUMPRODUCT(--($C8:$N8<=R$4),R$4-$C8:$N8)","v":6000},{"$f":"S$4*12-SUM($Q8:R8)-SUMPRODUCT(--($C8:$N8<=S$4),S$4-$C8:$N8)","v":108000},{"$f":"T$4*12-SUM($Q8:S8)-SUMPRODUCT(--($C8:$N8<=T$4),T$4-$C8:$N8)","v":179492},{"$f":"U$4*12-SUM($Q8:T8)-SUMPRODUCT(--($C8:$N8<=U$4),U$4-$C8:$N8)","v":241015.77699995041}]
["Customer 3",122,65294.612000000001,48825.788,51647.354999999996,46438.080000000002,39511.659,28453.558000000001,23989.277999999998,22970.118000000002,24853.434000000001,25795.748,31468.652000000002,53121.188999999998,462369.47100000008,"Commercial",6000,{"$f":"R$4*12-SUM(Q9:$Q9)-SUMPRODUCT(--($C9:$N9<=R$4),R$4-$C9:$N9)","v":6000},{"$f":"S$4*12-SUM($Q9:R9)-SUMPRODUCT(--($C9:$N9<=S$4),S$4-$C9:$N9)","v":108000},{"$f":"T$4*12-SUM($Q9:S9)-SUMPRODUCT(--($C9:$N9<=T$4),T$4-$C9:$N9)","v":176812.83000000002},{"$f":"U$4*12-SUM($Q9:T9)-SUMPRODUCT(--($C9:$N9<=U$4),U$4-$C9:$N9)","v":165556.64100003242}]
[]
[null,null,null,null,null,null,null,null,null,null,null,null,null,null,null,"Present Base Rates",0.48087999999999997,0.34849999999999998,0.26767000000000002,0.21692,0.14387]
[]
[null,null,null,null,null,null,null,null,null,null,null,null,null,null,null,"Customer 1",{"$f":"Q7*$Q$11","v":2885.2799999999997},{"$f":"R7*$R$11","v":2091},{"$f":"S7*$S$11","v":28908.36},{"$f":"T7*$T$11","v":39045.599999999999},{"$f":"U7*$U$11","v":48474.936713222625},{"$f":"SUM(Q13:U13)","v":121405.17671322261}]
[null,null,null,null,null,null,null,null,null,null,null,null,null,null,null,"Customer 2",{"$f":"Q8*$Q$11","v":2885.2799999999997},{"$f":"R8*$R$11","v":2091},{"$f":"S8*$S$11","v":28908.36},{"$f":"T8*$T$11","v":38935.404640000001},{"$f":"U8*$U$11","v":34674.939836982863},{"$f":"SUM(Q14:U14)","v":107494.98447698288}]
[null,null,null,null,null,null,null,null,null,null,null,null,null,null,null,"Customer 3",2885.2799999999997,2091,28908.36,38354.239083600005,23818.633940674663,96057.513024274667]
[null,null,null,null,null,null,null,null,null,null,null,null,null,null,null,null,null,null,null,null,null,{"$f":"SUM(V13:V15)","v":324957.67421448015}]
[]
[]
["Schedule 111/112"]
[null,null,null,null,null,null,null,null,null,null,null,null,null,null,null,null,"Block 1\n1st 200 therms","Block 2\n201 - 1,000 therms","Block 3\nover 1,000 therms"]
["Customer 1",121,97094.085000000006,80333.945999999996,69364.269,57291.588000000003,31598.7,28892.99,28870.634999999998,25322.026000000002,35158.072,39392.639999999999,60010.084000000003,83606.648000000001,{"$f":"SUM(C21:N21)","v":636935.68300000008},null,{"$f":"Q$2*12-SUMPRODUCT(--($C21:$N21<=Q$2),Q$2-$C21:$N21)","v":2400},{"$f":"R$2*12-SUM(Q21:$Q21)-SUMPRODUCT(--($C21:$N21<=R$2),R$2-$C21:$N21)","v":9600},{"$f":"S$2*12-SUM($Q21:R21)-SUMPRODUCT(--($C21:$N21<=S$2),S$2-$C21:$N21)","v":624935.68300008774},{"$f":"T$28*12-SUM($Q21:S21)-SUMPRODUCT(--($C21:$N21<=T$28),T$28-$C21:$N21)","v":-636935.68300008774}]
["Customer 2",121,47471.8,37653.046000000002,45223.936000000002,40774.095999999998,24492,45362.82,40939.879000000001,47349.154999999999,50581.8,47921.61,62403.12,50334.514999999999,540507.77699999989,null,{"$f":"Q$2*12-SUMPRODUCT(--($C22:$N22<=Q$2),Q$2-$C22:$N22)","v":2400},{"$f":"R$2*12-SUM(Q22:$Q22)-SUMPRODUCT(--($C22:$N22<=R$2),R$2-$C22:$N22)","v":9600},{"$f":"S$2*12-SUM($Q22:R22)-SUMPRODUCT(--($C22:$N22<=S$2),S$2-$C22:$N22)","v":528507.77699995041},{"$f":"T$28*12-SUM($Q22:S22)-SUMPRODUCT(--($C22:$N22<=T$28),T$28-$C22:$N22)","v":-540507.77699995041}]
["Customer 3",122,65294.612000000001,48825.788,51647.354999999996,46438.080000000002,39511.659,28453.558000000001,23989.277999999998,22970.118000000002,24853.434000000001,25795.748,31468.652000000002,53121.188999999998,462369.47100000008,null,2400,{"$f":"R$2*12-SUM(Q23:$Q23)-SUMPRODUCT(--($C23:$N23<=R$2),R$2-$C23:$N23)","v":9600},{"$f":"S$2*12-SUM($Q23:R23)-SUMPRODUCT(--($C23:$N23<=S$2),S$2-$C23:$N23)","v":450369.47099995613},{"$f":"T$28*12-SUM($Q23:S23)-SUMPRODUCT(--($C23:$N23<=T$28),T$28-$C23:$N23)","v":-462369.47099995613}]
[]
[null,null,null,null,null,null,null,null,null,null,null,null,null,null,null,"Present Base Rates",0.48625000000000002,0.33354,0.25424000000000002]
[]
[null,null,null,null,null,null,null,null,null,null,null,null,null,null,null,"Customer 1",{"$f":"Q21*$Q$25","v":1167},{"$f":"R21*$R$25","v":3201.9839999999999},{"$f":"S21*$S$25","v":158883.64804594233},null,null,{"$f":"SUM(Q27:U27)","v":163252.63204594233},{"$f":"V27-V13","v":41847.455332719721}]
[null,null,null,null,null,null,null,null,null,null,null,null,null,null,null,"Customer 2",{"$f":"Q22*$Q$25","v":1167},{"$f":"R22*$R$25","v":3201.9839999999999},{"$f":"S22*$S$25","v":134367.81722446741},null,null,{"$f":"SUM(Q28:U28)","v":138736.8012244674},{"$f":"V28-V14","v":31241.816747484525}]
[null,null,null,null,null,null,null,null,null,null,null,null,null,null,null,"Customer 3",1167,3201.9839999999999,114501.93430702886,null,null,118870.91830702886,22813.405282754189]
[null,null,null,null,null,null,null,null,null,null,null,null,null,null,null,null,null,null,null,null,null,{"$f":"SUM(V27:V29)","v":420860.35157743853},95902.677362958377]
[]
["Schedule 111/112 Revised",null,null,null,null,null,null,null,null,null,null,null,null,null,null,null,200,1000,10000,25000,99999999]
[null,null,null,null,null,null,null,null,null,null,null,null,null,null,null,"Schedule 121 not Rebilled","Block 1\n1st 200 therms","Block 2\n201 - 1,000 therms","Block 3\n1,001 - 10,000 therms","Block 4\n10,001 - 25,000 therms","Block 5\nover 25,000 therms"]
["Customer 1",121,97094.085000000006,80333.945999999996,69364.269,57291.588000000003,31598.7,28892.99,28870.634999999998,25322.026000000002,35158.072,39392.639999999999,60010.084000000003,83606.648000000001,{"$f":"SUM(C34:N34)","v":636935.68300000008},null,{"$f":"Q$32*12-SUMPRODUCT(--($C34:$N34<=Q$32),Q$32-$C34:$N34)","v":2400},{"$f":"R$32*12-SUM(Q34:$Q34)-SUMPRODUCT(--($C34:$N34<=R$32),R$32-$C34:$N34)","v":9600},{"$f":"S$32*12-SUM($Q34:R34)-SUMPRODUCT(--($C34:$N34<=S$32),S$32-$C34:$N34)","v":108000},{"$f":"T$32*12-SUM($Q34:S34)-SUMPRODUCT(--($C34:$N34<=T$32),T$32-$C34:$N34)","v":180000},{"$f":"U$32*12-SUM($Q34:T34)-SUMPRODUCT(--($C34:$N34<=U$32),U$32-$C34:$N34)","v":336935.68300008774}]
["Customer 2",121,47471.8,37653.046000000002,45223.936000000002,40774.095999999998,24492,45362.82,40939.879000000001,47349.154999999999,50581.8,47921.61,62403.12,50334.514999999999,540507.77699999989,null,{"$f":"Q$32*12-SUMPRODUCT(--($C35:$N35<=Q$32),Q$32-$C35:$N35)","v":2400},{"$f":"R$32*12-SUM(Q35:$Q35)-SUMPRODUCT(--($C35:$N35<=R$32),R$32-$C35:$N35)","v":9600},{"$f":"S$32*12-SUM($Q35:R35)-SUMPRODUCT(--($C35:$N35<=S$32),S$32-$C35:$N35)","v":108000},{"$f":"T$32*12-SUM($Q35:S35)-SUMPRODUCT(--($C35:$N35<=T$32),T$32-$C35:$N35)","v":179492},{"$f":"U$32*12-SUM($Q35:T35)-SUMPRODUCT(--($C35:$N35<=U$32),U$32-$C35:$N35)","v":241015.77699995041}]
["Customer 3",122,65294.612000000001,48825.788,51647.354999999996,46438.080000000002,39511.659,28453.558000000001,23989.277999999998,22970.118000000002,24853.434000000001,25795.748,31468.652000000002,53121.188999999998,462369.47100000008,null,2400,{"$f":"R$32*12-SUM(Q36:$Q36)-SUMPRODUCT(--($C36:$N36<=R$32),R$32-$C36:$N36)","v":9600},{"$f":"S$32*12-SUM($Q36:R36)-SUMPRODUCT(--($C36:$N36<=S$32),S$32-$C36:$N36)","v":108000},{"$f":"T$32*12-SUM($Q36:S36)-SUMPRODUCT(--($C36:$N36<=T$32),T$32-$C36:$N36)","v":176812.83000000002},{"$f":"U$32*12-SUM($Q36:T36)-SUMPRODUCT(--($C36:$N36<=U$32),U$32-$C36:$N36)","v":165556.64100003242}]
[null,null,null,null,null,null,null,null,null,null,null,null,null,null,null,"Total Usage",{"$f":"SUM(Q34:Q36)","v":7200},{"$f":"SUM(R34:R36)","v":28800},324000,536304.83000000007,743508.10100007057]
[null,null,null,null,null,null,null,null,null,null,null,null,null,null,null,"Revised Present Base Rates",0.48625000000000002,0.33354,0.25424000000000002,0.21692,0.15217281202275618,null,"Annual Bill Impact"]
[]
[null,null,null,null,null,null,null,null,null,null,null,null,null,null,null,"Customer 1",{"$f":"Q34*$Q$38","v":1167},{"$f":"R34*$R$38","v":3201.9839999999999},{"$f":"S34*$S$38","v":27457.920000000002},{"$f":"T34*$T$38","v":39045.599999999999},{"$f":"U34*$U$38","v":51272.450352931315},{"$f":"SUM(Q40:U40)","v":122144.95435293132},{"$f":"V40-V13","v":739.77763970871456},{"$f":"W40/V13","v":6.0934604251364115E-3}]
[null,null,null,null,null,null,null,null,null,null,null,null,null,null,null,"Customer 2",{"$f":"Q35*$Q$38","v":1167},{"$f":"R35*$R$38","v":3201.9839999999999},{"$f":"S35*$S$38","v":27457.920000000002},{"$f":"T35*$T$38","v":38935.404640000001},{"$f":"U35*$U$38","v":36676.048527931976},{"$f":"SUM(Q41:U41)","v":107438.35716793197},{"$f":"V41-V14","v":-56.627309050905751},{"$f":"W41/V14","v":-5.2679024353020811E-4}]
[null,null,null,null,null,null,null,null,null,null,null,null,null,null,null,"Customer 3",1167,3201.9839999999999,27457.920000000002,38354.239083600005,25193.219610016862,95374.362693616873,-683.15033065779426,-7.1118885878833395E-3]
[null,null,null,null,null,null,null,null,null,null,null,null,null,null,null,null,null,null,null,null,null,{"$f":"SUM(V40:V42)","v":324957.67421448015},0]
[]
[null,null,null,null,null,null,null,null,null,null,null,null,null,null,null,null,null,null,null,null,null,{"$f":"V43-V16","v":0}]
[]
[null,null,null,null,null,null,null,null,null,null,null,null,null,null,null,"Present",{"$f":"Q38","v":0.48625000000000002},{"$f":"R38","v":0.33354},0.25424000000000002,0.21692,0.15217281202275618]
[null,null,null,null,null,null,null,null,null,null,null,null,null,null,null,"Proposed",{"$f":"RD!J19","v":0.53780000000000006},{"$f":"RD!J20","v":0.36158999999999997},{"$f":"RD!J21","v":0.27562000000000003},{"$f":"RD!J22","v":0.23516999999999999},{"$f":"RD!J23","v":0.16497000000000001}]
[null,"2019-12-15","2019-01-16","2019-01-17",null,null,null,null,null,null,null,null,null,null,null,"Differential",{"$f":"Q48-Q47","v":5.155000000000004E-2},{"$f":"R48-R47","v":2.8049999999999964E-2},2.138000000000001E-2,1.8249999999999988E-2,1.2797187977243829E-2]
["Customer 1",71833,95008,111432,"Commercial"]
["Customer 2","Sch 111","Sch 111","Sch 111","Industrial"]
["Customer 3",54946,83853,76826,"Commercial"]
[null,{"$f":"B50+B52","v":126779},{"$f":"C50+C52","v":178861},{"$f":"D50+D52","v":188258},null,null,"Adjusted in COS demand study"]
[]
[null,{"$f":"370032-B53","v":243253},{"$f":"369134-C53","v":190273},{"$f":"386310-D53","v":198052}]
[]
[]
[]
["Schedule 111/112 Revised",null,null,null,null,null,null,null,null,null,null,null,null,null,null,null,200,1000,10000,25000,99999999]
[null,null,null,null,null,null,null,null,null,null,null,null,null,null,null,"Schedule 121 not Rebilled","Block 1\n1st 200 therms","Block 2\n201 - 1,000 therms","Block 3\n1,001 - 10,000 therms","Block 4\n10,001 - 25,000 therms","Block 5\nover 25,000 therms"]
["Customer 1",121,97094.085000000006,80333.945999999996,69364.269,57291.588000000003,31598.7,28892.99,28870.634999999998,25322.026000000002,35158.072,39392.639999999999,60010.084000000003,83606.648000000001,{"$f":"SUM(C61:N61)","v":636935.68300000008},null,{"$f":"Q$32*12-SUMPRODUCT(--($C61:$N61<=Q$32),Q$32-$C61:$N61)","v":2400},{"$f":"R$32*12-SUM(Q61:$Q61)-SUMPRODUCT(--($C61:$N61<=R$32),R$32-$C61:$N61)","v":9600},{"$f":"S$32*12-SUM($Q61:R61)-SUMPRODUCT(--($C61:$N61<=S$32),S$32-$C61:$N61)","v":108000},{"$f":"T$32*12-SUM($Q61:S61)-SUMPRODUCT(--($C61:$N61<=T$32),T$32-$C61:$N61)","v":180000},{"$f":"U$32*12-SUM($Q61:T61)-SUMPRODUCT(--($C61:$N61<=U$32),U$32-$C61:$N61)","v":336935.68300008774}]
["Customer 2",121,47471.8,37653.046000000002,45223.936000000002,40774.095999999998,24492,45362.82,40939.879000000001,47349.154999999999,50581.8,47921.61,62403.12,50334.514999999999,540507.77699999989,null,{"$f":"Q$32*12-SUMPRODUCT(--($C62:$N62<=Q$32),Q$32-$C62:$N62)","v":2400},{"$f":"R$32*12-SUM(Q62:$Q62)-SUMPRODUCT(--($C62:$N62<=R$32),R$32-$C62:$N62)","v":9600},{"$f":"S$32*12-SUM($Q62:R62)-SUMPRODUCT(--($C62:$N62<=S$32),S$32-$C62:$N62)","v":108000},{"$f":"T$32*12-SUM($Q62:S62)-SUMPRODUCT(--($C62:$N62<=T$32),T$32-$C62:$N62)","v":179492},{"$f":"U$32*12-SUM($Q62:T62)-SUMPRODUCT(--($C62:$N62<=U$32),U$32-$C62:$N62)","v":241015.77699995041}]
["Customer 3",122,65294.612000000001,48825.788,51647.354999999996,46438.080000000002,39511.659,28453.558000000001,23989.277999999998,22970.118000000002,24853.434000000001,25795.748,31468.652000000002,53121.188999999998,462369.47100000008,null,2400,{"$f":"R$32*12-SUM(Q63:$Q63)-SUMPRODUCT(--($C63:$N63<=R$32),R$32-$C63:$N63)","v":9600},{"$f":"S$32*12-SUM($Q63:R63)-SUMPRODUCT(--($C63:$N63<=S$32),S$32-$C63:$N63)","v":108000},{"$f":"T$32*12-SUM($Q63:S63)-SUMPRODUCT(--($C63:$N63<=T$32),T$32-$C63:$N63)","v":176812.83000000002},{"$f":"U$32*12-SUM($Q63:T63)-SUMPRODUCT(--($C63:$N63<=U$32),U$32-$C63:$N63)","v":165556.64100003242}]
[null,null,null,null,null,null,null,null,null,null,null,null,null,null,null,"Total Usage",{"$f":"SUM(Q61:Q63)","v":7200},{"$f":"SUM(R61:R63)","v":28800},324000,536304.83000000007,743508.10100007057]
[null,null,null,null,null,null,null,null,null,null,null,null,null,null,null,"Proposed Base Rates",{"$f":"RD!J19","v":0.53780000000000006},{"$f":"RD!J20","v":0.36158999999999997},{"$f":"RD!J21","v":0.27562000000000003},{"$f":"RD!J22","v":0.23516999999999999},{"$f":"RD!J23","v":0.16497000000000001}]
[]
[null,null,null,null,null,null,null,null,null,null,null,null,null,null,null,"Customer 1",{"$f":"Q61*$Q$65","v":1290.72},{"$f":"R61*$R$65","v":3471.2639999999997},{"$f":"S61*$S$65","v":29766.960000000003},{"$f":"T61*$T$65","v":42330.6},{"$f":"U61*$U$65","v":55584.279624524475},{"$f":"SUM(Q67:U67)","v":132443.82362452446}]
[null,null,null,null,null,null,null,null,null,null,null,null,null,null,null,"Customer 2",{"$f":"Q62*$Q$65","v":1290.72},{"$f":"R62*$R$65","v":3471.2639999999997},{"$f":"S62*$S$65","v":29766.960000000003},{"$f":"T62*$T$65","v":42211.13364},{"$f":"U62*$U$65","v":39760.372731681819},{"$f":"SUM(Q68:U68)","v":116500.45037168183}]
[null,null,null,null,null,null,null,null,null,null,null,null,null,null,null,"Customer 3",1290.72,3471.2639999999997,29766.960000000003,41581.073231100003,27311.879065775349,103421.89629687535]
[null,null,null,null,null,null,null,null,null,null,null,null,null,null,null,null,null,null,null,null,null,{"$f":"SUM(V67:V69)","v":352366.17029308167}]
[]
[null,null,null,null,null,null,null,null,null,null,null,null,null,null,null,null,null,null,null,null,null,{"$f":"V70-V16","v":27408.496078601514}]
[null,null,null,null,null,null,null,null,null,null,null,null,null,null,null,null,null,null,null,null,null,{"$f":"V72/V16","v":8.434481858246938E-2}]