{"text_format":"1","workbook":"xlsx","n_sheets":15,"sheets":["Exh. ELJ-6 NG Bill Impact","Exh. ELJ-6 NG Bill Components","ROR","Rate Spread","Rate Design","Bill Impact","Pres & Prop Rev","Proposed Increase","Present&Propoed Class ROR","BFG","Bill Determ","LIRAP","Block Usage","Big Schedules","12MEDEC19"],"not_rendered":{"charts":0,"images":0,"macros":1,"external_links":0,"defined_names":29,"comments":9,"pivot_tables":0},"unopened":[],"bounds":{"document_bytes":16777216,"sheet_cells":100000,"rows_first":2000,"rows_last":500,"rows_between":2000,"halvings":0,"cell_chars":16384,"cell_head_chars":4096},"cells_cut":0,"cells_raw":0,"read":"whole","date_system":"1900"}

{"sheet":"Exh. ELJ-6 NG Bill Impact","index":0,"n_rows":104,"n_cols":14,"rows_kept":104,"cut":false,"hidden":false,"merged":[]}
[null,null,null,null,"AVISTA UTILITIES"]
[null,null,null,null,"WASHINGTON NATURAL GAS"]
[null,null,null,null,"PRESENT AND PROPOSED RATE COMPONENTS BY SCHEDULE"]
[null,null,null,null,"STAFF PROPOSED"]
[]
["Schedule 101 Bill Impact"]
[null,"Schedule 101 Present",null,null,null,null,"Schedule 101 Proposed"]
[null,"Basic Charge","Block 1","Block 2","Total Bill",null,"Basic Charge","Block 1","Block 2","Total Bill",null,"Bill Impact","% Change"]
{"$rows_left_out":97}
{"sheet":"Exh. ELJ-6 NG Bill Components","index":1,"n_rows":64,"n_cols":26,"rows_kept":64,"cut":false,"hidden":false,"merged":[[9,0,9,2],[14,21,14,22]]}
["AVISTA UTILITIES",null,null,null,null,null,null,null,null,null,null,null,null,null,null,"This worksheet uses Base & Billing rates from 'Rate Design' tab."]
["WASHINGTON NATURAL GAS"]
["PRESENT AND PROPOSED RATE COMPONENTS BY SCHEDULE"]
[]
[]
[]
[null,null,null,null,null,null,null,null,"Proposed"]
[null,null,null,"Present Base","Present",null,"General ","Proposed ","Base "]
{"$rows_left_out":57}
{"sheet":"ROR","index":2,"n_rows":94,"n_cols":17,"rows_kept":94,"cut":false,"hidden":false,"merged":[]}
[null,"AVISTA UTILITIES"]
[null,"WASHINGTON GAS"]
[null,"PRESENT & PROPOSED RATE OF RETURN BY RATE SCHEDULE"]
[null,"12 MONTHS ENDED DECEMBER 31, 2019"]
[]
[]
[null,null,"Total","Sch 101","Sch 111","Sch 121","Sch 131","Sch 146"]
[null,"Total Rate Base",{"$f":"SUM(D8:H8)","v":455590771.80633199},367936472.16667593,64277721.093817815,0,849356.76417492633,22527221.781663284,"from COS","\"Summary\" Line 467",null,null,{"$f":"D8/$C$8","v":0.80760299579352057},{"$f":"E8/$C$8","v":0.14108652999921115},0,1.8642975598636162E-3,4.9446176647404583E-2]
{"$rows_left_out":87}
{"sheet":"Rate Spread","index":3,"n_rows":69,"n_cols":14,"rows_kept":69,"cut":false,"hidden":false,"merged":[]}
[]
["Avista"]
["Natural Gas"]
["Rate Spread"]
[]
[]
[null,null,null,"Base Tariff",null,"Base",null,"Base Tariff","Total Billed","Percent "]
[null,null,null,"Distribution Revenue","Percentage ","Tariff","Proposed","Distribution Revenue","Revenue","Increase"]
{"$rows_left_out":62}
{"sheet":"Rate Design","index":4,"n_rows":122,"n_cols":22,"rows_kept":122,"cut":false,"hidden":false,"merged":[]}
["PRESENT RATES",null,null,1,2,3,4,5,null,null,null,"Tiers - used for bill comparisons"]
[null,null,"TOTAL","SCH. 101","SCH. 111,112,116","SCH. 121,122,126","SCH. 132","SCH. 146",null,"Range Name",null,"SCH. 101","SCH. 111,112","SCH. 121,122","SCH. 131,132","SCH. 146"]
[null,"Base Tariff Rates"]
[1,"BASIC CHARGE",null,9.5,null,null,null,625]
[2,"MONTHLY MINIMUM",null,null,107.56]
[3,"BLOCK 1 PER THERM",null,41.034999999999997,0,null,27.007999999999999,10.494,null,null,null,9999999,200,500,10000,20000]
[4,"BLOCK 2 PER THERM",null,53.332999999999998,36.158999999999999,null,21.681000000000001,9.3360000000000003,{"$f":"H7/H6-1","v":-0.11034877072612914},null,null,9999999,1000,1000,25000,50000]
[5,"BLOCK 3 PER THERM",null,null,27.562000000000001,null,20.373000000000001,8.4190000000000005,{"$f":"H8/H7-1","v":-9.8221936589545811E-2},"Rates_Base_Present",null,9999999,9999999,10000,50000,300000]
{"$rows_left_out":115}
{"sheet":"Bill Impact","index":5,"n_rows":102,"n_cols":30,"rows_kept":102,"cut":false,"hidden":false,"merged":[]}
[null,null,null,null,null,null,null,null,null,null,null,null,null,null,null,null,null,null,null,"tax credit with staff pass back method",null,null,null,"Exh. BAE-8"]
["Schedule 101 Bill Impact",null,null,null,null,null,null,null,null,null,null,null,null,null,null,null,null,null,null,"first 70",null,3.6171020051914034E-2]
[null,null,null,null,null,null,null,null,null,null,null,null,null,null,null,null,null,null,null,"over 70",null,4.7011307723375924E-2]
[]
[null,null,null,null,null,null,null,null,null,null,null,null,null,null,null,null,"tax credit"]
["Schedule 101 Present",null,null,null,null,null,"Schedule 101 Proposed"]
[null,"Basic Charge","Block 1","Block 2","Total Bill",null,"Basic Charge","Block 1","Block 2","Total Bill",null,"Bill Impact","% Change",null,null,null,"Schedule 101 Present",null,null,null,null,null,"Schedule 101 Proposed"]
[null,{"$f":"'Rate Design'!D4","v":9.5},{"$f":"'Rate Design'!D16/100","v":0.70194000000000001},{"$f":"'Rate Design'!D17/100","v":0.8249200000000001},null,null,{"$f":"'Rate Design'!D26","v":9.5},{"$f":"'Exh. ELJ-6 NG Bill Components'!H15","v":0.73653000000000002},{"$f":"'Exh. ELJ-6 NG Bill Components'!H16","v":0.86987000000000014},null,null,null,null,null,null,null,null,"Basic Charge","Block 1","Block 2","Total Bill",null,"Basic Charge","Block 1","Block 2","Tax Credit","Total Bill",null,"Bill Impact","% Change"]
{"$rows_left_out":95}
{"sheet":"Pres & Prop Rev","index":6,"n_rows":283,"n_cols":17,"rows_kept":283,"cut":false,"hidden":false,"merged":[[5,16,10,18]]}
[]
[]
[null,null,null,null,null,null,null,null,null,"TRANSPORT"]
["WORK PAPER",null," ","GEN SERVICE","LRG GEN SVC","EX LRG GEN SVC","INTERRUPTIBLE","TRANSPORT","TRANSPORT","SCH 148 - WSU"]
["REFERENCE",null,"TOTAL","SCH. 101 & 102","SCH. 111,112&116","SCH. 121,122&126","SCH. 131&132","SCHEDULE 146","SCHEDULE 148","ANN. MINIMUM",null,null,null,null,null,null,"Print Header for all printed pages on this worksheet:"]
[null,"PRESENT BILL DETERMINANTS",null,null,null,null,null,null,null,null,null,null,"Calculate all revenue exhibits using  ____ rates:",null,null,null,{"$f":"\"AVISTA UTILITIES\nWASHINGTON NATURAL GAS\nPRO FORMA REVENUE UNDER PRESENT AND PROPOSED \"&O9&\" RATES\n12 MONTHS ENDED DECEMBER 31, 2019\"","v":"AVISTA UTILITIES\nWASHINGTON NATURAL GAS\nPRO FORMA REVENUE UNDER PRESENT AND PROPOSED BASE TARIFF RATES\n12 MONTHS ENDED DECEMBER 31, 2019"}]
[null,"THERMS",null,null,null,null,null,null,null,null,null,"1)","BASE TARIFF"]
["JDM-G-8","BLOCK 1",null,{"$f":"'Bill Determ'!E7","v":83030622.512147844},{"$f":"'Bill Determ'!B24","v":6558198.1454840573},"Sch 121/122 disc",{"$f":"'Bill Determ'!B37","v":220000},{"$f":"'Bill Determ'!B41","v":8146142},{"$f":"'Bill Determ'!B47","v":24245810},{"$f":"'Bill Determ'!B53","v":10933465},null,null,"or",null,1]
{"$rows_left_out":276}
{"sheet":"Proposed Increase","index":7,"n_rows":44,"n_cols":24,"rows_kept":44,"cut":false,"hidden":false,"merged":[[0,13,2,14],[24,0,25,7]]}
["AVISTA UTILITIES",null,null,null,null,null,null,null,null,null,null,null,null,"This worksheet pulls data from 'Pres & Prop Rev' tab."]
["WASHINGTON NATURAL GAS"]
["PROPOSED INCREASE BY SERVICE SCHEDULE"]
["12 MONTHS ENDED DECEMBER 31, 2019"]
["(000s of Dollars)"]
[]
[]
[null,null,null,"Base Tariff",null,"Base Tariff","Base","Total Billed",null,null,"Percent "]
{"$rows_left_out":37}
{"sheet":"Present&Propoed Class ROR","index":8,"n_rows":20,"n_cols":14,"rows_kept":20,"cut":false,"hidden":false,"merged":[]}
["AVISTA UTILITIES",null,null,null,null,null,null,null,null,null,null,null,null,"This worksheet pulls data from 'ROR' tab."]
["WASHINGTON NATURAL GAS"]
["PRESENT & PROPOSED RATES OF RETURN BY RATE SCHEDULE"]
["12 MONTHS ENDED DECEMBER 31, 2019"]
[]
[]
[]
[]
{"$rows_left_out":13}
{"sheet":"BFG","index":9,"n_rows":24,"n_cols":6,"rows_kept":24,"cut":false,"hidden":true,"merged":[]}
["AVISTA UTILITIES"]
["GAS ANNUAL MINIMUM DEFICIENCY FOR B.F. GOODRICH"]
["STATE OF WASHINGTON"]
["BASED ON 2007 ANNUAL MINIMUM"]
[]
[null,null,null,null,null,"Gas"]
["Annual Minimum Usage Requirement(1)",null,null,null,null,10500000]
["Less: Jan 09 - Dec 09 Usage(2)",null,null,null,null,{"$f":"SUMIF('Big Schedules'!$B$4:$B$47,\"BF Goodrich\",'Big Schedules'!$O$4:$O$47)","v":0}]
{"$rows_left_out":17}
{"sheet":"Bill Determ","index":10,"n_rows":99,"n_cols":8,"rows_kept":99,"cut":false,"hidden":false,"merged":[]}
["AVISTA UTILITIES"]
["WASHINGTON GAS"]
["USAGE & BILLINGS BY RATE SCHEDULE"]
["12 MONTHS ENDED DECEMBER 31, 2019"]
[]
["Schedule 101/102","Total therms","Total Billings",null,"0-70",">70","Total Therms"]
["therms per Revenue Run(1)(2)",{"$f":"'12MEDEC19'!P162","v":137563490.95253003},{"$f":"'12MEDEC19'!O26","v":1984339},null,{"$f":"'Block Usage'!O17","v":83030622.512147844},{"$f":"'Block Usage'!O18","v":54532868.440382153},{"$f":"SUM(D7:F7)","v":137563490.95253}]
[null,null,null,null,null,null,{"$f":"'12MEDEC19'!P162","v":137563490.95253003}]
{"$rows_left_out":92}
{"sheet":"LIRAP","index":11,"n_rows":21,"n_cols":19,"rows_kept":21,"cut":false,"hidden":false,"merged":[]}
[]
[]
[]
[]
[null,"Scheduling 192 - LIRAP"]
[]
[]
[null,null,null,null,"Present ","Present",null,"Proposed","Proposed",null,"Total",null,null,null,null,null,null,"Present "]
{"$rows_left_out":14}
{"sheet":"Block Usage","index":12,"n_rows":66,"n_cols":16,"rows_kept":66,"cut":false,"hidden":false,"merged":[]}
["WASHINGTON NATURAL GAS SYSTEM"]
[null,null,"January","February","March","April","May","June","July","August","September","October","November","December","Annual Total"]
["Rate Design Program Monthly Results"]
[null,"Schedule 101/102"]
[null,"Block 1",{"$f":"'12MEDEC19'!D54+'12MEDEC19'!D67","v":10610601.1073},{"$f":"'12MEDEC19'!E54+'12MEDEC19'!E67","v":10486299.11736},{"$f":"'12MEDEC19'!F54+'12MEDEC19'!F67","v":10910412.131150002},{"$f":"'12MEDEC19'!G54+'12MEDEC19'!G67","v":8797187.1996599995},{"$f":"'12MEDEC19'!H54+'12MEDEC19'!H67","v":5885884.22315},{"$f":"'12MEDEC19'!I54+'12MEDEC19'!I67","v":2897129.94001},{"$f":"'12MEDEC19'!J54+'12MEDEC19'!J67","v":2322824.8435300002},{"$f":"'12MEDEC19'!K54+'12MEDEC19'!K67","v":1984671.03452},{"$f":"'12MEDEC19'!L54+'12MEDEC19'!L67","v":2237133.5785599998},{"$f":"'12MEDEC19'!M54+'12MEDEC19'!M67","v":6569382.8929300001},{"$f":"'12MEDEC19'!N54+'12MEDEC19'!N67","v":9629226.2274099998},{"$f":"'12MEDEC19'!O54+'12MEDEC19'!O67","v":10707855.479810001},{"$f":"SUM(C5:N5)","v":83038607.775389999}]
[null,"Block 2",{"$f":"'12MEDEC19'!D55+'12MEDEC19'!D68","v":10581701.580189999},{"$f":"'12MEDEC19'!E55+'12MEDEC19'!E68","v":11447521.42058},{"$f":"'12MEDEC19'!F55+'12MEDEC19'!F68","v":13032219.303749999},{"$f":"'12MEDEC19'!G55+'12MEDEC19'!G68","v":3084148.6071700002},{"$f":"'12MEDEC19'!H55+'12MEDEC19'!H68","v":703411.48149999999},{"$f":"'12MEDEC19'!I55+'12MEDEC19'!I68","v":184270.97279},{"$f":"'12MEDEC19'!J55+'12MEDEC19'!J68","v":212771.11794000003},{"$f":"'12MEDEC19'!K55+'12MEDEC19'!K68","v":157927.09281},{"$f":"'12MEDEC19'!L55+'12MEDEC19'!L68","v":206884.56177},{"$f":"'12MEDEC19'!M55+'12MEDEC19'!M68","v":1038308.0353100001},{"$f":"'12MEDEC19'!N55+'12MEDEC19'!N68","v":4317670.0186799997},{"$f":"'12MEDEC19'!O55+'12MEDEC19'!O68","v":9570046.6046500001},{"$f":"SUM(C6:N6)","v":54536880.797139995}]
["Therms","Total",{"$f":"SUM(C5:C6)","v":21192302.687490001},21933820.537939999,23942631.434900001,11881335.80683,6589295.7046499997,3081400.9128,2535595.9614700004,2142598.12733,2444018.1403299998,7607690.9282400003,13946896.246089999,20277902.084460001,137575488.57253]
[null,"Billed Customers",{"$f":"'12MEDEC19'!C26","v":164455},{"$f":"'12MEDEC19'!D26","v":161561},{"$f":"'12MEDEC19'!E26","v":167095},{"$f":"'12MEDEC19'!F26","v":163106},{"$f":"'12MEDEC19'!G26","v":166886},{"$f":"'12MEDEC19'!H26","v":164587},{"$f":"'12MEDEC19'!I26","v":165355},{"$f":"'12MEDEC19'!J26","v":165693},{"$f":"'12MEDEC19'!K26","v":162332},{"$f":"'12MEDEC19'!L26","v":169448},{"$f":"'12MEDEC19'!M26","v":166729},{"$f":"'12MEDEC19'!N26","v":167092},{"$f":"SUM(C8:N8)","v":1984339}]
{"$rows_left_out":59}
{"sheet":"Big Schedules","index":13,"n_rows":109,"n_cols":46,"rows_kept":109,"cut":false,"hidden":false,"merged":[]}
[null,"Washington Gas Billing Determinants by Customer"]
[null,null,null,null,null,null,null,null,null,null,null,null,null,null,null,null,"1st",{"$f":"Q3","v":20000},{"$f":"R3","v":50000},{"$f":"S3","v":300000},{"$f":"T3","v":500000},null,"Present","Proposed"]
[null,"ANNUAL USAGE, Sch 146",null,null,null,null,null,null,null,null,null,null,null,null,"12-mo ended",null,20000,50000,300000,500000,99999999,null,"Annual","Annual","Present Base","Proposed Base"]
[null,"Washington","2019-01-01","2019-02-01","2019-03-01","2019-04-01","2019-05-01","2019-06-01","2019-07-01","2019-08-01","2019-09-01","2019-10-01","2019-11-01","2019-12-01","Total",null,"thms/mo","thms/mo","thms/mo","thms/mo","thms/mo",null,"Minimum","Minimum","Revenue","Revenue"]
[1,"Deaconess Medical Center                          ",136935,141948,159270,130278,94746,87324,76742,74037,68716,77822,111113,127723,{"$f":"SUM(C5:N5)","v":1286654},null,{"$f":"Q$3*12-SUMPRODUCT(--($C5:$N5<=Q$3),Q$3-$C5:$N5)","v":240000},{"$f":"R$3*12-SUM($Q5:Q5)-SUMPRODUCT(--($C5:$N5<=R$3),R$3-$C5:$N5)","v":360000},{"$f":"S$3*12-SUM($Q5:R5)-SUMPRODUCT(--($C5:$N5<=S$3),S$3-$C5:$N5)","v":686654},{"$f":"T$3*12-SUM($Q5:S5)-SUMPRODUCT(--($C5:$N5<=T$3),T$3-$C5:$N5)","v":0},{"$f":"U$3*12-SUM($Q5:T5)-SUMPRODUCT(--($C5:$N5<=U$3),U$3-$C5:$N5)","v":0},null,{"$f":"IF(O5<250000,(250000-O5)*'Exh. ELJ-6 NG Bill Components'!$E$56,0)","v":0},{"$f":"IF(O5<250000,(250000-O5)*'Exh. ELJ-6 NG Bill Components'!$I$56,0)","v":0},{"$f":"Q5*'Exh. ELJ-6 NG Bill Components'!$D$51+'Big Schedules'!R5*'Exh. ELJ-6 NG Bill Components'!$D$52+'Big Schedules'!S5*'Exh. ELJ-6 NG Bill Components'!$D$53+'Big Schedules'!T5*'Exh. ELJ-6 NG Bill Components'!$D$54+'Big Schedules'!U5*'Exh. ELJ-6 NG Bill Components'!$D$55+'Exh. ELJ-6 NG Bill Components'!$D$49*12+W5","v":124104.60026000001},{"$f":"Q5*'Exh. ELJ-6 NG Bill Components'!$I$51+'Big Schedules'!R5*'Exh. ELJ-6 NG Bill Components'!$I$52+'Big Schedules'!S5*'Exh. ELJ-6 NG Bill Components'!$I$53+'Big Schedules'!T5*'Exh. ELJ-6 NG Bill Components'!$I$54+'Big Schedules'!U5*'Exh. ELJ-6 NG Bill Components'!$I$55+'Exh. ELJ-6 NG Bill Components'!$I$49*12+X5","v":132248.52578},{"$f":"Z5/Y5-1","v":6.5621463692227433E-2}]
[{"$f":"A5+1","v":2},"92 Ces/Cer-M (to Sch 112)                                     ",398669,423181,468841,335580,183201,55128,24793,16538,15451,56217,{"$f":"25000+193461","v":218461},{"$f":"25000+9447.51115+302320.35685","v":336767.86799999996},{"$f":"SUM(C6:N6)","v":2532827.8679999998},null,231989,{"$f":"R$3*12-SUM($Q6:Q6)-SUMPRODUCT(--($C6:$N6<=R$3),R$3-$C6:$N6)","v":274793},{"$f":"S$3*12-SUM($Q6:R6)-SUMPRODUCT(--($C6:$N6<=S$3),S$3-$C6:$N6)","v":1563007},{"$f":"T$3*12-SUM($Q6:S6)-SUMPRODUCT(--($C6:$N6<=T$3),T$3-$C6:$N6)","v":463038.86799999978},{"$f":"U$3*12-SUM($Q6:T6)-SUMPRODUCT(--($C6:$N6<=U$3),U$3-$C6:$N6)","v":0},null,{"$f":"IF(O6<250000,(250000-O6)*'Exh. ELJ-6 NG Bill Components'!$E$56,0)","v":0},{"$f":"IF(O6<250000,(250000-O6)*'Exh. ELJ-6 NG Bill Components'!$I$56,0)","v":0},{"$f":"Q6*'Exh. ELJ-6 NG Bill Components'!$D$51+'Big Schedules'!R6*'Exh. ELJ-6 NG Bill Components'!$D$52+'Big Schedules'!S6*'Exh. ELJ-6 NG Bill Components'!$D$53+'Big Schedules'!T6*'Exh. ELJ-6 NG Bill Components'!$D$54+'Big Schedules'!U6*'Exh. ELJ-6 NG Bill Components'!$D$55+'Exh. ELJ-6 NG Bill Components'!$D$49*12+W6","v":225136.73534379998},{"$f":"Q6*'Exh. ELJ-6 NG Bill Components'!$I$51+'Big Schedules'!R6*'Exh. ELJ-6 NG Bill Components'!$I$52+'Big Schedules'!S6*'Exh. ELJ-6 NG Bill Components'!$I$53+'Big Schedules'!T6*'Exh. ELJ-6 NG Bill Components'!$I$54+'Big Schedules'!U6*'Exh. ELJ-6 NG Bill Components'!$I$55+'Exh. ELJ-6 NG Bill Components'!$I$49*12+X6","v":240338.27767571993},{"$f":"Z6/Y6-1","v":6.7521376770015351E-2}]
[{"$f":"A6+1","v":3},"Baker Commodities Inc.                            ",37257,52126,36826,37633,46107,37644,32545,40575,33469,33325,46682,36861,{"$f":"SUM(C7:N7)","v":471050},null,240000,{"$f":"R$3*12-SUM($Q7:Q7)-SUMPRODUCT(--($C7:$N7<=R$3),R$3-$C7:$N7)","v":228924},{"$f":"S$3*12-SUM($Q7:R7)-SUMPRODUCT(--($C7:$N7<=S$3),S$3-$C7:$N7)","v":2126},{"$f":"T$3*12-SUM($Q7:S7)-SUMPRODUCT(--($C7:$N7<=T$3),T$3-$C7:$N7)","v":0},{"$f":"U$3*12-SUM($Q7:T7)-SUMPRODUCT(--($C7:$N7<=U$3),U$3-$C7:$N7)","v":0},null,{"$f":"IF(O7<250000,(250000-O7)*'Exh. ELJ-6 NG Bill Components'!$E$56,0)","v":0},{"$f":"IF(O7<250000,(250000-O7)*'Exh. ELJ-6 NG Bill Components'!$I$56,0)","v":0},{"$f":"Q7*'Exh. ELJ-6 NG Bill Components'!$D$51+'Big Schedules'!R7*'Exh. ELJ-6 NG Bill Components'!$D$52+'Big Schedules'!S7*'Exh. ELJ-6 NG Bill Components'!$D$53+'Big Schedules'!T7*'Exh. ELJ-6 NG Bill Components'!$D$54+'Big Schedules'!U7*'Exh. ELJ-6 NG Bill Components'!$D$55+'Exh. ELJ-6 NG Bill Components'!$D$49*12+W7","v":54236.932580000001},{"$f":"Q7*'Exh. ELJ-6 NG Bill Components'!$I$51+'Big Schedules'!R7*'Exh. ELJ-6 NG Bill Components'!$I$52+'Big Schedules'!S7*'Exh. ELJ-6 NG Bill Components'!$I$53+'Big Schedules'!T7*'Exh. ELJ-6 NG Bill Components'!$I$54+'Big Schedules'!U7*'Exh. ELJ-6 NG Bill Components'!$I$55+'Exh. ELJ-6 NG Bill Components'!$I$49*12+X7","v":57501.217940000002},{"$f":"Z7/Y7-1","v":6.0185655875452548E-2}]
[4,"Western States Asphalt Inc                        ",382,484,573,5051,26227,21219,21075,25610,19545,17065,16614,446,154291,null,140160,{"$f":"R$3*12-SUM($Q8:Q8)-SUMPRODUCT(--($C8:$N8<=R$3),R$3-$C8:$N8)","v":14131},{"$f":"S$3*12-SUM($Q8:R8)-SUMPRODUCT(--($C8:$N8<=S$3),S$3-$C8:$N8)","v":0},{"$f":"T$3*12-SUM($Q8:S8)-SUMPRODUCT(--($C8:$N8<=T$3),T$3-$C8:$N8)","v":0},{"$f":"U$3*12-SUM($Q8:T8)-SUMPRODUCT(--($C8:$N8<=U$3),U$3-$C8:$N8)","v":0},null,{"$f":"IF(O8<250000,(250000-O8)*'Exh. ELJ-6 NG Bill Components'!$E$56,0)","v":8935.3922399999992},{"$f":"IF(O8<250000,(250000-O8)*'Exh. ELJ-6 NG Bill Components'!$I$56,0)","v":9559.4149199999993},{"$f":"Q8*'Exh. ELJ-6 NG Bill Components'!$D$51+'Big Schedules'!R8*'Exh. ELJ-6 NG Bill Components'!$D$52+'Big Schedules'!S8*'Exh. ELJ-6 NG Bill Components'!$D$53+'Big Schedules'!T8*'Exh. ELJ-6 NG Bill Components'!$D$54+'Big Schedules'!U8*'Exh. ELJ-6 NG Bill Components'!$D$55+'Exh. ELJ-6 NG Bill Components'!$D$49*12+W8","v":32463.052799999998},{"$f":"Q8*'Exh. ELJ-6 NG Bill Components'!$I$51+'Big Schedules'!R8*'Exh. ELJ-6 NG Bill Components'!$I$52+'Big Schedules'!S8*'Exh. ELJ-6 NG Bill Components'!$I$53+'Big Schedules'!T8*'Exh. ELJ-6 NG Bill Components'!$I$54+'Big Schedules'!U8*'Exh. ELJ-6 NG Bill Components'!$I$55+'Exh. ELJ-6 NG Bill Components'!$I$49*12+X8","v":34206.582399999999},5.3708121991533853E-2]
{"$rows_left_out":102}
{"sheet":"12MEDEC19","index":14,"n_rows":214,"n_cols":16,"rows_kept":214,"cut":false,"hidden":false,"merged":[]}
[]
[]
["Gas Revenue Meters Report by Location  Twelve Months Ended  for Report Date : '12/31/2019'"]
[]
["State Cde:WA"]
[]
[null,null,"Meters"]
[null,"Period",201901,201902,201903,201904,201905,201906,201907,201908,201909,201910,201911,201912,"12 Month Average","12 Month Total"]
{"$rows_left_out":206}