{"text_format":"1","workbook":"xlsx","n_sheets":17,"sheets":["Exh. ELJ-5 E Bill Impact","Exh. ELJ-5 E Bill Components","ROR","Rate Spread GRC","Rate Design","Pres & Prop Rev","Proposed Increase","Present&Prop Class ROR","Bill Determ","LIRAP","WA Sch 25","Lighting summary","St Lts","Area Lts","Capital Recovery Factor Calc","Block Data","REVRUNS 12ME1219"],"not_rendered":{"charts":0,"images":0,"macros":1,"external_links":0,"defined_names":53,"comments":9,"pivot_tables":0},"unopened":[],"bounds":{"document_bytes":16777216,"sheet_cells":100000,"rows_first":2000,"rows_last":500,"rows_between":2000,"halvings":0,"cell_chars":16384,"cell_head_chars":4096},"cells_cut":0,"cells_raw":0,"read":"whole","date_system":"1900"}

{"sheet":"Exh. ELJ-5 E Bill Impact","index":0,"n_rows":54,"n_cols":14,"rows_kept":54,"cut":false,"hidden":false,"merged":[]}
[null,null,null,null,"AVISTA UTILITIES"]
[null,null,null,null,"WASHINGTON ELECTRIC"]
[null,null,null,null,"PRESENT AND PROPOSED RATE COMPONENTS BY SCHEDULE"]
[null,null,null,"STAFF PROPOSED"]
[]
[]
["Schedule 001 Bill Impact"]
[]
{"$rows_left_out":47}
{"sheet":"Exh. ELJ-5 E Bill Components","index":1,"n_rows":64,"n_cols":22,"rows_kept":64,"cut":false,"hidden":false,"merged":[[10,0,10,2],[3,4,3,5]]}
["AVISTA UTILITIES",null,null,null,null,null,null,null,null,null,null,null,null,null,null,null,null,"This worksheet uses Base & Billing rates from 'Rate Design' tab."]
["WASHINGTON ELECTRIC"]
["PRESENT AND PROPOSED RATE COMPONENTS BY SCHEDULE"]
[null,null,null,null,"STAFF PROPOSED"]
[]
[]
[]
[]
{"$rows_left_out":57}
{"sheet":"ROR","index":2,"n_rows":83,"n_cols":11,"rows_kept":83,"cut":false,"hidden":false,"merged":[]}
[null,"AVISTA UTILITIES"]
[null,"WASHINGTON ELECTRIC"]
[null,"PRESENT & PROPOSED RATE OF RETURN BY RATE SCHEDULE"]
[null,"12 MONTHS ENDED DECEMBER 31, 2018"]
[]
[]
[null,null,"Total","Sch 1","Sch 11","Sch 21","Sch 25","Sch 31","Schs 41-48"]
[null,"Total Rate Base",{"$f":"SUM(D8:I8)","v":1877557000.0000005},1000841965.7402405,232908575.8238568,385101730.77506745,181619969.14785999,43824830.075690314,33259928.437285367,"from COS"]
{"$rows_left_out":76}
{"sheet":"Rate Spread GRC","index":3,"n_rows":90,"n_cols":13,"rows_kept":90,"cut":false,"hidden":false,"merged":[]}
[]
[]
["Avista"]
["Electric"]
["Rate Spread"]
[]
[]
[]
{"$rows_left_out":83}
{"sheet":"Rate Design","index":4,"n_rows":127,"n_cols":23,"rows_kept":127,"cut":false,"hidden":false,"merged":[]}
["PRESENT RATES",null,null,1,2,3,4,5,6,null,null,null,null,"Tiers - used for bill comparisons"]
[null,null,"TOTAL","SCH. 1,2","SCH. 11,12","SCH. 21,22","SCH. 25","SCH. 30, 31, 32",null,null,null,"Range Name",null,"SCHEDULE 1,2","SCH. 11,12","SCH. 21,22","SCHEDULE 25","SCH. 30, 31, 32"]
[null,"Base Tariff Rates"]
[1,"BASIC CHARGE",null,9,20,0,0,20]
[2,"BLOCK 1 PER KWH",null,8.1029999999999998,11.686,7.5350000000000001,5.5049999999999999,10.292,null,null,null,null,null,800,3650,250000,500000]
[3,"BLOCK 2 PER KWH",null,9.4269999999999996,8.5879999999999992,6.742,4.9530000000000003,7.35,null,null,null,null,null,1500,9999999,9999999,9999999]
[4,"BLOCK 3 PER KWH",null,11.053000000000001,0,0,4.2350000000000003,0,null,null,null,"Rates_Base_Present",null,9999999,9999999,9999999,9999999]
[5,"BLOCK 4 PER KWH"]
{"$rows_left_out":120}
{"sheet":"Pres & Prop Rev","index":5,"n_rows":305,"n_cols":16,"rows_kept":305,"cut":false,"hidden":false,"merged":[[5,15,10,17],[94,1,95,7]]}
[]
[null,{"$f":"IF(Base1_Billing2=2,\"BILLED\",\"\")","v":""}]
[]
["WORK PAPER",null," ","RESIDENTIAL","GENERAL SVC. ","LG. GEN. SVC.","EX LG GEN SVC","PUMPING","ST & AREA LTG"]
["REFERENCE",null,"TOTAL","SCHEDULE 1,2","SCH. 11,12","SCH. 21,22","SCHEDULE 25","SCH. 30, 31, 32","SCH. 41-48",null,null,null,null,null,null,"Print Header for all printed pages on this worksheet:"]
[null,"PRESENT BILL DETERMINANTS",null,null,null,null,null,null,null,null,null,"Calculate all revenue exhibits using  ____ rates:",null,null,null,{"$f":"\"AVISTA UTILITIES\nWASHINGTON ELECTRIC\nPRO FORMA REVENUE UNDER PRESENT AND PROPOSED \"&N9&\" RATES\n12 MONTHS ENDED DECEMBER 31, 2019\"","v":"AVISTA UTILITIES\nWASHINGTON ELECTRIC\nPRO FORMA REVENUE UNDER PRESENT AND PROPOSED BASE TARIFF RATES\n12 MONTHS ENDED DECEMBER 31, 2019"}]
[null,"KILOWATT HOURS (KWHS)",null,null,null,null,null,null,null,null,"1)","BASE TARIFF"]
["JDM-E-10","BLOCK 1",null,{"$f":"'Bill Determ'!$B$9","v":1632639774.4875689},{"$f":"'Bill Determ'!$B$17","v":435979118.38983351},{"$f":"'Bill Determ'!$B$28","v":1229791151.8036699},{"$f":"'Bill Determ'!$B$37","v":132000000},{"$f":"SUM('Bill Determ'!$B$43:$C$43)","v":46790737.710170001},null,null,null,"or",null,1]
{"$rows_left_out":298}
{"sheet":"Proposed Increase","index":6,"n_rows":71,"n_cols":27,"rows_kept":71,"cut":false,"hidden":false,"merged":[[4,0,4,18],[0,21,2,22],[0,0,0,18],[1,0,1,18],[2,0,2,18],[3,0,3,18]]}
["AVISTA UTILITIES",null,null,null,null,null,null,null,null,null,null,null,null,null,null,null,null,null,null,null,null,"This worksheet pulls data from 'Pres & Prop Rev' tab."]
["WASHINGTON ELECTRIC"]
["PROPOSED INCREASE BY SERVICE SCHEDULE"]
["12 MONTHS ENDED DECEMBER 31, 2019"]
["(000s of Dollars)"]
[]
[]
[]
{"$rows_left_out":64}
{"sheet":"Present&Prop Class ROR","index":7,"n_rows":20,"n_cols":14,"rows_kept":20,"cut":false,"hidden":false,"merged":[]}
["AVISTA UTILITIES",null,null,null,null,null,null,null,null,null,null,null,null,"This worksheet pulls data from 'ROR' tab."]
["WASHINGTON ELECTRIC"]
["PRESENT & PROPOSED RATES OF RETURN BY RATE SCHEDULE"]
["12 MONTHS ENDED DECEMBER 31, 2019"]
[]
[]
[]
[]
{"$rows_left_out":13}
{"sheet":"Bill Determ","index":8,"n_rows":86,"n_cols":7,"rows_kept":86,"cut":false,"hidden":false,"merged":[]}
["AVISTA UTILITIES"]
["WASHINGTON ELECTRIC"]
["ACTUAL / PRO FORMA BILLING DETERMINANTS BY RATE SCHEDULE"]
["12 MONTHS ENDED DECEMBER 31, 2019"]
[]
[]
[]
["Schedule 1, 2","0-800 kWhs","801-1500 kWhs","over 1500 kWhs","Total kWhs","Total Billings(2)"]
{"$rows_left_out":79}
{"sheet":"LIRAP","index":9,"n_rows":47,"n_cols":22,"rows_kept":47,"cut":false,"hidden":false,"merged":[]}
[]
[]
[null,"Schedule 92 LIRAP Funding"]
[]
[]
[null,null,null,null,null,null,null,null,null,null,"Total"]
[null,null,null,"LIRAP","Present","Present ",null,"Proposed","Proposed",null,"Incremental ",null,null,null,null,null,null,"Present "]
[null,"Type of","Schedule","Billing","LIRAP Funding","LIRAP Funding","LIRAP Funding","LIRAP Funding","LIRAP Funding",null,"Rate",null,null,null,null,null,null,"Billing "]
{"$rows_left_out":40}
{"sheet":"WA Sch 25","index":10,"n_rows":175,"n_cols":23,"rows_kept":175,"cut":false,"hidden":false,"merged":[]}
["Washington Schedule 25 Billing Determinants",null,null,null,null,null,null,null,null,null,null,null,null,null,null,null,"1st",{"$f":"Q2","v":500000},{"$f":"R2","v":6000000}]
[null,null,null,null,null,null,null,null,null,null,null,null,null,null,null,"12-mo Ended",500000,6000000,99999999]
["KWHs",null,"Acct No.","2019-01-01","2019-02-01","2019-03-01","2019-04-01","2019-05-01","2019-06-01","2019-07-01","2019-08-01","2019-09-01","2019-10-01","2019-11-01","2019-12-01","Total","kwhs/mo","kwhs/mo","kwhs/mo"]
[1,null,"2311008572",6430355.4000000004,5834220,6772222.7999999998,5461138.2000000002,6566826,6641355,6479961.5999999996,6676870.2000000002,6590295.5999999996,4241370,3978168.6,3647007,{"$f":"SUM(D4:O4)","v":69319790.400000006},{"$f":"Q$2*12-SUMPRODUCT(--($D4:$O4<=Q$2),Q$2-$D4:$O4)","v":6000000},{"$f":"R$2*12-SUM($Q4:Q4)-SUMPRODUCT(--($D4:$O4<=R$2),R$2-$D4:$O4)","v":59161903.799999997},{"$f":"S$2*12-SUM($Q4:R4)-SUMPRODUCT(--($D4:$O4<=S$2),S$2-$D4:$O4)","v":4157886.6000001431}]
[2,null,"8920023327",2489222.4,2924871.6,3069759,2967686.4,2938063.8,2839666.2,2858247,2982000,2826234.6,2987325.6,2858725.8,2088534,33830336.400000006,{"$f":"Q$2*12-SUMPRODUCT(--($D5:$O5<=Q$2),Q$2-$D5:$O5)","v":6000000},{"$f":"R$2*12-SUM($Q5:Q5)-SUMPRODUCT(--($D5:$O5<=R$2),R$2-$D5:$O5)","v":27830336.399999999},{"$f":"S$2*12-SUM($Q5:R5)-SUMPRODUCT(--($D5:$O5<=S$2),S$2-$D5:$O5)","v":0}]
[3,null,"9920023116",1540777,1346983.4,1473201.8,1247283.8,1264634,1231641.6000000001,1276636.2,1211726.6000000001,1230002.2,1437599.8,1268366.3999999999,1327428.2,15856280.999999998,6000000,{"$f":"R$2*12-SUM($Q6:Q6)-SUMPRODUCT(--($D6:$O6<=R$2),R$2-$D6:$O6)","v":9856281},{"$f":"S$2*12-SUM($Q6:R6)-SUMPRODUCT(--($D6:$O6<=S$2),S$2-$D6:$O6)","v":0}]
[4,null,"8970099313",1352948.1,1264439.3999999999,1402041.9,1231146,1287875.3999999999,1221032.3999999999,1295525.7,1267560,1223764.504,1341954.6000000001,1374168.6,1435293.3,15697749.904000001,6000000,{"$f":"R$2*12-SUM($Q7:Q7)-SUMPRODUCT(--($D7:$O7<=R$2),R$2-$D7:$O7)","v":9697749.9039999917},{"$f":"S$2*12-SUM($Q7:R7)-SUMPRODUCT(--($D7:$O7<=S$2),S$2-$D7:$O7)","v":0}]
[5,null,"0080095044",1702092,1591291.8,1673399.7,1630085.1,1897795.2,1883613.9,2068525.2,2152669.0499999998,1809992.1,1622814.9,1526811.3,1680707.7,21239797.949999999,6000000,{"$f":"R$2*12-SUM($Q8:Q8)-SUMPRODUCT(--($D8:$O8<=R$2),R$2-$D8:$O8)","v":15239797.949999996},{"$f":"S$2*12-SUM($Q8:R8)-SUMPRODUCT(--($D8:$O8<=S$2),S$2-$D8:$O8)","v":0}]
{"$rows_left_out":168}
{"sheet":"Lighting summary","index":11,"n_rows":55,"n_cols":16,"rows_kept":55,"cut":false,"hidden":false,"merged":[[6,2,6,3],[6,5,6,6]]}
[null,"AVISTA UTILITIES"]
[null,"WASHINGTON ELECTRIC"]
[null,"STREET & AREA LIGHT REVENUE UNDER PRESENT & PROPOSED RATES"]
[null,"12 MONTHS ENDED DECEMBER 31, 2019"]
[]
[]
[null,null,{"$f":"\"Present \"&IF(Base1_Billing2=2,\"Billing \",\"\")&\"Rates(1)\"","v":"Present Rates(1)"},{"$f":"\"Present \"&IF(Base1_Billing2=2,\"Billing\",\"\")&\" Rates\"","v":"Present  Rates"},null,{"$f":"\"Proposed \"&IF(Base1_Billing2=2,\"Billing \",\"\")&\"Rates(2)\"","v":"Proposed Rates(2)"},{"$f":"\"Proposed \"&IF(Base1_Billing2=2,\"Billing \",\"\")&\"Rates\"","v":"Proposed Rates"},null,"% Revenue Change"]
[null,null,"Monthly ","Annual",null,"Monthly ","Annual",null,null,null,null,"Target Base",null,"Annual","Present","Proposed"]
{"$rows_left_out":48}
{"sheet":"St Lts","index":12,"n_rows":152,"n_cols":75,"rows_kept":152,"cut":false,"hidden":false,"merged":[]}
["Street Light Summary",null,null,null,null,null,null,null,"WASHINGTON Street Lights (Schedule 41 - 46 Rates)",null,null,null,null,null,null,null,null,null,null,null,null,null,null,null,null,null,null,null,null,null,null,null,null,null,null,"% rate increase -->",{"$f":"'Lighting summary'!L11","v":8.3000000000000004E-2},{"$f":"'Lighting summary'!L12","v":7.6499999999999999E-2},{"$f":"'Lighting summary'!L13","v":8.3000000000000004E-2},{"$f":"'Lighting summary'!L14","v":8.3000000000000004E-2},{"$f":"'Lighting summary'!L15","v":8.3000000000000004E-2},null,null,null,null,null,null,null,null,null,null,null,null,null,null,null,{"$f":"-0.00789-0.00045-0.00339","v":-1.1730000000000001E-2},"compare input Present Billing Rates to calculated Present Billing Rates",null,null,null,null,null,null,{"$f":"BF2","v":1.0150999999999999}]
["MDM-10069 Report as of 3/31/20",null,null,null,null,null,null,null,null,null,null,null,"Number of Lights(1)",null,null,null,null,null,"Present Rates",null,null,null,null,null,"Monthly Revenue at Present Rates",null,null,null,null,null,"Number of Lights",null,null,null,null,null,"Proposed Rates",null,null,null,null,null,"Monthly Revenue at Proposed Rates",null,null,null,null,null,null,null,"Present Billing Rates",null,null,null,null,null,1.3939999999999999E-2,{"$f":"1+0.0151","v":1.0150999999999999},"Sch 91 & 92",null,null,null,null,null,"New Billing Rates",null,null,null,null,null,"Increase"]
[null,null,null,null,null,null,null,null,"Fixture Type","Pole Facility","Size","Sched","041","042","044","045","046",null,"041","042","044","045","046",null,"041","042","044","045","046",null,"041","042","044","045","046",null,"041","042","044","045","046",null,"041","042","044","045","046",null,null,"kwh","041","042","044","045","046",null,"Sch 93/94","041","042","044","045","046",null,null,"041","042","044","045","046",null,"041","042","044","045","046"]
[null,null,null,null,null,null,null,null,"Single Mercury Vapor","Direct Burial",4000,214,{"$f":"SUMIF($G:$G,TEXT(M$3,\"000\")&TEXT($L4,\"000\"),$E:$E)","v":0},0,0,0,0,{"$f":"IF(SUM(M4:Q4)>0,0,1)","v":1},14.67,0,0,0,0,null,{"$f":"IF(AND(M4<>0,S4=0),#VALUE!,M4*S4)","v":0},{"$f":"IF(AND(N4<>0,T4=0),#VALUE!,N4*T4)","v":0},{"$f":"IF(AND(O4<>0,U4=0),#VALUE!,O4*U4)","v":0},{"$f":"IF(AND(P4<>0,V4=0),#VALUE!,P4*V4)","v":0},{"$f":"IF(AND(Q4<>0,W4=0),#VALUE!,Q4*W4)","v":0},null,{"$f":"M4","v":0},{"$f":"N4","v":0},{"$f":"O4","v":0},{"$f":"P4","v":0},{"$f":"Q4","v":0},null,null,{"$f":"ROUND(T4*(1+AL$1),2)","v":0},{"$f":"ROUND(U4*(1+AM$1),2)","v":0},{"$f":"ROUND(V4*(1+AN$1),2)","v":0},{"$f":"ROUND(W4*(1+AO$1),2)","v":0},null,{"$f":"IF(AND(AE4<>0,AK4=0),#VALUE!,AE4*AK4)","v":0},{"$f":"IF(AND(AF4<>0,AL4=0),#VALUE!,AF4*AL4)","v":0},{"$f":"IF(AND(AG4<>0,AM4=0),#VALUE!,AG4*AM4)","v":0},{"$f":"IF(AND(AH4<>0,AN4=0),#VALUE!,AH4*AN4)","v":0},{"$f":"IF(AND(AI4<>0,AO4=0),#VALUE!,AI4*AO4)","v":0},{"$f":"SUM(AQ4:AU4)-SUM(Y4:AC4)","v":0},null,42,14.99,null,null,null,null,null,{"$f":"ROUND(AX4*$BE$2,2)+ROUND(AX4*$BE$1,2)","v":9.9999999999999978E-2},{"$f":"ROUND((S4*$BF$2),2)+ROUND($BE4-AY4,2)","v":0},null,null,null,null,null,null,{"$f":"AK4*$BM$1","v":0},{"$f":"AL4*$BM$1","v":0},{"$f":"AM4*$BM$1","v":0},{"$f":"AN4*$BM$1","v":0},{"$f":"AO4*$BM$1","v":0},null,{"$f":"BM4-AY4","v":-14.99},{"$f":"BN4-AZ4","v":0},{"$f":"BO4-BA4","v":0},{"$f":"BP4-BB4","v":0},{"$f":"BQ4-BC4","v":0}]
[null,"State","Sched","Rate Sub","# of Lights",null,null,null,"LED (Dusk to Dawn)","Dusk to Dawn","5W","005L",0,0,0,0,0,{"$f":"IF(SUM(M5:Q5)>0,0,1)","v":1},0,0,0,0,0.21038000000000001,null,{"$f":"IF(AND(M5<>0,S5=0),#VALUE!,M5*S5)","v":0},{"$f":"IF(AND(N5<>0,T5=0),#VALUE!,N5*T5)","v":0},{"$f":"IF(AND(O5<>0,U5=0),#VALUE!,O5*U5)","v":0},{"$f":"IF(AND(P5<>0,V5=0),#VALUE!,P5*V5)","v":0},{"$f":"IF(AND(Q5<>0,W5=0),#VALUE!,Q5*W5)","v":0},null,{"$f":"SUMIF($G:$G,TEXT(AE$3,\"000\")&TEXT($L5,\"000\"),$E:$E)","v":0},0,0,0,0,null,0,null,0,0,0.23,null,0,0,0,0,0,null,null,2,null,null,null,null,0.21,null,{"$f":"ROUND(AX5*$BE$2,2)+ROUND(AX5*$BE$1,2)","v":9.9999999999999985E-3},null,null,null,null,{"$f":"ROUND((W5*$BF$2)+$BE5-BC5,2)","v":0.01},null,null,{"$f":"AK5*$BM$1","v":0},{"$f":"AL5*$BM$1","v":0},{"$f":"AM5*$BM$1","v":0},{"$f":"AN5*$BM$1","v":0},{"$f":"AO5*$BM$1","v":0.23347299999999999},null,{"$f":"BM5-AY5","v":0},{"$f":"BN5-AZ5","v":0},{"$f":"BO5-BA5","v":0},{"$f":"BP5-BB5","v":0},{"$f":"BQ5-BC5","v":2.3472999999999994E-2}]
[null,null,null,null,null,null,null,null,"LED (Dusk to Dawn)","Dusk to Dawn","5W","015L",0,0,0,0,42,{"$f":"IF(SUM(M6:Q6)>0,0,1)","v":0},0,0,0,0,0.52595000000000003,null,{"$f":"IF(AND(M6<>0,S6=0),#VALUE!,M6*S6)","v":0},{"$f":"IF(AND(N6<>0,T6=0),#VALUE!,N6*T6)","v":0},{"$f":"IF(AND(O6<>0,U6=0),#VALUE!,O6*U6)","v":0},{"$f":"IF(AND(P6<>0,V6=0),#VALUE!,P6*V6)","v":0},{"$f":"IF(AND(Q6<>0,W6=0),#VALUE!,Q6*W6)","v":22.0899},null,0,0,0,0,42,null,{"$f":"ROUND(S6*(1+AK$1),2)","v":0},null,{"$f":"ROUND(U6*(1+AM$1),2)","v":0},{"$f":"ROUND(V6*(1+AN$1),2)","v":0},{"$f":"ROUND(W6*(1+AO$1),2)","v":0.56999999999999995},null,{"$f":"IF(AND(AE6<>0,AK6=0),#VALUE!,AE6*AK6)","v":0},{"$f":"IF(AND(AF6<>0,AL6=0),#VALUE!,AF6*AL6)","v":0},{"$f":"IF(AND(AG6<>0,AM6=0),#VALUE!,AG6*AM6)","v":0},{"$f":"IF(AND(AH6<>0,AN6=0),#VALUE!,AH6*AN6)","v":0},{"$f":"IF(AND(AI6<>0,AO6=0),#VALUE!,AI6*AO6)","v":23.939999999999998},null,null,5,null,null,null,null,0.55000000000000004,null,{"$f":"ROUND(AX6*$BE$2,2)+ROUND(AX6*$BE$1,2)","v":1.0000000000000009E-2},null,null,null,null,{"$f":"ROUND((W6*$BF$2)+$BE6-BC6,2)","v":-0.01},null,null,{"$f":"AK6*$BM$1","v":0},{"$f":"AL6*$BM$1","v":0},{"$f":"AM6*$BM$1","v":0},{"$f":"AN6*$BM$1","v":0},{"$f":"AO6*$BM$1","v":0.57860699999999987},null,{"$f":"BM6-AY6","v":0},{"$f":"BN6-AZ6","v":0},{"$f":"BO6-BA6","v":0},{"$f":"BP6-BB6","v":0},{"$f":"BQ6-BC6","v":2.8606999999999827E-2}]
[null,2,"041",214,0,null,{"$f":"IF(OR(ISBLANK(C7),ISBLANK(D7)),\"\",TEXT(C7,\"000\")&TEXT(D7,\"000\"))","v":"041214"},null,"LED (Dusk to Dawn)","Dusk to Dawn","5W","025L",0,0,0,0,45,0,0,0,0,0,0.94671000000000005,null,0,0,0,0,42.601950000000002,null,0,0,0,0,45,null,0,null,0,0,1.03,null,0,0,0,0,{"$f":"IF(AND(AI7<>0,AO7=0),#VALUE!,AI7*AO7)","v":46.35},null,null,9,null,null,null,null,0.99,null,2.0000000000000004E-2,null,null,null,null,-0.01,null,null,0,0,0,0,1.045553,null,0,0,0,0,5.5552999999999964E-2]
[null,2,"041",411,1,null,{"$f":"IF(OR(ISBLANK(C8),ISBLANK(D8)),\"\",TEXT(C8,\"000\")&TEXT(D8,\"000\"))","v":"041411"},null,"LED (Dusk to Dawn)","Dusk to Dawn","5W","035L",0,0,0,0,0,1,0,0,0,0,1.36747,null,0,0,0,0,0,null,0,0,0,0,0,null,0,null,0,0,1.48,null,0,0,0,0,0,null,null,13,null,null,null,null,1.42,null,0.03,null,null,null,null,0,null,null,0,0,0,0,1.5023479999999998,null,0,0,0,0,8.2347999999999866E-2]
{"$rows_left_out":145}
{"sheet":"Area Lts","index":13,"n_rows":103,"n_cols":34,"rows_kept":103,"cut":false,"hidden":false,"merged":[]}
["Area Light Summary",null,null,null,null,null,null,null,"WASHINGTON Area Lights (Schedule 47)",null,null,null,null,null,null,null,null,null,"Monthly Rev.",null,null,null,null,null,null,{"$f":"SL_RateIncr","v":0},null,null,"% rate increase -->",{"$f":"'Lighting summary'!L16","v":8.3000000000000004E-2},null,null,"Monthly Rev."]
[{"$f":"'St Lts'!A2","v":"MDM-10069 Report as of 3/31/20"},null,null,null,null,null,null,null,null,null,null,null,"# of Lights(1)",null,null,"Pres. Rates",null,null,"at Pres. Rates",null,null,"# of Lights(1)",null,null,null,null,"# of Lights",null,null,"Prop. Rates",null,null,"at Prop. Rates"]
[null,null,null,null,null,null,null,null,"Fixture Type","Pole Facility","Size","Sched","047","048",null,"047","048",null,"047","048",null,"047","048",null,null,null,"047","048",null,"047","048",null,"047","048"]
[null,null,null,null,null,null,null,null,"Sodium Vapor","Floodlight on existing standard","250W","HAH",{"$f":"SUMIF($G:$G,TEXT(M$3,\"000\")&TEXT($L4,\"000\"),$E:$E)","v":101},3,null,22.77,{"$f":"P4","v":22.77},null,{"$f":"IF(AND(M4<>0,P4=0),#VALUE!,M4*P4)","v":2299.77},{"$f":"IF(AND(N4<>0,Q4=0),#VALUE!,N4*Q4)","v":68.31},null,{"$f":"SUMIF($G:$G,TEXT(V$3,\"000\")&TEXT($L4,\"000\"),$E:$E)","v":101},3,null,null,null,{"$f":"M4","v":101},3,null,{"$f":"ROUND(P4*(1+AD$1),2)","v":24.66},{"$f":"AD4","v":24.66},null,{"$f":"IF(AND(AA4<>0,AD4=0),#VALUE!,AA4*AD4)","v":2490.66},{"$f":"IF(AND(AB4<>0,AE4=0),#VALUE!,AB4*AE4)","v":73.98}]
[null,"State","Sched","Rate Sub","# of Lights",null,null,null,"Sodium Vapor","Kim light w/25' fiberglass pole","100W","HAI",17,2,null,29.74,29.74,null,{"$f":"IF(AND(M5<>0,P5=0),#VALUE!,M5*P5)","v":505.58},59.48,null,17,2,null,null,null,17,2,null,32.21,{"$f":"AD5","v":32.21},null,547.57000000000005,64.42]
[null,null,null,null,null,null,null,null,"Sodium Vapor","on existing standard","100W","HPA",386,491,null,14.12,14.12,null,5450.32,{"$f":"IF(AND(N6<>0,Q6=0),#VALUE!,N6*Q6)","v":6932.9199999999992},null,386,491,null,null,null,386,491,null,15.29,15.29,null,5901.94,7507.3899999999994]
[null,"WA","047","HAGL",3,null,{"$f":"IF(OR(ISBLANK(C7),ISBLANK(D7)),\"\",TEXT(C7,\"000\")&TEXT(D7,\"000\"))","v":"047HAGL"},null,"Sodium Vapor","on existing standard","200W","HPB",860,398,null,20.05,20.05,null,17243,7979.9000000000005,null,860,398,null,null,null,860,398,null,21.71,21.71,null,18670.600000000002,8640.58]
[null,"WA","047","HAH",101,null,{"$f":"IF(OR(ISBLANK(C8),ISBLANK(D8)),\"\",TEXT(C8,\"000\")&TEXT(D8,\"000\"))","v":"047HAH"},null,"Sodium Vapor","on existing standard","400W","HPC",119,8,null,27.7,27.7,null,3296.2999999999997,221.6,null,119,8,null,null,null,119,8,null,{"$f":"ROUND(P8*(1+AD$1),2)","v":30},30,null,3570,240]
{"$rows_left_out":96}
{"sheet":"Capital Recovery Factor Calc","index":14,"n_rows":40,"n_cols":16,"rows_kept":40,"cut":false,"hidden":false,"merged":[]}
[]
[]
[]
[]
["Avista",null,null,null,null,"Avista",null,null,null,null,null,"Avista"]
["Capital Recovery Factor Calculation",null,null,null,null,"Capital Recovery Factor Calculation",null,null,null,null,null,"Capital Recovery Factor Calculation"]
["Present - UE-120436",null,null,null,null,"Present - UE-190334",null,null,null,null,null,"Proposed - UE- 200___"]
[]
{"$rows_left_out":33}
{"sheet":"Block Data","index":15,"n_rows":101,"n_cols":19,"rows_kept":101,"cut":false,"hidden":false,"merged":[]}
[]
[]
["WASHINGTON ELECTRIC SYSTEM"]
[null,null,"January","February","March","April","May","June","July","August","September","October","November","December","Annual Total"]
["Rate Design Program Monthly Results"]
[null,"Schedule 001/002"]
[null,"Block 1",{"$f":"'REVRUNS 12ME1219'!D55+'REVRUNS 12ME1219'!D70","v":150521497.73298001},{"$f":"'REVRUNS 12ME1219'!E55+'REVRUNS 12ME1219'!E70","v":142827945.669},{"$f":"'REVRUNS 12ME1219'!F55+'REVRUNS 12ME1219'!F70","v":150371493.72187999},{"$f":"'REVRUNS 12ME1219'!G55+'REVRUNS 12ME1219'!G70","v":133502792.49804001},{"$f":"'REVRUNS 12ME1219'!H55+'REVRUNS 12ME1219'!H70","v":126403425.97394},{"$f":"'REVRUNS 12ME1219'!I55+'REVRUNS 12ME1219'!I70","v":121620287.59674999},{"$f":"'REVRUNS 12ME1219'!J55+'REVRUNS 12ME1219'!J70","v":127081653.93531999},{"$f":"'REVRUNS 12ME1219'!K55+'REVRUNS 12ME1219'!K70","v":132306245.95862},{"$f":"'REVRUNS 12ME1219'!L55+'REVRUNS 12ME1219'!L70","v":128702746.16773},{"$f":"'REVRUNS 12ME1219'!M55+'REVRUNS 12ME1219'!M70","v":131517034.25931001},{"$f":"'REVRUNS 12ME1219'!N55+'REVRUNS 12ME1219'!N70","v":137443756.74180999},{"$f":"'REVRUNS 12ME1219'!O55+'REVRUNS 12ME1219'!O70","v":150343194.24575001},{"$f":"SUM(C7:N7)","v":1632642074.5011301},null,null,0,{"$f":"R7/$R$10","v":{"$error":"#DIV/0!"}}]
[null,"Block 2",{"$f":"'REVRUNS 12ME1219'!D56+'REVRUNS 12ME1219'!D71","v":65384022.025019996},{"$f":"'REVRUNS 12ME1219'!E56+'REVRUNS 12ME1219'!E71","v":58184607.883999996},{"$f":"'REVRUNS 12ME1219'!F56+'REVRUNS 12ME1219'!F71","v":63280736.525119998},{"$f":"'REVRUNS 12ME1219'!G56+'REVRUNS 12ME1219'!G71","v":37793261.212959997},{"$f":"'REVRUNS 12ME1219'!H56+'REVRUNS 12ME1219'!H71","v":25238194.362059999},{"$f":"'REVRUNS 12ME1219'!I56+'REVRUNS 12ME1219'!I71","v":22826177.73525},{"$f":"'REVRUNS 12ME1219'!J56+'REVRUNS 12ME1219'!J71","v":30356117.66468},{"$f":"'REVRUNS 12ME1219'!K56+'REVRUNS 12ME1219'!K71","v":37629491.04738},{"$f":"'REVRUNS 12ME1219'!L56+'REVRUNS 12ME1219'!L71","v":34712830.572270006},{"$f":"'REVRUNS 12ME1219'!M56+'REVRUNS 12ME1219'!M71","v":27135846.21469},{"$f":"'REVRUNS 12ME1219'!N56+'REVRUNS 12ME1219'!N71","v":40096855.794190004},{"$f":"'REVRUNS 12ME1219'!O56+'REVRUNS 12ME1219'!O71","v":61915473.835249998},{"$f":"SUM(C8:N8)","v":504553614.87287003},null,null,0,{"$f":"R8/$R$10","v":{"$error":"#DIV/0!"}}]
{"$rows_left_out":94}
{"sheet":"REVRUNS 12ME1219","index":16,"n_rows":388,"n_cols":16,"rows_kept":388,"cut":false,"hidden":false,"merged":[[316,1,317,1],[318,0,318,2],[298,0,317,0],[298,1,299,1],[300,1,301,1],[302,1,303,1],[304,1,305,1],[306,1,307,1],[308,1,309,1],[310,1,311,1],[312,1,313,1],[314,1,315,1]]}
[]
[]
["Electric Revenue Meters Report by Location  Twelve Months Ended  for Report Date : '12/31/2019'"]
[]
["State Cde:WA"]
[]
[null,null,"Meters"]
[null,"Period",201901,201902,201903,201904,201905,201906,201907,201908,201909,201910,201911,201912,"12 Month Average","Total"]
{"$rows_left_out":380}