{"text_format":"1","workbook":"xlsx","n_sheets":15,"sheets":["Interject_LastPulledValues","Depr Summary","FAR Dep Summary","FAR 10.31.2023","Regulatory Assets","2023 Bud Capital Input","2024 Bud Capital Input","2144 Trks","2144 Cont, DB","2144 Shop,Serv","2144 Other","2144 Trks Orig","2144 Cont, DB Orig","2144 Shop,Serv Orig","2144 Other Orig"],"not_rendered":{"charts":0,"images":0,"macros":1,"external_links":9,"defined_names":132,"comments":10,"pivot_tables":1},"unopened":[],"bounds":{"document_bytes":16777216,"sheet_cells":100000,"rows_first":2000,"rows_last":500,"rows_between":2000,"halvings":0,"cell_chars":16384,"cell_head_chars":4096},"cells_cut":0,"cells_raw":0,"read":"whole","date_system":"1900"}

{"sheet":"Interject_LastPulledValues","index":0,"n_rows":2,"n_cols":16,"rows_kept":2,"cut":false,"hidden":true,"merged":[]}
["Interject_LastPulledValues_BalanceRange",null,null,null,null,null,null,null,null,null,"Interject_LastPulledValues_DescriptionRange",null,null,null,null,"Interject_LastPulledValues_LastChangeGUID"]
["KeyValue","FullAccount","Period","Year","Source","Company","Currency","Version","Balance",null,"KeyValue","SegmentValue","SegmentNumber","Description",null,"Interject_LastPulledValues_PreviousLastChangeGUID"]

{"sheet":"Depr Summary","index":1,"n_rows":81,"n_cols":45,"rows_kept":81,"cut":false,"hidden":false,"merged":[[6,0,6,7],[6,9,6,16],[6,18,6,25],[54,0,54,4]]}
[]
[]
[]
[]
[]
[]
["Assets Through 12/31/2021",null,null,null,null,null,null,null,null,"New Asset Adds and Transfers In from FAR (1/1/2022 and Beyond)",null,null,null,null,null,null,null,null,"Proforma Adds",null,null,null,null,null,null,null,null,"Regulatory Assets",null,null,null,null,null,null,null,null,"Combined Summary - This Section to Proforma"]
["Depreciation & Average Investment Summary",null,null,null,null,null,null,null,null,"Depreciation & Average Investment Summary",null,null,null,null,null,null,null,null,"Depreciation & Average Investment Summary",null,null,null,null,null,null,null,null,"Depreciation & Average Investment Summary",null,null,null,null,null,null,null,null,"Depreciation & Average Investment Summary"]
{"$rows_left_out":74}
{"sheet":"FAR Dep Summary","index":2,"n_rows":28,"n_cols":8,"rows_kept":28,"cut":false,"hidden":false,"merged":[[0,0,0,5],[16,0,16,5]]}
["Live Pivot"]
["Pre 2022 Add?","No"]
[]
["Row Labels","Sum of Cost","Sum of Test Year Depreciation","Sum of BOY Accum","Sum of EOY Accum","Sum of EOY Average Investment"]
["Drop Boxes",98160.02,0,98160.02,98160.02,0]
["Regulated Garbage Carts",683270.65,97610.092857142852,86883.008571435508,184493.10142857837,498777.54857142165]
["Service Equipment",20467.78,4679.6066666666675,936.70816666720157,5616.3148333338677,14851.465166666134]
["Long Haul",5902.2,0,5902.2,5902.2,0]
{"$rows_left_out":21}
{"sheet":"FAR 10.31.2023","index":3,"n_rows":302,"n_cols":49,"rows_kept":302,"cut":false,"hidden":false,"merged":[[8,12,8,13],[9,12,9,13],[10,12,10,13],[9,2,9,3],[8,5,9,9]]}
[null,"Location","AssetID","ParentChild","Description","SystemNo",null,"MFGSerialNum","LicensePlate","ModelYear","VendorMfg","BodyManuf","InsuranceCategory","InServiceDate","AcquisitionDate","PONumber","EstimatedLife","AssetGL","AcqValue","AccumulatedGL","CurrentLifeToDate",null,"CurrentYearToDate","ExpenseGL","CurrentPeriodDepr","AcqType","FormerCompany","InvoiceNum","CompAsstNo","Book","ActivityCd","DeprMethod","BegLsDeprDate","LongName","Sequence","BegLifeToDate"]
[null,null,null,null,null,null,null,null,null,null,null,null,null,null,null,null,null,null,null,null,null,{"$f":"S2-U2","v":0}]
[null,{"$f":"_xll.ReportRange(\"FARReport\",A14:AJ303,A1:AJ1,A2:AJ2,_xll.Param($C$9,$C$10,C12,$M$9,$M$10,$M$11,$S$9,M12,$Y$10,$Y$9,S10,S11,CELL(\"address\",$E$6)),TRUE,FALSE)","v":"OK!: ReportRange Formula OK [jAction{}]"},null,null,null,null,null,null,null,null,null,"Default Month :",{"$f":"MONTH(NOW())","v":3},null,null,null,null,null,"OK!: ReportDrill 'Projected Depr' Formula OK [jAction{}]",null,null,null,null,null,{"$f":"_xll.jFreezePanes(A14,A5)","v":"> jFreezePanes is ready. "},null,null,{"$f":"_xll.jFocus(C9)","v":"> jFocus is ready. "}]
[null,null,null,null,null,null,null,null,null,null,null,"Default Year :",{"$f":"IF(M3=12,YEAR(NOW()),YEAR(NOW()))","v":2024},null,null,null,null,null,"reportdrill(Invoice!C2,,pairgroup(pair(\"C:C\",Invoice!E8),pair(\"\",Invoice!E7,\"N\")),\"Drill To Invoices by FAS# (Exc CIP)\")",null,"OK!: ReportDrill 'Drill To All Invoices by PO#' Formula OK [jAction{}]",null,null,"OK!: ReportDrill 'Drill to Invoice by PO# and Invoice #' Formula OK [jAction{}]"]
[null,"Fixed Asset Register",null,null,null,null,null,"Asset Count:",{"$f":"COUNT(C14:C303)","v":289},null,null,null,null,null,null,null,null,null,null,null,null,null,null,null,null,null,null,null,null,null,null,null,null,null,null,null,11,"Test Period Beg. Month"]
[null,"Data Last Updated in this Pull:",null,null,"Nov  7 2023  4:31PM",null,null,null,null,null,null,null,null,null,null,null,null,null,null,null,null,null,null,null,null,null,null,null,null,null,null,null,null,null,null,null,10,"Test Period End Month"]
[null,null,null,null,null,null,null,null,null,null,null,null,null,null,null,null,null,null,null,null,null,null,null,null,null,null,null,null,null,null,null,null,null,null,null,null,2022,"First Year"]
[null,null,null,null,null,null,null,null,null,null,null,null,null,null,null,null,null,null,null,null,null,null,null,null,null,null,null,null,null,null,null,null,null,null,null,null,2023,"Second year"]
{"$rows_left_out":295}
{"sheet":"Regulatory Assets","index":4,"n_rows":14,"n_cols":18,"rows_kept":14,"cut":false,"hidden":false,"merged":[]}
[]
[null,null,null,null,null,null,null,null,null,11,"Test Period Beg. Month"]
[null,null,null,null,null,null,null,null,null,10,"Test Period End Month"]
[null,null,null,null,null,null,null,null,null,2022,"First Year"]
[null,null,null,null,null,null,null,null,null,2023,"Second year"]
[null,null,null,null,null,null,null,null,null,{"$f":"+J5+(J3/12)","v":2023.8333333333333},"Test Period End Mo/Yr"]
[null,null,null,null,null,null,null,null,null,{"$f":"+J4+(J2/12)","v":2022.9166666666667},"Test Period Beg. Mo/Yr"]
[]
{"$rows_left_out":7}
{"sheet":"2023 Bud Capital Input","index":5,"n_rows":55,"n_cols":59,"rows_kept":55,"cut":false,"hidden":true,"merged":[]}
[null,null,null,"Column Definitions"]
[null,null,null,null,null,null,null,null,null,null,null,null,null,null,null,null,null,"TruckRequest#"]
["PONum_Modified","CurrentProjectNumber_FPS","ProjectNumber_FPS",null,"DeleteFlag","BusinessUnitCode","PoNumber","PoItemNumber","ProjectName_FPS","ItemDescription","Explanation",null,"AssetType","AssetSubType","Life","AddReplace","Condition","TruckCenterNum ValueList:RequestedTruckList","Jan","Feb","Mar","Apr","May","Jun","Jul","Aug","Sep","Oct","Nov","Dec",null,null,null,"FASNum",null,"ReplacementNotes","EquipmentNum","EquipmentModelYear",null,"FileLink hlink:FileLink"]
[null,null,"CurrentProjectNumber_FPS",null,null,null,null,"PoItemNumber",null,null,null,null,null,null,null,null,null,null,null,null,null,null,null,null,null,null,null,null,null,null,null,null,null,null,null,null,null,null,null,null,null,"MessageToUser"]
[null,null,null,"Formatting Range"]
[{"$f":"IF(AND(C6<>\"\", B6<>C6),TRUE, FALSE)","v":false},{"$f":"IF(RIGHT(\"0000\"&G6,4)&\"-\"&H6 <> \"0000-\", RIGHT(\"0000\"&G6,4)&\"-\"&H6, \"\")","v":""},null,1,null,null,null,null,null,null,null,null,null,null,null,null,null,null,null,null,null,null,null,null,null,null,null,null,null,null,null,{"$f":"SUM(S6:AD6)","v":0},null,null,null,null,null,null,null,null," ",null,null,{"$f":"IF(R6=\"\", \"\", R6)","v":""},{"$f":"IFERROR(VLOOKUP($AR6,[7]TruckCenterReference!$C$23:$I23,3,FALSE), \"\")","v":""},{"$f":"IF(R6<>\"\",IF(AS6<>I6,\"Review\",\"ok\"), \"\")","v":""},null,{"$f":"IFERROR(VLOOKUP($AR6,[7]TruckCenterReference!$C$23:$I23,4,FALSE), \"\")","v":""},{"$f":"IF(R6=\"\",\"\", IF($AV6<>$Q6, \"Fix!\", \"OK\"))","v":""},null,"",{"$f":"IFERROR(VLOOKUP($AR6,[7]TruckCenterReference!$C$23:$I23,6,FALSE), \"\")","v":""},{"$f":"IF(R6<>\"\",IF(AY6<>AZ6,\"Fix!\",\"ok\"), \"\")","v":""},null,{"$f":"IFERROR(VLOOKUP($AR6,[7]TruckCenterReference!$C$23:$I23,7,FALSE), 0)","v":0},{"$f":"IFERROR(VLOOKUP($AR6,[7]TruckCenterReference!$C$23:$K23,9,FALSE), 0)","v":0},{"$f":"IFERROR(VLOOKUP($AR6,[7]TruckCenterReference!$C$23:$K23,8,FALSE), 0)","v":0},{"$f":"IF(BC6<>0,BC6-AF6-BE6,\"\")","v":""},{"$f":"IF(R6=\"\",\"\",IF(ABS(BF6)>3000,IF(RIGHT(N6,4)=\"Body\",\"Review\",\"Fix!\"),\"OK\"))","v":""}]
[null,null,null,"Report Formulas"]
[null,null,null,null,null,"Pull",null,null,null,null,null,null,{"$f":"_xll.jFreezePanes(J29,D22)","v":"> jFreezePanes is ready. "}]
{"$rows_left_out":48}
{"sheet":"2024 Bud Capital Input","index":6,"n_rows":66,"n_cols":59,"rows_kept":66,"cut":false,"hidden":false,"merged":[]}
[null,null,null,"Column Definitions"]
[null,null,null,null,null,null,null,null,null,null,null,null,null,null,null,null,null,"TruckRequest#"]
["PONum_Modified","CurrentProjectNumber_FPS","ProjectNumber_FPS",null,"DeleteFlag","BusinessUnitCode","PoNumber","PoItemNumber","ProjectName_FPS","ItemDescription","Explanation",null,"AssetType","AssetSubType","Life","AddReplace","Condition","TruckCenterNum ValueList:RequestedTruckList","Jan","Feb","Mar","Apr","May","Jun","Jul","Aug","Sep","Oct","Nov","Dec",null,null,null,"FASNum",null,"ReplacementNotes","EquipmentNum","EquipmentModelYear",null,"FileLink hlink:FileLink"]
[null,null,"CurrentProjectNumber_FPS",null,null,null,null,"PoItemNumber",null,null,null,null,null,null,null,null,null,null,null,null,null,null,null,null,null,null,null,null,null,null,null,null,null,null,null,null,null,null,null,null,null,"MessageToUser"]
[null,null,null,"Formatting Range"]
[{"$f":"IF(AND(C6<>\"\", B6<>C6),TRUE, FALSE)","v":false},{"$f":"IF(RIGHT(\"0000\"&G6,4)&\"-\"&H6 <> \"0000-\", RIGHT(\"0000\"&G6,4)&\"-\"&H6, \"\")","v":""},null,1,null,null,null,null,null,null,null,null,null,null,null,null,null,null,null,null,null,null,null,null,null,null,null,null,null,null,null,{"$f":"SUM(S6:AD6)","v":0},null,null,null,null,null,null,null,null," ",null,null,{"$f":"IF(R6=\"\", \"\", R6)","v":""},{"$f":"IFERROR(VLOOKUP($AR6,[7]TruckCenterReference!$C$23:$I26,3,FALSE), \"\")","v":""},{"$f":"IF(R6<>\"\",IF(AS6<>I6,\"Review\",\"ok\"), \"\")","v":""},null,{"$f":"IFERROR(VLOOKUP($AR6,[7]TruckCenterReference!$C$23:$I26,4,FALSE), \"\")","v":""},{"$f":"IF(R6=\"\",\"\", IF($AV6<>$Q6, \"Fix!\", \"OK\"))","v":""},null,"",{"$f":"IFERROR(VLOOKUP($AR6,[7]TruckCenterReference!$C$23:$I26,6,FALSE), \"\")","v":""},{"$f":"IF(R6<>\"\",IF(AY6<>AZ6,\"Fix!\",\"ok\"), \"\")","v":""},null,{"$f":"IFERROR(VLOOKUP($AR6,[7]TruckCenterReference!$C$23:$I26,7,FALSE), 0)","v":0},{"$f":"IFERROR(VLOOKUP($AR6,[7]TruckCenterReference!$C$23:$K26,9,FALSE), 0)","v":0},{"$f":"IFERROR(VLOOKUP($AR6,[7]TruckCenterReference!$C$23:$K26,8,FALSE), 0)","v":0},{"$f":"IF(BC6<>0,BC6-AF6-BE6,\"\")","v":""},{"$f":"IF(R6=\"\",\"\",IF(ABS(BF6)>3000,IF(RIGHT(N6,4)=\"Body\",\"Review\",\"Fix!\"),\"OK\"))","v":""}]
[null,null,null,"Report Formulas"]
[null,null,null,null,null,"Pull",null,null,null,null,null,null,{"$f":"_xll.jFreezePanes(J29,D22)","v":"> jFreezePanes is ready. "}]
{"$rows_left_out":59}
{"sheet":"2144 Trks","index":7,"n_rows":131,"n_cols":54,"rows_kept":131,"cut":false,"hidden":false,"merged":[]}
[null,null,null,"Island Disposal Inc"]
[null,null,null,"Depreciation Schedule",null,null,null,null,null,null,null,null,null,{"$f":"+'FAR 10.31.2023'!AK5","v":11},"Test Period Beg. Month",null,null,null,null,null,null,null,null,null,null,null,null,null,null,null,null,null,null,null,null,null,null,null,null,null,null,null,null,null,null,null,null,null,null,"CONVENTIONS"]
[null,null,null,{"$f":"'Depr Summary'!H12","v":"2023-10-31"},null,null,null,null,null,null,null,null,null,{"$f":"+'FAR 10.31.2023'!AK6","v":10},"Test Period End Month"]
[null,null,null,null,null,null,null,null,null,null,null,null,null,{"$f":"+'FAR 10.31.2023'!AK7","v":2022},"First Year",null,null,null,null,null,null,null,null,null,null,null,null,null,null,null,null,null,null,null,null,null,null,null,null,null,null,null,null,null,null,null,null,null,1,"Calendar year test period: ",null,null,12,"mos in first year"]
[null,null,null,null,null,null,null,null,null,null,null,null,null,{"$f":"+'FAR 10.31.2023'!AK8","v":2023},"Second year",null,null,null,null,null,null,null,null,null,null,null,null,null,null,null,null,null,null,null,null,null,null,null,null,null,null,null,null,null,null,null,null,null,null,1993,null,null,0,"mos in 2nd year"]
[null,null,null,null,null,null,null,null,null,null,null,null,null,{"$f":"+'FAR 10.31.2023'!AK9","v":2023.8333333333333},"Test Period End Mo/Yr",null,null,null,null,null,null,null,null,null,null,null,null,null,null,null,null,null,null,null,null,null,null,null,null,null,null,null,null,null,null,null,null,null,null,null,null,null,93,"First year"]
[null,null,null,null,null,null,null,null,null,null,null,null,null,{"$f":"+'FAR 10.31.2023'!AK10","v":2022.9166666666667},"Test Period Beg. Mo/Yr",null,null,null,null,null,null,null,null,null,null,null,null,null,null,null,null,null,null,null,null,null,null,null,null,null,null,null,null,null,null,null,null,null,null,null,null,null,94,"Second Year"]
[null,null,null,null,null,null,null,null,null,null,null,null,null,null,null,null,"Beginning","Allocated",null,null,null,"Regulated"]
{"$rows_left_out":124}
{"sheet":"2144 Cont, DB","index":8,"n_rows":113,"n_cols":19,"rows_kept":113,"cut":false,"hidden":false,"merged":[[8,3,9,4]]}
[null,null,"Island Disposal"]
[null,null,"Depreciation Schedule",null,null,null,null,null,null,null,null,null,null,{"$f":"+'2144 Trks'!N2","v":11},"Test Period Beg. Month"]
[null,null,{"$f":"'Depr Summary'!H12","v":"2023-10-31"},null,null,null,null,null,null,null,null,null,null,{"$f":"+'2144 Trks'!N3","v":10},"Test Period End Month"]
[null,null,null,null,null,null,null,null,null,null,null,null,null,{"$f":"+'2144 Trks'!N4","v":2022},"First Year"]
[null,null,null,null,null,null,null,null,null,null,null,null,null,{"$f":"+'2144 Trks'!N5","v":2023},"Second year"]
[null,null,null,null,null,null,null,null,null,null,null,null,null,{"$f":"+'2144 Trks'!N6","v":2023.8333333333333},"Test Period End Mo/Yr"]
[null,null,null,null,null,null,null,null,null,null,null,null,null,{"$f":"+'2144 Trks'!N7","v":2022.9166666666667},"Test Period Beg. Mo/Yr"]
[null,null,null,null,null,null,null,null,null,null,null,null,null,null,null,null,"Beginning","Ending"]
{"$rows_left_out":106}
{"sheet":"2144 Shop,Serv","index":9,"n_rows":56,"n_cols":24,"rows_kept":56,"cut":false,"hidden":false,"merged":[[8,4,9,5]]}
[null,null,null,"Island Disposal"]
[null,null,null,"Depreciation Schedule",null,null,null,null,null,null,null,null,null,{"$f":"+'2144 Trks'!N2","v":11},"Test Period Beg. Month"]
[null,null,null,{"$f":"'Depr Summary'!H12","v":"2023-10-31"},null,null,null,null,null,null,null,null,null,{"$f":"+'2144 Trks'!N3","v":10},"Test Period End Month"]
[null,null,null,null,null,null,null,null,null,null,null,null,null,{"$f":"+'2144 Trks'!N4","v":2022},"First Year"]
[null,null,null,null,null,null,null,null,null,null,null,null,null,{"$f":"+'2144 Trks'!N5","v":2023},"Second year"]
[null,null,null,null,null,null,null,null,null,null,null,null,null,{"$f":"+'2144 Trks'!N6","v":2023.8333333333333},"Test Period End Mo/Yr"]
[null,null,null,null,null,null,null,null,null,null,null,null,null,{"$f":"+'2144 Trks'!N7","v":2022.9166666666667},"Test Period Beg. Mo/Yr"]
[null,null,null,null,null,null,null,null,null,null,null,null,null,null,null,null,"Beginning","Ending"]
{"$rows_left_out":49}
{"sheet":"2144 Other","index":10,"n_rows":36,"n_cols":19,"rows_kept":36,"cut":false,"hidden":false,"merged":[]}
[null,null,null,"Island Disposal"]
[null,null,null,"Depreciation Schedule",null,null,null,null,null,null,null,null,null,{"$f":"+'2144 Trks'!N2","v":11},"Test Period Beg. Month"]
[null,null,null,{"$f":"'Depr Summary'!H12","v":"2023-10-31"},null,null,null,null,null,null,null,null,null,{"$f":"+'2144 Trks'!N3","v":10},"Test Period End Month"]
[null,null,null,null,null,null,null,null,null,null,null,null,null,{"$f":"+'2144 Trks'!N4","v":2022},"First Year"]
[null,null,null,null,null,null,null,null,null,null,null,null,null,{"$f":"+'2144 Trks'!N5","v":2023},"Second year"]
[null,null,null,null,null,null,null,null,null,null,null,null,null,{"$f":"+'2144 Trks'!N6","v":2023.8333333333333},"Test Period End Mo/Yr"]
[null,null,null,null,null,null,null,null,null,null,null,null,null,{"$f":"+'2144 Trks'!N7","v":2022.9166666666667},"Test Period Beg. Mo/Yr"]
[null,null,null,null,null,null,null,null,null,null,null,null,null,null,null,null,"Beginning","Ending"]
{"$rows_left_out":29}
{"sheet":"2144 Trks Orig","index":11,"n_rows":99,"n_cols":81,"rows_kept":99,"cut":false,"hidden":false,"merged":[[4,36,5,44]]}
[null,null,null,"Island Disposal Inc",null,null,null,null,null,null,null,null,null,null,null,null,null,null,null,null,null,null,null,null,null,null,null,null,null,null,null,"2012-12-01"]
[null,null,null,"Depreciation Schedule",null,null,null,null,null,null,null,null,null,null,null,null,12,"Months in first year",null,null,null,null,null,null,null,null,null,null,null,null,null,null,null,null,null,null,null,null,null,null,null,null,null,null,null,null,null,null,null,null,null,null,null,null,null,null,null,null,null,null,null,null,null,null,null,null,null,null,null,null,null,null,null,null,null,null,"CONVENTIONS"]
[null,null,null,"2017-12-31",null,null,null,null,null,null,null,null,null,null,null,null,0,"Months in second year",null,null,null,null,null,null,null,null,null,null,null,null,null,"A.","Purchase date"]
[null,null,null,null,null,null,null,null,null,null,null,null,null,null,null,null,2017,"First year",null,null,null,null,null,null,null,null,null,null,null,null,null,"B.","End of Test Period",null,null,null,null,null,null,null,null,null,null,null,null,null,null,null,null,null,null,null,null,null,null,null,null,null,null,null,null,null,null,null,null,null,null,null,null,null,null,null,null,null,null,1,"Calendar year test period: ",null,null,12,"mos in first year"]
[null,null,null,null,null,null,null,null,null,null,null,null,null,null,null,null,2018,"Second year",null,null,null,null,null,null,null,null,null,null,null,null,null,"C","Date fully Depr",null,null,null,"Salvage Value Calculations",null,null,null,null,null,null,null,null,null,null,null,null,null,null,null,null,null,null,null,null,null,null,null,null,null,null,null,null,null,null,null,null,null,null,null,null,null,null,null,1993,null,null,0,"mos in 2nd year"]
[null,null,null,null,null,null,null,null,null,null,null,null,null,null,null,null,null,null,null,null,null,null,null,null,null,null,null,null,null,null,null,"D.","Beg of Test Period",null,null,null,null,null,null,null,null,null,null,null,null,null,null,null,null,null,null,null,null,null,null,null,null,null,null,null,null,null,null,null,null,null,null,null,null,null,null,null,null,null,null,null,null,null,null,93,"First year"]
[null,null,null,null,null,null,null,null,null,null,null,null,null,null,null,null,null,null,null,null,null,null,null,null,null,null,null,null,null,null,null,"E.","Disposition Date",null,null,null,null,null,null,null,null,null,null,null,null,null,null,null,null,null,null,null,null,null,null,null,null,null,null,null,null,null,null,null,null,null,null,null,null,null,null,null,null,null,null,null,null,null,null,94,"Second Year"]
[null,null,null,null,null,null,null,null,null,null,null,null,null,null,null,null,null,null,null,"Disposal",null,null,"Total",null,"Beginning","Allocated",null,"Allocated","Allocated",null,null,null,null,null,null,null,null,null,null,null,"Adjustment to",null,"Adjustment to"]
{"$rows_left_out":92}
{"sheet":"2144 Cont, DB Orig","index":12,"n_rows":110,"n_cols":33,"rows_kept":110,"cut":false,"hidden":false,"merged":[]}
[null,null,"Island Disposal",null,null,null,null,null,null,null,null,null,null,null,null,null,null,null,null,null,null,null,null,null,null,null,null,null,null,"2012-01-01"]
[null,null,"Depreciation Schedule",null,null,null,null,null,null,null,null,null,null,null,{"$f":"+'2144 Trks Orig'!Q2","v":12},"Months in first year"]
[null,null,"2017-12-31",null,null,null,null,null,null,null,null,null,null,null,{"$f":"+'2144 Trks Orig'!Q3","v":0},"Months in second year",null,null,null,null,null,null,null,null,null,null,null,null,null,"A.","Purchase date"]
[null,null,null,null,null,null,null,null,null,null,null,null,null,null,{"$f":"'2144 Trks Orig'!Q4","v":2017},"First year",null,null,null,null,null,null,null,null,null,null,null,null,null,"B.","End of Test Period"]
[null,null,null,null,null,null,null,null,null,null,null,null,null,null,{"$f":"'2144 Trks Orig'!Q5","v":2018},"Second year",null,null,null,null,null,null,null,null,null,null,null,null,null,"C","Date fully Depr"]
[null,null,null,null,null,null,null,null,null,null,null,null,null,null,null,null,null,null,null,null,null,null,null,null,null,null,null,null,null,"D.","Beg of Test Period"]
[null,null,null,null,null,null,null,null,null,null,null,null,null,null,null,null,null,null,null,null,null,null,null,null,null,null,null,null,null,"E.","Disposition Date"]
[null,null,null,null,null,null,null,null,null,null,null,null,null,null,null,null,null,"Disposal",null,null,"Total",null,"Beginning","Ending",null,"Allocated","Allocated"]
{"$rows_left_out":103}
{"sheet":"2144 Shop,Serv Orig","index":13,"n_rows":66,"n_cols":44,"rows_kept":66,"cut":false,"hidden":false,"merged":[[4,35,5,43]]}
[null,null,null,"Island Disposal",null,null,null,null,null,null,null,null,null,null,null,null,null,null,null,null,null,null,null,null,null,null,null,null,null,null,"2012-01-01"]
[null,null,null,"Depreciation Schedule",null,null,null,null,null,null,null,null,null,null,null,{"$f":"+'2144 Trks Orig'!Q2","v":12},"Months in first year"]
[null,null,null,"2017-12-31",null,null,null,null,null,null,null,null,null,null,null,{"$f":"+'2144 Trks Orig'!Q3","v":0},"Months in second year",null,null,null,null,null,null,null,null,null,null,null,null,null,"A.","Purchase date"]
[null,null,null,null,null,null,null,null,null,null,null,null,null,null,null,2017,"First year",null,null,null,null,null,null,null,null,null,null,null,null,null,"B.","End of Test Period"]
[null,null,null,null,null,null,null,null,null,null,null,null,null,null,null,2018,"Second year",null,null,null,null,null,null,null,null,null,null,null,null,null,"C","Date fully Depr",null,null,null,"Salvage Value Calculations"]
[null,null,null,null,null,null,null,null,null,null,null,null,null,null,null,null,null,null,null,null,null,null,null,null,null,null,null,null,null,null,"D.","Beg of Test Period"]
[null,null,null,null,null,null,null,null,null,null,null,null,null,null,null,null,null,null,null,null,null,null,null,null,null,null,null,null,null,null,"E.","Disposition Date"]
[null,null,null,null,null,null,null,null,null,null,null,null,null,null,null,null,null,null,"Disposal",null,null,"Total",null,"Beginning","Ending",null,"Allocated","Allocated",null,null,null,null,null,null,null,null,null,null,null,"Adjustment to",null,"Adjustment to"]
{"$rows_left_out":59}
{"sheet":"2144 Other Orig","index":14,"n_rows":64,"n_cols":34,"rows_kept":64,"cut":false,"hidden":false,"merged":[]}
[null,null,null,"Island Disposal",null,null,null,null,null,null,null,null,null,null,null,null,null,null,null,null,null,null,null,null,null,null,null,null,null,null,"2012-01-01"]
[null,null,null,"Depreciation Schedule",null,null,null,null,null,null,null,null,null,null,null,{"$f":"+'2144 Trks Orig'!Q2","v":12},"Months in first year"]
[null,null,null,"2017-12-31",null,null,null,null,null,null,null,null,null,null,null,{"$f":"+'2144 Trks Orig'!Q3","v":0},"Months in second year",null,null,null,null,null,null,null,null,null,null,null,null,null,"A.","Purchase date"]
[null,null,null,null,null,null,null,null,null,null,null,null,null,null,null,{"$f":"'2144 Trks Orig'!Q4","v":2017},"First year",null,null,null,null,null,null,null,null,null,null,null,null,null,"B.","End of Test Period"]
[null,null,null,null,null,null,null,null,null,null,null,null,null,null,null,{"$f":"'2144 Trks Orig'!Q5","v":2018},"Second year",null,null,null,null,null,null,null,null,null,null,null,null,null,"C","Date fully Depr"]
[null,null,null,null,null,null,null,null,null,null,null,null,null,null,null,null,null,null,null,null,null,null,null,null,null,null,null,null,null,null,"D.","Beg of Test Period"]
[null,null,null,null,null,null,null,null,null,null,null,null,null,null,null,null,null,null,null,null,null,null,null,null,null,null,null,null,null,null,"E.","Disposition Date"]
[null,null,null,null,null,null,null,null,null,null,null,null,null,null,null,null,null,null,"Disposal",null,null,"Total",null,"Beginning","Ending",null,"Allocated","Allocated"]
{"$rows_left_out":56}