{"text_format":"1","workbook":"xlsx","n_sheets":6,"sheets":["Interject_LastPulledValues","Depr Summary","FAR Dep Summary","FAR 04.30.2023","Bud Capital Input","Pre Acquisition Assets"],"not_rendered":{"charts":0,"images":0,"macros":1,"external_links":3,"defined_names":24,"comments":2,"pivot_tables":1},"unopened":[],"bounds":{"document_bytes":16777216,"sheet_cells":100000,"rows_first":2000,"rows_last":500,"rows_between":2000,"halvings":0,"cell_chars":16384,"cell_head_chars":4096},"cells_cut":0,"cells_raw":0,"read":"whole","date_system":"1900"}

{"sheet":"Interject_LastPulledValues","index":0,"n_rows":2,"n_cols":16,"rows_kept":2,"cut":false,"hidden":true,"merged":[]}
["Interject_LastPulledValues_BalanceRange",null,null,null,null,null,null,null,null,null,"Interject_LastPulledValues_DescriptionRange",null,null,null,null,"Interject_LastPulledValues_LastChangeGUID"]
["KeyValue","FullAccount","Period","Year","Source","Company","Currency","Version","Balance",null,"KeyValue","SegmentValue","SegmentNumber","Description",null,"Interject_LastPulledValues_PreviousLastChangeGUID"]

{"sheet":"Depr Summary","index":1,"n_rows":52,"n_cols":35,"rows_kept":52,"cut":false,"hidden":false,"merged":[[4,27,4,34],[1,6,1,7],[4,0,4,7],[26,8,27,8],[4,9,4,16],[26,17,27,17],[4,18,4,25]]}
["Peninsula Sanitation"]
["Depreciation & Average Investment Summary"]
["2023-04-30"]
[]
["Pre-Acquisition Assets 11/1/2021",null,null,null,null,null,null,null,null,"Assets PIS 11/1/2021 and Beyond",null,null,null,null,null,null,null,null,"Budgeted Capital 05/1/2023 and Beyond",null,null,null,null,null,null,null,null,"Combined Summary - This Section to Proforma"]
[null,null,null,null,null,"Beginning","Ending","Average",null,null,null,null,null,null,"Beginning","Ending","Average",null,null,null,null,null,null,"Beginning","Ending","Average",null,null,null,null,null,null,"Beginning","Ending","Average"]
[null,"Cost","Salvage","Depr","Test Year","Accum Depr","Accum Depr","Investment",null,null,"Cost","Salvage","Depr","Test Year","Accum Depr","Accum Depr","Investment",null,null,"Cost","Salvage","Depr","Test Year","Accum Depr","Accum Depr","Investment",null,null,"Cost","Salvage","Depr","Test Year","Accum Depr","Accum Depr","Investment"]
[null,null,null,"Cost","Depr","2022-05-01",{"$f":"+F8+364","v":"2023-04-30"},{"$f":"G8","v":"2023-04-30"},null,null,null,null,"Cost","Depr",{"$f":"F8","v":"2022-05-01"},{"$f":"G8","v":"2023-04-30"},{"$f":"H8","v":"2023-04-30"},null,null,null,null,"Cost","Depr",{"$f":"O8","v":"2022-05-01"},{"$f":"P8","v":"2023-04-30"},{"$f":"Q8","v":"2023-04-30"},null,null,null,null,"Cost","Depr",{"$f":"O8","v":"2022-05-01"},{"$f":"P8","v":"2023-04-30"},{"$f":"Q8","v":"2023-04-30"}]
["Trucks",null,null,null,null,null,null,null,null,"Trucks",null,null,null,null,null,null,null,null,"Trucks",null,null,null,null,null,null,null,null,"Trucks"]
[]
["Garbage Trucks",{"$f":"+SUMIF('Pre Acquisition Assets'!$C:$C,$A11,'Pre Acquisition Assets'!M:M)","v":1878229},0,{"$f":"+B11-C11","v":1878229},{"$f":"+SUMIF('Pre Acquisition Assets'!$C:$C,$A11,'Pre Acquisition Assets'!Q:Q)","v":129680},{"$f":"+SUMIF('Pre Acquisition Assets'!$C:$C,$A11,'Pre Acquisition Assets'!V:V)","v":1352702.6190476385},{"$f":"+SUMIF('Pre Acquisition Assets'!$C:$C,$A11,'Pre Acquisition Assets'!Z:Z)","v":1498697.9523809697},{"$f":"+SUMIF('Pre Acquisition Assets'!C:C,A11,'Pre Acquisition Assets'!AA:AA)","v":379531.04761903058},null,"Garbage Trucks",{"$f":"+SUMIF('FAR Dep Summary'!$A$24:$A$33,$J11,'FAR Dep Summary'!$B$24:$B$33)","v":1525},0,{"$f":"+K11-L11","v":1525},{"$f":"+SUMIF('FAR Dep Summary'!$A$24:$A$33,$J11,'FAR Dep Summary'!$C$24:$C$33)","v":508.33333333333326},{"$f":"+SUMIF('FAR Dep Summary'!$A$24:$A$33,$J11,'FAR Dep Summary'!$D$24:$D$33)","v":0},{"$f":"+SUMIF('FAR Dep Summary'!$A$24:$A$33,$J11,'FAR Dep Summary'!$E$24:$E$33)","v":508.33333333333326},{"$f":"+SUMIF('FAR Dep Summary'!$A$24:$A$33,$J11,'FAR Dep Summary'!$F$24:$F$33)","v":1016.6666666666667},null,"Garbage Trucks",{"$f":"+SUMIF('Bud Capital Input'!$L$57:$L$71,$S11,'Bud Capital Input'!M$57)*M71","v":0},0,{"$f":"+T11-U11","v":0},0,0,0,0,null,{"$f":"+J11","v":"Garbage Trucks"},{"$f":"+B11+K11+T11","v":1879754},{"$f":"+C11+L11","v":0},{"$f":"+D11+M11+V11","v":1879754},{"$f":"+E11+N11+W11","v":130188.33333333333},{"$f":"+F11+O11+X11","v":1352702.6190476385},{"$f":"+G11+P11+Y11","v":1499206.2857143029},{"$f":"+H11+Q11+Z11","v":380547.71428569726}]
[]
["Roll-off Truck",{"$f":"+SUMIF('Pre Acquisition Assets'!$C:$C,$A13,'Pre Acquisition Assets'!M:M)","v":852532},0,{"$f":"+B13-C13","v":852532},{"$f":"+SUMIF('Pre Acquisition Assets'!$C:$C,$A13,'Pre Acquisition Assets'!Q:Q)","v":71493.142857142855},{"$f":"+SUMIF('Pre Acquisition Assets'!$C:$C,$A13,'Pre Acquisition Assets'!V:V)","v":625903.79285714962},{"$f":"+SUMIF('Pre Acquisition Assets'!$C:$C,$A13,'Pre Acquisition Assets'!Z:Z)","v":697670.28571429243},{"$f":"+SUMIF('Pre Acquisition Assets'!C:C,A13,'Pre Acquisition Assets'!AA:AA)","v":154861.71428570757},null,"Roll-off Truck",{"$f":"+SUMIF('FAR Dep Summary'!$A$24:$A$33,$J13,'FAR Dep Summary'!$B$24:$B$33)","v":74064.44},0,{"$f":"+K13-L13","v":74064.44},{"$f":"+SUMIF('FAR Dep Summary'!$A$24:$A$33,$J13,'FAR Dep Summary'!$C$24:$C$33)","v":10580.634285714286},{"$f":"+SUMIF('FAR Dep Summary'!$A$24:$A$33,$J13,'FAR Dep Summary'!$D$24:$D$33)","v":0},{"$f":"+SUMIF('FAR Dep Summary'!$A$24:$A$33,$J13,'FAR Dep Summary'!$E$24:$E$33)","v":10580.634285714286},{"$f":"+SUMIF('FAR Dep Summary'!$A$24:$A$33,$J13,'FAR Dep Summary'!$F$24:$F$33)","v":63483.805714285714},null,"Roll-off Truck",{"$f":"+'Bud Capital Input'!M58","v":105157},0,{"$f":"+T13-U13","v":105157},{"$f":"+'Bud Capital Input'!Q58","v":15022.428571428571},0,{"$f":"+'Bud Capital Input'!Q58","v":15022.428571428571},{"$f":"+V13-Y13","v":90134.571428571435},null,{"$f":"+J13","v":"Roll-off Truck"},{"$f":"+B13+K13+T13","v":1031753.44},{"$f":"+C13+L13","v":0},{"$f":"+D13+M13+V13","v":1031753.44},{"$f":"+E13+N13+W13","v":97096.205714285708},{"$f":"+F13+O13+X13","v":625903.79285714962},{"$f":"+G13+P13+Y13","v":723273.3485714352},{"$f":"+H13+Q13+Z13","v":308480.09142856469}]
[]
["Container Delivery",{"$f":"+SUMIF('Pre Acquisition Assets'!$C:$C,$A15,'Pre Acquisition Assets'!M:M)","v":0},0,{"$f":"+B15-C15","v":0},{"$f":"+SUMIF('Pre Acquisition Assets'!$C:$C,$A15,'Pre Acquisition Assets'!Q:Q)","v":0},{"$f":"+SUMIF('Pre Acquisition Assets'!$C:$C,$A15,'Pre Acquisition Assets'!V:V)","v":0},{"$f":"+SUMIF('Pre Acquisition Assets'!$C:$C,$A15,'Pre Acquisition Assets'!Z:Z)","v":0},{"$f":"+SUMIF('Pre Acquisition Assets'!C:C,A15,'Pre Acquisition Assets'!AA:AA)","v":0},null,"Container Delivery",{"$f":"+SUMIF('FAR Dep Summary'!$A$24:$A$33,$J15,'FAR Dep Summary'!$B$24:$B$33)","v":0},0,{"$f":"+K15-L15","v":0},{"$f":"+SUMIF('FAR Dep Summary'!$A$24:$A$33,$J15,'FAR Dep Summary'!$C$24:$C$33)","v":0},{"$f":"+SUMIF('FAR Dep Summary'!$A$24:$A$33,$J15,'FAR Dep Summary'!$D$24:$D$33)","v":0},{"$f":"+SUMIF('FAR Dep Summary'!$A$24:$A$33,$J15,'FAR Dep Summary'!$E$24:$E$33)","v":0},{"$f":"+SUMIF('FAR Dep Summary'!$A$24:$A$33,$J15,'FAR Dep Summary'!$F$24:$F$33)","v":0},null,"Container Delivery",{"$f":"+SUMIF('Bud Capital Input'!$L$57:$L$71,$S15,'Bud Capital Input'!M$57)*M75","v":0},0,{"$f":"+T15-U15","v":0},0,0,0,0,null,{"$f":"+J15","v":"Container Delivery"},{"$f":"+B15+K15+T15","v":0},{"$f":"+C15+L15","v":0},{"$f":"+D15+M15+V15","v":0},{"$f":"+E15+N15+W15","v":0},{"$f":"+F15+O15+X15","v":0},{"$f":"+G15+P15+Y15","v":0},{"$f":"+H15+Q15+Z15","v":0}]
{"$rows_left_out":38}
{"sheet":"FAR Dep Summary","index":2,"n_rows":33,"n_cols":6,"rows_kept":33,"cut":false,"hidden":false,"merged":[[3,0,3,5]]}
[]
[]
[]
["Live Pivot "]
["Pre Acquisistion Add?","No"]
[]
["Row Labels","Sum of Cost","Sum of Test Year Dep","Sum of BOY Accum","Sum of EOY Accum","Sum of EOY Average Investment"]
["Drop Boxes",40198.080000000002,2812.4016666666666,6449.26,9261.6616666666669,30936.418333333335]
["Garbage Trucks",1525,508.33333333333326,0,508.33333333333326,1016.6666666666667]
["Office Equipment",7105.7300000000005,2035.1013333333331,449.21605555571199,2484.3173888890451,4621.4126111109545]
["Service Truck",47517.68,9503.5360000000001,4693.05666666672,14196.59266666672,33321.087333333278]
["Shop Equipment",111922.44000000002,17146.597666666668,2875.6500000006936,20022.247666667365,91900.192333332641]
["Roll-off Truck",74064.44,10580.634285714286,0,10580.634285714286,63483.805714285714]
["Garbage Carts",42895.740000000005,6127.9628571428575,1531.9907142857155,7659.953571428573,35235.786428571431]
["Grand Total",325229.11,48714.567142857144,15999.173436508841,64713.740579365993,260515.36942063406]
{"$rows_left_out":19}
{"sheet":"FAR 04.30.2023","index":3,"n_rows":147,"n_cols":49,"rows_kept":147,"cut":false,"hidden":false,"merged":[[8,5,9,9],[8,12,8,13],[9,2,9,3],[9,12,9,13],[10,12,10,13]]}
[null,"Location","AssetID","ParentChild","Description","SystemNo",null,"MFGSerialNum","LicensePlate","ModelYear","VendorMfg","BodyManuf","InsuranceCategory","InServiceDate","AcquisitionDate","PONumber","EstimatedLife","AssetGL","AcqValue","AccumulatedGL","CurrentLifeToDate",null,"CurrentYearToDate","ExpenseGL","CurrentPeriodDepr","AcqType","FormerCompany","InvoiceNum","CompAsstNo","Book","ActivityCd","DeprMethod","BegLsDeprDate","LongName","Sequence","BegLifeToDate"]
[null,null,null,null,null,null,null,null,null,null,null,null,null,null,null,null,null,null,null,null,null,{"$f":"S2-U2","v":0}]
[null,{"$f":"_xll.ReportRange(\"FARReport\",A14:AJ148,A1:AJ1,A2:AJ2,_xll.Param($C$9,$C$10,C12,$M$9,$M$10,$M$11,$S$9,M12,$Y$10,$Y$9,S10,S11,CELL(\"address\",$E$6)),TRUE,FALSE)","v":"OK!: ReportRange Formula OK [jAction{}]"},null,null,null,null,null,null,null,null,null,"Default Month :",{"$f":"MONTH(NOW())","v":6},null,null,null,null,null,{"$f":"_xll.ReportDrill([3]ProjDepr!D3,,_xll.PairGroup(_xll.Pair('FAR 04.30.2023'!C9,[3]ProjDepr!D19),_xll.Pair(\"C:B\",[3]ProjDepr!D20),_xll.Pair(\"C:C\",[3]ProjDepr!D21),_xll.Pair(\"C:V\",[3]ProjDepr!D22)),\"Projected Depr\")","v":"OK!: ReportDrill 'Projected Depr' Formula OK [jAction{}]"},null,null,null,null,null,{"$f":"_xll.jFreezePanes(A14,A5)","v":"> jFreezePanes is ready. "},null,null,{"$f":"_xll.jFocus(C9)","v":"> jFocus is ready. "}]
[null,null,null,null,null,null,null,null,null,null,null,"Default Year :",{"$f":"IF(M3=12,YEAR(NOW()),YEAR(NOW()))","v":2023},null,null,null,null,null,"reportdrill(Invoice!C2,,pairgroup(pair(\"C:C\",Invoice!E8),pair(\"\",Invoice!E7,\"N\")),\"Drill To Invoices by FAS# (Exc CIP)\")",null,{"$f":"_xll.ReportDrill([3]Invoice!$C$2,,_xll.PairGroup(_xll.Pair(\"C:P\",[3]Invoice!$E$7),_xll.Pair(\"\",[3]Invoice!$E$8,\"N\"),_xll.Pair(\"\",[3]Invoice!$E$9,\"n\")),\"Drill To All Invoices by PO#\")","v":"OK!: ReportDrill 'Drill To All Invoices by PO#' Formula OK [jAction{}]"},null,null,{"$f":"_xll.ReportDrill([3]Invoice!$C$2,,_xll.PairGroup(_xll.Pair(\"C:P\",[3]Invoice!$E$7),_xll.Pair(\"\",[3]Invoice!$E$8,\"N\"),_xll.Pair(\"C:Z\",[3]Invoice!$E$9,\"n\")),\"Drill to Invoice by PO# and Invoice #\")","v":"OK!: ReportDrill 'Drill to Invoice by PO# and Invoice #' Formula OK [jAction{}]"}]
[null,"Fixed Asset Register",null,null,null,null,null,"Asset Count:",{"$f":"COUNT(C14:C148)","v":134},null,null,null,null,null,null,null,null,null,null,null,null,null,null,null,null,null,null,null,null,null,null,null,null,null,null,null,5,"Test Period Beg. Month"]
[null,"Data Last Updated in this Pull:",null,null,"May  8 2023  8:39AM",null,null,null,null,null,null,null,null,null,null,null,null,null,null,null,null,null,null,null,null,null,null,null,null,null,null,null,null,null,null,null,4,"Test Period End Month"]
[null,null,null,null,null,null,null,null,null,null,null,null,null,null,null,null,null,null,null,null,null,null,null,null,null,null,null,null,null,null,null,null,null,null,null,null,2022,"First Year"]
[null,null,null,null,null,null,null,null,null,null,null,null,null,null,null,null,null,null,null,null,null,null,null,null,null,null,null,null,null,null,null,null,null,null,null,null,2023,"Second year"]
[null,"Period:","2023-04",null,null,"Ctrl + Shift + J",null,null,null,null,null,"VIN:",null,null,"(Contains the string)",null,null,"Parent/Child:",null,"(Leave blank for all)",null,null,null,"Service Date To:",null,null,null,null,null,null,null,null,null,null,null,null,{"$f":"+AK8+(AK6/12)","v":2023.3333333333333},"Test Period End Mo/Yr"]
[null,"District:","2178",null,"(F9 Aware)",null,null,null,null,null,null,"Description:",null,null,"(Contains the string)",null,null,"Asset Acct:",null,null,null,null,null,"Service Date From:",null,null,null,null,null,null,null,null,null,null,null,null,{"$f":"+AK7+(AK5/12)","v":2022.4166666666667},"Test Period Beg. Mo/Yr"]
[null,null,null,null,null,null,null,null,null,null,null,"PO Number:",null,null,"(Contains the string)",null,null,"Exp Acct:"]
[null,"Asset #:",null,null,null,null,null,null,null,null,null,"Ins Category:",null,null,"(Not setup yet)",null,null,"Depreciated %:",null,"(Not setup yet)"]
[null,"District","Asset #","Parent/ Child","Descr","Container Count","NA","MFG Serial#","License Plate","Model Year","Vendor/Mfg","Body Mfg","Ins Category","In Service Date","Acq Date","CER #","Useful Life","Asset Account","Cost","Accum Account","Accum Life to Date","NBV","Accum YTD","Expense Account","Current Depr","Acq Type","Former Company","Invoice #","Company Asset #","Book","Activity Cd","Depr Meth","Beg Date","Dbase","Seq","Beg Depr","Truck #","Equipment Type for Lookup","Month","YearPIS","Year Fully Dep","Year/Mo Fully Dep","Monthly Dep","Annual Dep","Test Year Dep","BOY Accum","EOY Accum","EOY Average Investment","Pre Acquisistion Add?"]
[null,2178,304030,"P","2022 Galbreath T5 Pup Trailer",null,null,"1W9SR2533PC269294",null,0,null,null,"Trailer","2023-04-01","2023-04-01","2178-23-0004-1",700,14040,74064.44,14046,881.72,{"$f":"S14-U14","v":73182.720000000001},881.72,51260,881.72,"P",null,null,null,"Internal","A","SL",null,"WCNX",0,0,"DBT3","Roll-off Truck",{"$f":"MONTH($N14)","v":4},{"$f":"YEAR($N14)","v":2023},{"$f":"$AN14+($Q14/100)","v":2030},{"$f":"$AO14+($AM14/12)","v":2030.3333333333333},{"$f":"IFERROR($S14/($Q14/100)/12,0)","v":881.71952380952382},{"$f":"$AQ14*12","v":10580.634285714286},{"$f":"+IF(AP14<=$AK$9,0,AR14)","v":10580.634285714286},{"$f":"+IF(AP14<=$AK$10,S14,IF((AN14+(AM14/12))>=$AK$10,0,((S14-((AP14-$AK$10)*12)*AQ14))))","v":0},{"$f":"IF($AS14=0,S14,($AS14+$AT14))","v":10580.634285714286},{"$f":"$S14-$AU14","v":63483.805714285714},"No"]
[null,2178,299026,"P","HP ProBook 450 G9 Notebook - SN: 5CD2428C6F",1,null,null,null,0,"CDW DIR #2178",null,null,"2023-01-20","2023-01-20","2178-23-0005-1",300,14110,1312.04,14116,109.34,1202.7,109.34,70260,36.450000000000003,"P",null,"NA",null,"Internal","A","SL",null,"WCNX",0,0,null,"Office Equipment",{"$f":"MONTH($N15)","v":1},{"$f":"YEAR($N15)","v":2023},{"$f":"$AN15+($Q15/100)","v":2026},{"$f":"$AO15+($AM15/12)","v":2026.0833333333333},{"$f":"IFERROR($S15/($Q15/100)/12,0)","v":36.445555555555551},{"$f":"$AQ15*12","v":437.34666666666658},{"$f":"+IF(AP15<=$AK$9,0,AR15)","v":437.34666666666658},{"$f":"+IF(AP15<=$AK$10,S15,IF((AN15+(AM15/12))>=$AK$10,0,((S15-((AP15-$AK$10)*12)*AQ15))))","v":0},{"$f":"IF($AS15=0,S15,($AS15+$AT15))","v":437.34666666666658},{"$f":"$S15-$AU15","v":874.69333333333338},"No"]
{"$rows_left_out":133}
{"sheet":"Bud Capital Input","index":4,"n_rows":62,"n_cols":58,"rows_kept":62,"cut":false,"hidden":false,"merged":[]}
[null,null,null,"Column Definitions"]
[null,null,null,null,null,null,null,null,null,null,null,null,null,null,null,null,"TruckRequest#"]
["PONum_Modified","CurrentProjectNumber_FPS","ProjectNumber_FPS",null,"DeleteFlag","PoNumber","PoItemNumber","ProjectName_FPS","ItemDescription","Explanation",null,"AssetType","AssetSubType","Life","AddReplace","Condition","TruckCenterNum ValueList:RequestedTruckList","Jan","Feb","Mar","Apr","May","Jun","Jul","Aug","Sep","Oct","Nov","Dec",null,null,null,"FASNum",null,"ReplacementNotes","EquipmentNum","EquipmentModelYear",null,"FileLink hlink:FileLink"]
[null,null,"CurrentProjectNumber_FPS",null,null,null,"PoItemNumber",null,null,null,null,null,null,null,null,null,null,null,null,null,null,null,null,null,null,null,null,null,null,null,null,null,null,null,null,null,null,null,null,null,"MessageToUser"]
[null,null,null,"Formatting Range"]
[{"$f":"IF(AND(C6<>\"\", B6<>C6),TRUE, FALSE)","v":false},{"$f":"IF(RIGHT(\"0000\"&F6,4)&\"-\"&G6 <> \"0000-\", RIGHT(\"0000\"&F6,4)&\"-\"&G6, \"\")","v":""},null,1,null,null,null,null,null,null,null,null,null,null,null,null,null,null,null,null,null,null,null,null,null,null,null,null,null,null,{"$f":"SUM(R6:AC6)","v":0},null,null,null,null,null,null,null,null," ",null,null,{"$f":"IF(Q6=\"\", \"\", Q6)","v":""},{"$f":"IFERROR(VLOOKUP($AQ6,[2]TruckCenterReference!$C$23:$I26,3,FALSE), \"\")","v":""},{"$f":"IF(Q6<>\"\",IF(AR6<>H6,\"Review\",\"ok\"), \"\")","v":""},null,{"$f":"IFERROR(VLOOKUP($AQ6,[2]TruckCenterReference!$C$23:$I26,4,FALSE), \"\")","v":""},{"$f":"IF(Q6=\"\",\"\", IF($AU6<>$P6, \"Fix!\", \"ok\"))","v":""},null,{"$f":"IFERROR(VLOOKUP(M6,SubtypeToTruckType,2,FALSE),\"\")","v":""},{"$f":"IFERROR(VLOOKUP($AQ6,[2]TruckCenterReference!$C$23:$I26,6,FALSE), \"\")","v":""},{"$f":"IF(Q6<>\"\",IF(AX6<>AY6,\"Fix!\",\"ok\"), \"\")","v":""},null,{"$f":"IFERROR(VLOOKUP($AQ6,[2]TruckCenterReference!$C$23:$I26,7,FALSE), 0)","v":0},{"$f":"IFERROR(VLOOKUP($AQ6,[2]TruckCenterReference!$C$23:$K26,9,FALSE), 0)","v":0},{"$f":"IFERROR(VLOOKUP($AQ6,[2]TruckCenterReference!$C$23:$K26,8,FALSE), 0)","v":0},{"$f":"IF(BB6<>0,BB6-AE6-BD6,\"\")","v":""},{"$f":"IF(Q6=\"\",\"\",IF(ABS(BE6)>100,IF(RIGHT(M6,4)=\"Body\",\"Review\",\"Fix!\"),\"ok\"))","v":""}]
[null,null,null,"Report Formulas"]
[null,null,null,null,null,"Pull",null,null,null,null,null,{"$f":"_xll.jFreezePanes(I29,D22)","v":"> jFreezePanes is ready. "}]
[null,null,null,null,"Clear Hash:",{"$f":"_xll.ReportDefaults(\"Pull\",\"Clear\",_xll.PairGroup(_xll.Pair(\"\",H18)))","v":"OK!: ReportDefaults Formula OK [jAction{}]"},null,null,null,null,"CC Query Drill:",{"$f":"_xll.ReportDrill(,\"CCQueryDrill\",_xll.PairGroup(_xll.Pair(K18,\"SummaryLevel\"),_xll.Pair(H24,\"BudYear\"),_xll.Pair(H23,\"DistrictCell\"),_xll.Pair(C30:C79,\"PONumber\"),_xll.Pair(F20:AO20)),\"Drill to CC Query for Change History\")","v":"OK!: ReportDrill 'Drill to CC Query for Change History' Formula OK [jAction{}]"}]
[null,null,null,null,"Pull AssetTypeList:",{"$f":"_xll.ReportRun([2]AssetTypeList!C7,FALSE,\"Pull\")","v":"OK!: ReportRun Formula OK [jAction{}]"}]
[null,null,null,null,"Pull - BudCap:",{"$f":"_xll.ReportRange(\"BudgetCapitalDetailPull\",30:53,C3:BE3,C6:BE6,_xll.Param(H23,H24,H18,N18,K19))","v":"OK!: ReportRange Formula OK [jAction{}]"},null,null,null,null,null,null,null,null,null,null,null,null,null,null,null,null,null,null,null,null,null,null,null,null,null,null,"FASNum","FASDescription"]
[null,null,null,null,"Pull - FAS:",{"$f":"_xll.ReportFixed(\"BudCap1\",AG30:AG53,AG11:AH11,_xll.Param(DetailBudYear, DetailDistrict))","v":"OK!: ReportFixed Formula OK [jAction{}]"}]
[null,null,null,null,null,{"$f":"_xll.ReportRun([2]TruckCenterReference!F16,,\"Pull\")","v":"OK!: ReportRun Formula OK [jAction{}]"}]
[null,null,null,null,null,"Save"]
[null,null,null,null,"Save:",{"$f":"_xll.ReportSave(\"BudgetCapitalDetailSave\",B30:B53,A3:AM3,C4:AO4,_xll.Param(H23,H24,H18,N18))","v":"OK!: ReportSave Formula OK [jAction{}]"}]
{"$rows_left_out":48}
{"sheet":"Pre Acquisition Assets","index":5,"n_rows":191,"n_cols":29,"rows_kept":191,"cut":false,"hidden":false,"merged":[]}
[null,"Peninsula Sanitation Services, Inc.",null,null,null,null,null,null,null,null,null,null,null,null,null,5,"Test Period Beg. Month"]
[null,"Regulatory Depreciation Schedule",null,null,null,null,null,null,null,null,null,null,null,null,null,4,"Test Period End Month"]
[null,"2020-09-30",null,null,null,null,null,null,null,null,null,null,null,null,null,2022,"First Year"]
[null,null,null,null,null,null,null,null,null,null,null,null,null,null,null,2023,"Second year"]
[null,"$400k is the over reconized revenue ",null,null,null,null,null,null,null,null,null,null,null,null,null,{"$f":"+P4+(P2/12)","v":2023.3333333333333},"Test Period End Mo/Yr"]
[null,"Prior year adjustment for $400k February",null,null,null,null,null,null,null,null,null,null,null,null,null,{"$f":"+P3+(P1/12)","v":2022.4166666666667},"Test Period Beg. Mo/Yr"]
[null,"Livermore ",null,null,null,null,null,null,null,null,null,null,null,null,null,null,null,null,null,null,"Total","Beginning","Allocated",null,"Allocated","Ending"]
[null,null,null,"Date in Service",null,"Salvage",null,null,"Year",null,null,"Year/Mo",null,null,null,null,null,"Disposal","Total",null,"Allocated","Accumulated","Accumulated","Branch","Accum.","Accumulated"]
[null,null,null,null,null,"Value","Method","Life","Fully","Disposal",null,"Fully","Asset","Asset","Depreciable","Monthly","Test year","Year","Test yr.","%","Test year","Depreciation","Depreciation","Allo.","Depr.","Depreciation","Average"]
["Depreciation","DESCRIPTION","Waste Connections Equipment Type","Year","Mo.","%",null,null,"Depreciated","  Yr."," Mo.","Depreciated","Cost","Disposal","Cost","Depreciation","Depreciation","Depr.","Depr.","Allo.","Depr.","2019-10-01",39814,"%",39814,"2020-09-30","Investment"]
["Schedule No."]
[null,"GARBAGE COLLECTION EQUIPMENT"]
[]
[]
["53-a","1991 Peerless trailer ","Roll-off Truck",1998,9,0,"SL",5,{"$f":"+D15+H15","v":2003},null,null,{"$f":"+I15+E15/12","v":2003.75},{"$f":"7100-2343","v":4757},null,{"$f":"M15-M15*F15","v":4757},{"$f":"O15/H15/12","v":79.283333333333331},{"$f":"+IF(L15<=$P$5,0,P15*12)","v":0},{"$f":"IF(N15=0,0,IF((AND((AF15>=AE15),(AF15<=AD15))),((AF15-AE15)*12)*P15,0))","v":0},{"$f":"IF(R15>0,R15,Q15)","v":0},1,{"$f":"T15*SUM(Q15:R15)","v":0},{"$f":"+IF(L15<=$P$6,M15,IF((D15+(E15/12))>=$P$6,0,((M15-((L15-$P$6)*12)*P15))))","v":4757},{"$f":"V15*T15","v":4757},1,{"$f":"W15*X15","v":4757},{"$f":"+IF(U15=0,M15,Y15+U15)","v":4757},{"$f":"+O15-Z15","v":0}]
{"$rows_left_out":176}