{"text_format":"1","workbook":"xlsx","n_sheets":16,"sheets":["Pres & Prop Rev","Rate Design","Exh 1","Exh 5","ERM Offset","Exh 2","ROR","Bill Determ","Bill Impact","WA Sch 25","Lighting summary","St Lts","Area Lts","Capital Recovery Factor Calc","Block Data","Rev Runs 12MESEPT2015"],"not_rendered":{"charts":0,"images":0,"macros":1,"external_links":0,"defined_names":42,"comments":8,"pivot_tables":0},"unopened":[],"bounds":{"document_bytes":16777216,"sheet_cells":100000,"rows_first":2000,"rows_last":500,"rows_between":2000,"halvings":0,"cell_chars":16384,"cell_head_chars":4096},"cells_cut":0,"cells_raw":0,"read":"whole","date_system":"1900"}

{"sheet":"Pres & Prop Rev","index":0,"n_rows":302,"n_cols":16,"rows_kept":302,"cut":false,"hidden":false,"merged":[[5,15,10,17],[94,1,95,7]]}
[]
[null,{"$f":"IF(Base1_Billing2=2,\"BILLED\",\"\")","v":""}]
[]
["WORK PAPER",null," ","RESIDENTIAL","GENERAL SVC. ","LG. GEN. SVC.","EX LG GEN SVC","PUMPING","ST & AREA LTG"]
["REFERENCE",null,"TOTAL","SCHEDULE 1","SCH. 11,12","SCH. 21,22","SCHEDULE 25","SCH. 30, 31, 32","SCH. 41-48",null,null,null,null,null,null,"Print Header for all printed pages on this worksheet:"]
[null,"PRESENT BILL DETERMINANTS",null,null,null,null,null,null,null,null,null,"Calculate all revenue exhibits using  ____ rates:",null,null,null,{"$f":"\"AVISTA UTILITIES\nWASHINGTON ELECTRIC\nPRO FORMA REVENUE UNDER PRESENT AND PROPOSED \"&N9&\" RATES\n12 MONTHS ENDED SEPTEMBER 30, 2015\"","v":"AVISTA UTILITIES\nWASHINGTON ELECTRIC\nPRO FORMA REVENUE UNDER PRESENT AND PROPOSED BASE TARIFF RATES\n12 MONTHS ENDED SEPTEMBER 30, 2015"}]
[null,"KILOWATT HOURS (KWHS)",null,null,null,null,null,null,null,null,"1)","BASE TARIFF"]
["PDE-E-10","BLOCK 1",null,{"$f":"'Bill Determ'!$B$9","v":1568799173.4194205},{"$f":"'Bill Determ'!$B$17","v":417235444.63635033},{"$f":"'Bill Determ'!$B$28","v":1286691866.9453735},{"$f":"'Bill Determ'!$B$37","v":126000000},{"$f":"SUM('Bill Determ'!$B$41:$C$41)","v":52021552.456657603},null,null,null,"or",null,1]
{"$rows_left_out":295}
{"sheet":"Rate Design","index":1,"n_rows":127,"n_cols":23,"rows_kept":127,"cut":false,"hidden":false,"merged":[]}
["PRESENT RATES",null,null,1,2,3,4,5,6,null,null,null,null,"Tiers - used for bill comparisons"]
[null,null,"TOTAL","SCH. 1","SCH. 11,12","SCH. 21,22","SCH. 25","SCH. 30, 31, 32",null,null,null,"Range Name",null,"SCHEDULE 1","SCH. 11,12","SCH. 21,22","SCHEDULE 25","SCH. 30, 31, 32"]
[null,"Base Tariff Rates"]
[1,"BASIC CHARGE",null,9.5,20,0,0,20]
[2,"BLOCK 1 PER KWH",null,7.9829999999999997,12.023999999999999,7.6769999999999996,5.8959999999999999,10.362,null,null,null,null,null,800,3650,250000,500000]
[3,"BLOCK 2 PER KWH",null,9.2880000000000003,8.8350000000000009,6.8659999999999997,5.3049999999999997,7.4009999999999998,null,null,null,null,null,1500,9999999,9999999,9999999]
[4,"BLOCK 3 PER KWH",null,10.89,0,0,4.5359999999999996,0,null,null,null,"Rates_Base_Present",null,9999999,9999999,9999999,9999999]
[5,"BLOCK 4 PER KWH"]
{"$rows_left_out":120}
{"sheet":"Exh 1","index":2,"n_rows":83,"n_cols":20,"rows_kept":83,"cut":false,"hidden":false,"merged":[[4,0,4,14],[0,17,2,18],[0,0,0,14],[1,0,1,14],[2,0,2,14],[3,0,3,14]]}
["AVISTA UTILITIES",null,null,null,null,null,null,null,null,null,null,null,null,null,null,null,null,"This worksheet pulls data from 'Pres & Prop Rev' tab."]
["WASHINGTON ELECTRIC"]
["PROPOSED INCREASE BY SERVICE SCHEDULE"]
["12 MONTHS ENDED SEPTEMBER 30, 2015"]
["(000s of Dollars)"]
[]
[]
["2017 Rate Change"]
{"$rows_left_out":76}
{"sheet":"Exh 5","index":3,"n_rows":63,"n_cols":21,"rows_kept":63,"cut":false,"hidden":false,"merged":[[10,0,10,2]]}
["AVISTA UTILITIES",null,null,null,null,null,null,null,null,null,null,null,null,null,null,null,"This worksheet uses Base & Billing rates from 'Rate Design' tab."]
["WASHINGTON ELECTRIC"]
["PRESENT AND PROPOSED RATE COMPONENTS BY SCHEDULE"]
[]
[]
[]
["2018 Rate Change"]
[]
{"$rows_left_out":56}
{"sheet":"ERM Offset","index":4,"n_rows":43,"n_cols":12,"rows_kept":43,"cut":false,"hidden":false,"merged":[[0,0,0,7],[1,0,1,7],[2,0,2,7],[3,0,3,7],[4,0,4,7]]}
["AVISTA UTILITIES"]
["WASHINGTON ELECTRIC"]
["PROPOSED ERM DECREASE BY SERVICE SCHEDULE"]
["12 MONTHS ENDED SEPTEMBER 30, 2015"]
["(000s of Dollars)"]
[]
[]
[]
{"$rows_left_out":36}
{"sheet":"Exh 2","index":5,"n_rows":47,"n_cols":9,"rows_kept":47,"cut":false,"hidden":false,"merged":[]}
["2018 Rate Change"]
[]
["6 Month 2018 Revenue Requirement Annualized"]
[]
[]
[]
["6 Month Revenue Requirement",null,8986000]
[]
{"$rows_left_out":40}
{"sheet":"ROR","index":6,"n_rows":25,"n_cols":11,"rows_kept":25,"cut":false,"hidden":false,"merged":[]}
[null,"AVISTA UTILITIES"]
[null,"WASHINGTON ELECTRIC"]
[null,"PRESENT & PROPOSED RATE OF RETURN BY RATE SCHEDULE"]
[null,"12 MONTHS ENDED SEPTEMBER 30, 2015"]
[]
[]
[null,null,"Total","Sch 1","Sch 11","Sch 21","Sch 25","Sch 31","Schs 41-48"]
[]
{"$rows_left_out":18}
{"sheet":"Bill Determ","index":7,"n_rows":85,"n_cols":7,"rows_kept":85,"cut":false,"hidden":false,"merged":[]}
["AVISTA UTILITIES"]
["WASHINGTON ELECTRIC"]
["ACTUAL / PRO FORMA BILLING DETERMINANTS BY RATE SCHEDULE"]
["12 MONTHS ENDED SEPTEMBER 30, 2015"]
[]
[]
[]
["Schedule 1","0-800 kwhs","801-1500 kwhs","over 1500 kwhs","Total kwhs","Total Billings(2)"]
{"$rows_left_out":78}
{"sheet":"Bill Impact","index":8,"n_rows":24,"n_cols":13,"rows_kept":24,"cut":false,"hidden":false,"merged":[]}
[]
[]
["Schedule 001 Bill Impact"]
[]
[]
[]
["Schedule 001 Present",null,null,null,null,null,"Schedule 001 Proposed"]
[null,"Basic Charge","Block 1","Block 2","Total Bill",null,"Basic Charge","Block 1","Block 2","Total Bill",null,"Bill Impact","% Change"]
{"$rows_left_out":17}
{"sheet":"WA Sch 25","index":9,"n_rows":162,"n_cols":19,"rows_kept":162,"cut":false,"hidden":false,"merged":[]}
["Washington Schedule 25 Billing Determinants",null,null,null,null,null,null,null,null,null,null,null,null,null,null,null,"1st",{"$f":"Q2","v":500000},{"$f":"R2","v":6000000}]
[null,null,null,null,null,null,null,null,null,null,null,null,null,null,null,"12-mo Ended",500000,6000000,99999999]
["KWHs",null,"Acct No.","2014-10-01","2014-11-01","2014-12-01","2015-01-01","2015-02-01","2015-03-01","2015-04-01","2015-05-01","2015-06-01","2015-07-01","2015-08-01","2015-09-01","Total","kwhs/mo","kwhs/mo","kwhs/mo"]
[1,"BF Goodrich",770037736,5882734,5774042,5504894,5140514,4919821,5227316,4857548,5729161,5940988,5908791,6245412,4770637,{"$f":"SUM(D4:O4)","v":65901858},{"$f":"Q$2*12-SUMPRODUCT(--($D4:$O4<=Q$2),Q$2-$D4:$O4)","v":6000000},{"$f":"R$2*12-SUM($Q4:Q4)-SUMPRODUCT(--($D4:$O4<=R$2),R$2-$D4:$O4)","v":59656446},{"$f":"S$2*12-SUM($Q4:R4)-SUMPRODUCT(--($D4:$O4<=S$2),S$2-$D4:$O4)","v":245412}]
[2,"Boise Cascade Plywood",500017,3407368,3115073,3053501,3163179,3086672,3402088,3123964,3247263,3197489,3125946,3207040,3026142,38155725,{"$f":"Q$2*12-SUMPRODUCT(--($D5:$O5<=Q$2),Q$2-$D5:$O5)","v":6000000},{"$f":"R$2*12-SUM($Q5:Q5)-SUMPRODUCT(--($D5:$O5<=R$2),R$2-$D5:$O5)","v":32155725},{"$f":"S$2*12-SUM($Q5:R5)-SUMPRODUCT(--($D5:$O5<=S$2),S$2-$D5:$O5)","v":0}]
[3,"Boise Cascade Sawmill",500018,1382489,1391916,1484435,1514640,1278729,1393465,1380956,1271434,1318835,1328454,1242214,1141153,16128720,6000000,{"$f":"R$2*12-SUM($Q6:Q6)-SUMPRODUCT(--($D6:$O6<=R$2),R$2-$D6:$O6)","v":10128720},{"$f":"S$2*12-SUM($Q6:R6)-SUMPRODUCT(--($D6:$O6<=S$2),S$2-$D6:$O6)","v":0}]
[4,"City of Spokane Sewage Treatment Plt",1900002,1389727,1327000,1368297,1440358,1325354,1432204,1291823,1371648,1316968,1364038,1374131,1273241,16274789,6000000,{"$f":"R$2*12-SUM($Q7:Q7)-SUMPRODUCT(--($D7:$O7<=R$2),R$2-$D7:$O7)","v":10274789},{"$f":"S$2*12-SUM($Q7:R7)-SUMPRODUCT(--($D7:$O7<=S$2),S$2-$D7:$O7)","v":0}]
[5,"Deaconess Medical Center",1900011,1794555,1650277,1737708,1760692,1568950,1751795,1746374,1984374,2164086,2253430,2141574,1713296,22267111,6000000,{"$f":"R$2*12-SUM($Q8:Q8)-SUMPRODUCT(--($D8:$O8<=R$2),R$2-$D8:$O8)","v":16267111},{"$f":"S$2*12-SUM($Q8:R8)-SUMPRODUCT(--($D8:$O8<=S$2),S$2-$D8:$O8)","v":0}]
{"$rows_left_out":155}
{"sheet":"Lighting summary","index":10,"n_rows":53,"n_cols":16,"rows_kept":53,"cut":false,"hidden":false,"merged":[[6,2,6,3],[6,5,6,6]]}
[null,"AVISTA UTILITIES"]
[null,"WASHINGTON ELECTRIC"]
[null,"STREET & AREA LIGHT REVENUE UNDER PRESENT & PROPOSED RATES"]
[null,"12 MONTHS ENDED SEPTEMBER 30, 2015"]
[]
[]
[null,null,{"$f":"\"Present \"&IF(Base1_Billing2=2,\"Billing \",\"\")&\"Rates(1)\"","v":"Present Rates(1)"},{"$f":"\"Present \"&IF(Base1_Billing2=2,\"Billing\",\"\")&\" Rates\"","v":"Present  Rates"},null,{"$f":"\"Proposed \"&IF(Base1_Billing2=2,\"Billing \",\"\")&\"Rates(2)\"","v":"Proposed Rates(2)"},{"$f":"\"Proposed \"&IF(Base1_Billing2=2,\"Billing \",\"\")&\"Rates\"","v":"Proposed Rates"},null,"% Revenue Change"]
[null,null,"Monthly ","Annual",null,"Monthly ","Annual",null,null,null,null,"Target Base",null,"Annual","Present","Proposed"]
{"$rows_left_out":46}
{"sheet":"St Lts","index":11,"n_rows":104,"n_cols":74,"rows_kept":104,"cut":false,"hidden":false,"merged":[]}
["Street Light Summary",null,null,null,null,null,null,null,"WASHINGTON Street Lights",null,null,null,null,null,null,null,null,null,null,null,null,null,null,null,null,null,null,null,null,null,null,null,null,null,null,"% rate increase -->",{"$f":"'Lighting summary'!L11","v":4.4500000000000005E-2},{"$f":"'Lighting summary'!L12","v":4.4500000000000005E-2},{"$f":"'Lighting summary'!L13","v":4.4500000000000005E-2},{"$f":"'Lighting summary'!L14","v":4.4500000000000005E-2},{"$f":"'Lighting summary'!L15","v":4.4500000000000005E-2},null,null,null,null,null,null,null,null,null,null,null,null,null,null,-3.6999999999999999E-4,"compare input Present Billing Rates to calculated Present Billing Rates",null,null,null,null,null,null,{"$f":"BE2","v":1.0121}]
["DWWPAOAE Report, as of 1/8/15",null,null,null,null,null,null,null,null,null,null,null,"Number of Lights(1)",null,null,null,null,null,"Present Rates",null,null,null,null,null,"Monthly Revenue at Present Rates",null,null,null,null,null,"Number of Lights",null,null,null,null,null,"Proposed Rates",null,null,null,null,null,"Monthly Revenue at Proposed Rates",null,null,null,null,null,null,"Present Billing Rates",null,null,null,null,null,8.6199999999999992E-3,{"$f":"1+'Lighting summary'!I39","v":1.0121},"Sch 91 & 93",null,null,null,null,null,"New Billing Rates",null,null,null,null,null,"Increase"]
[null,null,null,null,null,null,null,null,"Fixture Type","Pole Facility","Size","Sched","041","042","044","045","046",null,"041","042","044","045","046",null,"041","042","044","045","046",null,"041","042","044","045","046",null,"041","042","044","045","046",null,"041","042","044","045","046",null,"kwh","041","042","044","045","046",null,"Sch 93/94","041","042","044","045","046",null,null,"041","042","044","045","046",null,"041","042","044","045","046"]
[null,null,null,null,null,null,null,null,"Single Mercury Vapor","Direct Burial",4000,214,{"$f":"SUMIF($G:$G,TEXT(M$3,\"000\")&TEXT($L4,\"000\"),$E:$E)","v":75},0,0,0,0,null,15.43,0,0,0,0,null,{"$f":"IF(AND(M4<>0,S4=0),#VALUE!,M4*S4)","v":1157.25},{"$f":"IF(AND(N4<>0,T4=0),#VALUE!,N4*T4)","v":0},{"$f":"IF(AND(O4<>0,U4=0),#VALUE!,O4*U4)","v":0},{"$f":"IF(AND(P4<>0,V4=0),#VALUE!,P4*V4)","v":0},{"$f":"IF(AND(Q4<>0,W4=0),#VALUE!,Q4*W4)","v":0},null,{"$f":"M4","v":75},{"$f":"N4","v":0},0,0,0,null,{"$f":"ROUND(S4*(1+AK$1),2)","v":16.12},0,0,0,0,null,{"$f":"IF(AND(AE4<>0,AK4=0),#VALUE!,AE4*AK4)","v":1209},{"$f":"IF(AND(AF4<>0,AL4=0),#VALUE!,AF4*AL4)","v":0},{"$f":"IF(AND(AG4<>0,AM4=0),#VALUE!,AG4*AM4)","v":0},{"$f":"IF(AND(AH4<>0,AN4=0),#VALUE!,AH4*AN4)","v":0},{"$f":"IF(AND(AI4<>0,AO4=0),#VALUE!,AI4*AO4)","v":0},{"$f":"SUM(AQ4:AU4)-SUM(Y4:AC4)","v":51.75},42,14.45,null,null,null,null,null,{"$f":"ROUND(AW4*$BD$2,2)+ROUND(AW4*$BD$1,2)","v":0.33999999999999997},{"$f":"ROUND((S4*$BE$2),2)+ROUND($BD4-AX4,2)","v":1.5099999999999998},null,null,null,null,null,null,{"$f":"AK4*$BL$1","v":16.315052000000001},{"$f":"AL4*$BL$1","v":0},0,0,0,null,{"$f":"BL4-AX4","v":1.8650520000000022},{"$f":"BM4-AY4","v":0},{"$f":"BN4-AZ4","v":0},{"$f":"BO4-BA4","v":0},{"$f":"BP4-BB4","v":0}]
[null,"State","Sched","Rate Sub","# of Lights",null,null,null,"Single High-Pressure Sodium Vapor","Direct Burial","50W",234,0,129,0,0,0,null,0,14.49,0,0,0,null,{"$f":"IF(AND(M5<>0,S5=0),#VALUE!,M5*S5)","v":0},{"$f":"IF(AND(N5<>0,T5=0),#VALUE!,N5*T5)","v":1869.21},{"$f":"IF(AND(O5<>0,U5=0),#VALUE!,O5*U5)","v":0},{"$f":"IF(AND(P5<>0,V5=0),#VALUE!,P5*V5)","v":0},{"$f":"IF(AND(Q5<>0,W5=0),#VALUE!,Q5*W5)","v":0},null,{"$f":"M5","v":0},129,0,0,0,null,0,15.13,0,0,0,null,{"$f":"IF(AND(AE5<>0,AK5=0),#VALUE!,AE5*AK5)","v":0},{"$f":"IF(AND(AF5<>0,AL5=0),#VALUE!,AF5*AL5)","v":1951.7700000000002},0,0,0,82.560000000000173,20,null,13.59,null,null,null,null,{"$f":"ROUND(AW5*$BD$2,2)+ROUND(AW5*$BD$1,2)","v":0.16},null,{"$f":"ROUND((T5*$BE$2)+$BD5-AY5,2)","v":1.24},null,null,null,null,null,{"$f":"AK5*$BL$1","v":0},{"$f":"AL5*$BL$1","v":15.313073000000001},{"$f":"AM5*$BL$1","v":0},{"$f":"AN5*$BL$1","v":0},{"$f":"AO5*$BL$1","v":0},null,{"$f":"BL5-AX5","v":0},{"$f":"BM5-AY5","v":1.7230730000000012},{"$f":"BN5-AZ5","v":0},{"$f":"BO5-BA5","v":0},{"$f":"BP5-BB5","v":0}]
[null,null,null,null,null,null,null,null,"High-Pressure Sodium Vapor","Dusk to Dawn","70W",335,0,0,0,0,41,null,0,0,0,0,3.73,null,0,0,0,0,152.93,null,0,0,0,0,41,null,0,0,0,0,3.9,null,0,0,0,0,159.9,6.9699999999999989,25,null,null,null,null,3.47,null,0.21,null,null,null,null,0.52,null,null,0,0,0,0,3.94719,null,0,0,0,0,0.47718999999999978]
[null,2,"041",214,{"$f":"75","v":75},null,{"$f":"IF(OR(ISBLANK(C7),ISBLANK(D7)),\"\",TEXT(C7,\"000\")&TEXT(D7,\"000\"))","v":"041214"},null,"Single Mercury Vapor","Wood Pole",7000,411,32,0,0,0,0,null,16.73,0,0,0,0,null,535.36,0,0,0,0,null,32,0,0,0,0,null,17.47,0,0,0,0,null,559.04,0,0,0,0,23.67999999999995,80,15.62,null,null,null,null,null,0.65999999999999992,{"$f":"ROUND((S7*$BE$2)+$BD7-AX7,2)","v":1.97},null,null,null,null,null,null,17.681386999999997,0,0,0,0,null,2.0613869999999981,0,0,0,0]
[null,2,"041",411,32,null,"041411",null,"Mercury Vapor","Dusk to Dawn",7000,415,0,0,0,73,0,null,0,0,0,7.34,0,null,0,0,0,535.81999999999994,0,null,0,0,0,73,0,null,0,0,0,7.67,0,null,0,0,0,559.91,0,24.090000000000032,80,null,null,null,6.82,null,null,0.65999999999999992,null,null,null,1.27,null,null,null,0,0,0,7.7628069999999996,0,null,0,0,0,0.94280699999999928,0]
{"$rows_left_out":97}
{"sheet":"Area Lts","index":12,"n_rows":67,"n_cols":49,"rows_kept":67,"cut":false,"hidden":false,"merged":[]}
["Area Light Summary",null,null,null,null,null,null,null,"WASHINGTON Area Lights",null,null,null,null,null,null,null,null,null,"Monthly Rev.",null,null,null,null,null,null,{"$f":"SL_RateIncr","v":0},null,null,"% rate increase -->",{"$f":"'Lighting summary'!L16","v":4.4500000000000005E-2},null,null,"Monthly Rev.",null,null,-5.1000000000000004E-4,8.6199999999999992E-3,{"$f":"-0.00037","v":-3.6999999999999999E-4},null,null,null,"compare input Present Billing Rates to calculated Present Billing Rates"]
["DWWPWMS.AREA_LIGHT_ASMBLY1, as of 1/8/15",null,null,null,null,null,null,null,null,null,null,null,"# of Lights(1)",null,null,"Pres. Rates",null,null,"at Pres. Rates",null,null,"# of Lights(1)",null,null,null,null,"# of Lights",null,null,"Prop. Rates",null,null,"at Prop. Rates",null,null,null,"Pres. Billing Rates",null,null,null,null,{"$f":"'St Lts'!BE2","v":1.0121},{"$f":"'St Lts'!BF2","v":"Sch 91 & 93"},null,"New Billing Rates",null,{"$f":"'Lighting summary'!I39","v":1.21E-2},"Increase"]
[null,null,null,null,null,null,null,null,"Fixture Type","Pole Facility","Size","Sched","047","048",null,"047","048",null,"047","048",null,"047","048",null,null,null,"047","048",null,"047","048",null,"047","048",null,"kwh","047","048","Sch 59","Sch 93","Sch 94","047","048",null,"047","048",null,"047","048"]
[null,null,null,null,null,null,null,"Monthly","Sodium Vapor","Granville w/16' decorative pole","100W","HAG",{"$f":"SUMIF($G:$G,TEXT(M$3,\"000\")&TEXT($L4,\"000\"),$E:$E)","v":0},0,null,32.36,{"$f":"P4","v":32.36},null,{"$f":"IF(AND(M4<>0,P4=0),#VALUE!,M4*P4)","v":0},{"$f":"IF(AND(N4<>0,Q4=0),#VALUE!,N4*Q4)","v":0},null,{"$f":"SUMIF($G:$G,TEXT(V$3,\"000\")&TEXT($L4,\"000\"),$E:$E)","v":0},0,null,null,null,{"$f":"M4","v":0},{"$f":"N4","v":0},null,{"$f":"ROUND(P4*(1+AD$1),2)","v":33.799999999999997},{"$f":"AD4","v":33.799999999999997},null,{"$f":"IF(AND(AA4<>0,AD4=0),#VALUE!,AA4*AD4)","v":0},{"$f":"IF(AND(AB4<>0,AE4=0),#VALUE!,AB4*AE4)","v":0},null,40,30.34,30.33,{"$f":"ROUND($AJ$1*$AJ4,2)","v":-0.02},{"$f":"ROUND($AK$1*$AJ4,2)","v":0.34},{"$f":"ROUND($AL$1*$AJ4,2)","v":-0.01},{"$f":"ROUND(P4*$AP$2-AK4+AN4+AO4,2)","v":2.74},{"$f":"ROUND(Q4*$AP$2-AL4+AM4+AN4+AO4,2)","v":2.73},null,{"$f":"AD4*$AU$2","v":0.40897999999999995},{"$f":"AE4*$AU$2+AM4","v":0.38897999999999994},null,{"$f":"AS4-AK4","v":-29.93102},{"$f":"AT4-AL4","v":-29.941019999999998}]
[null,"State","Sched","Rate Sub","# of Lights",null,null,"kWh's","Sodium Vapor","Floodlight on existing standard","250W","HAH",107,10,null,23.95,{"$f":"P5","v":23.95},null,2562.65,239.5,null,107,10,null,null,null,{"$f":"M5","v":107},10,null,25.02,{"$f":"AD5","v":25.02},null,2677.14,250.2,null,107,22.38,22.35,{"$f":"ROUND($AJ$1*$AJ5,2)","v":-0.05},{"$f":"ROUND($AK$1*$AJ5,2)","v":0.92},{"$f":"ROUND($AL$1*$AJ5,2)","v":-0.04},{"$f":"ROUND(P5*$AP$2-AK5+AN5+AO5,2)","v":2.74},{"$f":"ROUND(Q5*$AP$2-AL5+AM5+AN5+AO5,2)","v":2.72},null,{"$f":"AD5*$AU$2","v":0.30274200000000001},{"$f":"AE5*$AU$2+AM5","v":0.25274200000000002},null,{"$f":"AS5-AK5","v":-22.077258},{"$f":"AT5-AL5","v":-22.097258}]
[null,null,null,null,null,null,null,null,"Sodium Vapor","Kim light w/25' fiberglass pole","100W","HAI",18,3,null,31.26,31.26,null,562.68000000000006,93.78,null,18,3,null,null,null,18,3,null,32.65,{"$f":"AD6","v":32.65},null,587.69999999999993,97.949999999999989,null,40,29.31,29.3,-0.02,0.34,-0.01,2.66,2.65,null,{"$f":"AD6*$AU$2","v":0.39506499999999994},0.37506499999999993,null,-28.914935,-28.924935000000001]
[null,"WA","047","HAH",107,null,{"$f":"IF(OR(ISBLANK(C7),ISBLANK(D7)),\"\",TEXT(C7,\"000\")&TEXT(D7,\"000\"))","v":"047HAH"},{"$f":"E7*AJ5","v":11449},"Sodium Vapor","Post Top w/16' decorative pole","100W","HAP",0,0,null,30.86,30.86,null,0,0,null,0,0,null,null,null,0,0,null,32.229999999999997,32.229999999999997,null,0,0,null,40,28.94,28.93,-0.02,0.34,-0.01,2.62,2.61,null,0.38998299999999997,0.36998299999999995,null,-28.550017,-28.560016999999998]
[null,"WA","047","HAI",18,null,{"$f":"IF(OR(ISBLANK(C8),ISBLANK(D8)),\"\",TEXT(C8,\"000\")&TEXT(D8,\"000\"))","v":"047HAI"},{"$f":"E8*AJ6","v":720},"Sodium Vapor","on existing standard","100W","HPA",641,986,null,14.84,14.84,null,9512.44,14632.24,null,641,986,null,null,null,641,986,null,15.5,15.5,null,9935.5,15283,null,40,13.89,13.88,-0.02,0.34,-0.01,{"$f":"ROUND(P8*$AP$2,2)-AK8+AN8+AO8","v":1.4599999999999991},1.45,null,0.18754999999999999,0.16755,null,-13.702450000000001,-13.71245]
{"$rows_left_out":60}
{"sheet":"Capital Recovery Factor Calc","index":13,"n_rows":40,"n_cols":16,"rows_kept":40,"cut":false,"hidden":true,"merged":[]}
[]
[]
[]
[]
["Avista",null,null,null,null,"Avista",null,null,null,null,null,"Avista"]
["Capital Recovery Factor Calculation",null,null,null,null,"Capital Recovery Factor Calculation",null,null,null,null,null,"Capital Recovery Factor Calculation"]
["Present - UE-120436",null,null,null,null,"Present - UE-150204",null,null,null,null,null,"Proposed - UE- 16____"]
[]
{"$rows_left_out":33}
{"sheet":"Block Data","index":14,"n_rows":101,"n_cols":19,"rows_kept":101,"cut":false,"hidden":false,"merged":[]}
[]
[]
["WASHINGTON ELECTRIC SYSTEM"]
[null,null,"October","November","December","January","February","March","April","May","June","July","August","September","Annual Total"]
["Rate Design Program Monthly Results"]
["Block ID 900","Schedule 001"]
[null,"Block 1",116537374,124201630,141834640,144260498,155834065.00027999,133095100.00025,128411581.66687,120978516.99996001,119648469.66695,132526056.99992999,128642573,126693574,{"$f":"SUM(C7:N7)","v":1572664079.33424},null,null,0,{"$f":"R7/$R$10","v":{"$error":"#DIV/0!"}}]
[null,"Block 2",23119328,30802898,60796897,72113480,60708553.99972,43645718.999750003,34857662.333130002,25892541.000039998,27049346.333050001,49582054.000069998,41345375,34401422,{"$f":"SUM(C8:N8)","v":504315276.66575998},null,null,0,{"$f":"R8/$R$10","v":{"$error":"#DIV/0!"}}]
{"$rows_left_out":94}
{"sheet":"Rev Runs 12MESEPT2015","index":15,"n_rows":118,"n_cols":17,"rows_kept":118,"cut":false,"hidden":false,"merged":[]}
[]
[]
[]
[null,"Electric Revenue Meters Report by Location  Twelve Months Ended  for Report Date : '09/30/2015'"]
[]
[null,"State Cde:WA"]
[]
[null,null,null,"Meters"]
{"$rows_left_out":110}