{"text_format":"1","workbook":"xlsx","n_sheets":16,"sheets":["Pres & Prop Rev","Rate Design","Yr 1 RS","Yr 1 RD","Rate Spread GRC","Bill Determ","Sch 25 - Billing Rate","Bill Impact","WA Sch 25","Lighting summary","St Lts","Area Lts","Capital Recovery Factor Calc","TIB","Block Data","REVRUNS 12ME1216"],"not_rendered":{"charts":0,"images":0,"macros":1,"external_links":1,"defined_names":44,"comments":8,"pivot_tables":0},"unopened":[],"bounds":{"document_bytes":16777216,"sheet_cells":100000,"rows_first":2000,"rows_last":500,"rows_between":2000,"halvings":0,"cell_chars":16384,"cell_head_chars":4096},"cells_cut":0,"cells_raw":0,"read":"whole","date_system":"1900"}

{"sheet":"Pres & Prop Rev","index":0,"n_rows":305,"n_cols":30,"rows_kept":305,"cut":false,"hidden":false,"merged":[[5,15,10,17],[94,1,95,7]]}
[]
[null,{"$f":"IF(Base1_Billing2=2,\"BILLED\",\"\")","v":""}]
[]
["WORK PAPER",null," ","RESIDENTIAL","GENERAL SVC. ","LG. GEN. SVC.","EX LG GEN SVC","PUMPING","ST & AREA LTG"]
["REFERENCE",null,"TOTAL","SCHEDULE 1,2","SCH. 11,12","SCH. 21,22","SCHEDULE 25","SCH. 30, 31, 32","SCH. 41-48",null,null,null,null,null,null,"Print Header for all printed pages on this worksheet:"]
[null,"PRESENT BILL DETERMINANTS",null,null,null,null,null,null,null,null,null,"Calculate all revenue exhibits using  ____ rates:",null,null,null,{"$f":"\"AVISTA UTILITIES\nWASHINGTON ELECTRIC\nPRO FORMA REVENUE UNDER PRESENT AND PROPOSED \"&N9&\" RATES\n12 MONTHS ENDED DECEMBER 31, 2016\"","v":"AVISTA UTILITIES\nWASHINGTON ELECTRIC\nPRO FORMA REVENUE UNDER PRESENT AND PROPOSED BASE TARIFF RATES\n12 MONTHS ENDED DECEMBER 31, 2016"}]
[null,"KILOWATT HOURS (KWHS)",null,null,null,null,null,null,null,null,"1)","BASE TARIFF"]
["PDE-E-10","BLOCK 1",null,{"$f":"'Bill Determ'!$B$9","v":1563076767.9807405},{"$f":"'Bill Determ'!$B$17","v":419807178.34828663},{"$f":"'Bill Determ'!$B$28","v":1239435303.168977},{"$f":"'Bill Determ'!$B$37","v":125975035},{"$f":"SUM('Bill Determ'!$B$43:$C$43)","v":46317791.519616842},null,null,null,"or",null,1]
{"$rows_left_out":298}
{"sheet":"Rate Design","index":1,"n_rows":127,"n_cols":23,"rows_kept":127,"cut":false,"hidden":false,"merged":[]}
["PRESENT RATES",null,null,1,2,3,4,5,6,null,null,null,null,"Tiers - used for bill comparisons"]
[null,null,"TOTAL","SCH. 1,2","SCH. 11,12","SCH. 21,22","SCH. 25","SCH. 30, 31, 32",null,null,null,"Range Name",null,"SCHEDULE 1,2","SCH. 11,12","SCH. 21,22","SCHEDULE 25","SCH. 30, 31, 32"]
[null,"Base Tariff Rates"]
[1,"BASIC CHARGE",null,8.5,18,0,0,18]
[2,"BLOCK 1 PER KWH",null,7.39,11.292999999999999,7.0890000000000004,5.5049999999999999,9.5459999999999994,null,null,null,null,null,800,3650,250000,500000]
[3,"BLOCK 2 PER KWH",null,8.5980000000000008,8.298,6.34,4.9530000000000003,6.8179999999999996,null,null,null,null,null,1500,9999999,9999999,9999999]
[4,"BLOCK 3 PER KWH",null,10.08,0,0,4.2350000000000003,0,null,null,null,"Rates_Base_Present",null,9999999,9999999,9999999,9999999]
[5,"BLOCK 4 PER KWH"]
{"$rows_left_out":120}
{"sheet":"Yr 1 RS","index":2,"n_rows":62,"n_cols":29,"rows_kept":62,"cut":false,"hidden":false,"merged":[[4,0,4,16],[0,19,2,20],[0,0,0,16],[1,0,1,16],[2,0,2,16],[3,0,3,16]]}
["AVISTA UTILITIES",null,null,null,null,null,null,null,null,null,null,null,null,null,null,null,null,null,null,"This worksheet pulls data from 'Pres & Prop Rev' tab."]
["WASHINGTON ELECTRIC"]
["PROPOSED INCREASE BY SERVICE SCHEDULE"]
["12 MONTHS ENDED DECEMBER 31, 2016"]
["(000s of Dollars)"]
[]
[]
[]
{"$rows_left_out":55}
{"sheet":"Yr 1 RD","index":3,"n_rows":64,"n_cols":20,"rows_kept":64,"cut":false,"hidden":false,"merged":[[10,0,10,2]]}
["AVISTA UTILITIES",null,null,null,null,null,null,null,null,null,null,null,null,null,null,"This worksheet uses Base & Billing rates from 'Rate Design' tab."]
["WASHINGTON ELECTRIC"]
["PRESENT AND PROPOSED RATE COMPONENTS BY SCHEDULE"]
[]
[]
[]
["May 1, 2018 Increase"]
[]
{"$rows_left_out":57}
{"sheet":"Rate Spread GRC","index":4,"n_rows":31,"n_cols":8,"rows_kept":31,"cut":false,"hidden":false,"merged":[]}
[]
[]
["Avista"]
["Electric"]
["Rate Spread"]
[]
[]
[]
{"$rows_left_out":24}
{"sheet":"Bill Determ","index":5,"n_rows":86,"n_cols":7,"rows_kept":86,"cut":false,"hidden":false,"merged":[]}
["AVISTA UTILITIES"]
["WASHINGTON ELECTRIC"]
["ACTUAL / PRO FORMA BILLING DETERMINANTS BY RATE SCHEDULE"]
["12 MONTHS ENDED DECEMBER 31, 2016"]
[]
[]
[]
["Schedule 1, 2","0-800 kWhs","801-1500 kWhs","over 1500 kWhs","Total kWhs","Total Billings(2)"]
{"$rows_left_out":79}
{"sheet":"Sch 25 - Billing Rate","index":6,"n_rows":61,"n_cols":28,"rows_kept":61,"cut":false,"hidden":false,"merged":[]}
["WA 2017 GRC",null,null,"Billing Rates",null,null,null,null,null,{"$f":"D1","v":"Billing Rates"}]
[null,null,null,null,null,null,null,null,null,"PRESENT RATES",null,"Block1","Block2","Block3"]
["PRESENT",null,null,null,null,null,null,null,null,"Base-->",{"$f":"'Rate Design'!G9","v":21000},{"$f":"'Rate Design'!G5/100","v":5.5050000000000002E-2},{"$f":"'Rate Design'!G6/100","v":4.9530000000000005E-2},{"$f":"'Rate Design'!G7/100","v":4.2350000000000006E-2},{"$f":"'Rate Design'!G10","v":6},-0.2,-1.1000000000000001,-1.4]
[null,null,"Kwh usage",null,null,"kva usage","KVA usage",null,null,"Billing-->",{"$f":"'Rate Design'!G19","v":21000},{"$f":"'Rate Design'!G15/100","v":5.7489999999999999E-2},{"$f":"'Rate Design'!G16/100","v":5.1970000000000002E-2},{"$f":"'Rate Design'!G17/100","v":4.41E-2},{"$f":"'Rate Design'!G20","v":6},-0.2,-1.1000000000000001,-1.4]
[null,null,"Block1","Block2","Block3","> 3000",">= 11 kv",">= 60 kv",">= 115 kv",null,"Cust Chg","Energy",null,null,"Demand","PV Discount",null,null,"Total"]
[1,null,{"$f":"'WA Sch 25'!Q4","v":6000000},{"$f":"'WA Sch 25'!R4","v":64070115},{"$f":"'WA Sch 25'!S4","v":2325531},{"$f":"'WA Sch 25'!P64","v":101638},{"$f":"'WA Sch 25'!P39","v":137638},null,null,null,{"$f":"$K$4*12","v":252000},{"$f":"C6*$L$4","v":344940},{"$f":"D6*$M$4","v":3329723.8765500002},{"$f":"E6*$N$4","v":102555.91710000001},{"$f":"F6*$O$4","v":609828},{"$f":"G6*$P$4","v":-27527.600000000002},{"$f":"H6*$Q$4","v":0},{"$f":"I6*$R$4","v":0},{"$f":"SUM(K6:R6)","v":4611520.1936500007}]
[2,null,{"$f":"'WA Sch 25'!Q5","v":6000000},{"$f":"'WA Sch 25'!R5","v":29509714},{"$f":"'WA Sch 25'!S5","v":0},{"$f":"'WA Sch 25'!P65","v":25168},{"$f":"'WA Sch 25'!P40","v":61168},null,null,null,{"$f":"$K$4*12","v":252000},{"$f":"C7*$L$4","v":344940},{"$f":"D7*$M$4","v":1533619.8365800001},{"$f":"E7*$N$4","v":0},{"$f":"F7*$O$4","v":151008},{"$f":"G7*$P$4","v":-12233.6},{"$f":"H7*$Q$4","v":0},{"$f":"I7*$R$4","v":0},{"$f":"SUM(K7:R7)","v":2269334.2365799998}]
[3,null,{"$f":"'WA Sch 25'!Q6","v":6000000},{"$f":"'WA Sch 25'!R6","v":9708007},{"$f":"'WA Sch 25'!S6","v":0},{"$f":"'WA Sch 25'!P66","v":759},{"$f":"'WA Sch 25'!P41","v":36050},null,null,null,252000,344940,504525.12379000004,0,4554,-7210,0,0,{"$f":"SUM(K8:R8)","v":1098809.1237900001}]
{"$rows_left_out":54}
{"sheet":"Bill Impact","index":7,"n_rows":24,"n_cols":16,"rows_kept":24,"cut":false,"hidden":false,"merged":[]}
[]
[]
["Schedule 001 Bill Impact"]
[]
[]
[]
["Schedule 001 Present",null,null,null,null,null,"Schedule 001 Proposed"]
[null,"Basic Charge","Block 1","Block 2","Total Bill",null,"Basic Charge","Block 1","Block 2","Total Bill",null,"Bill Impact","% Change"]
{"$rows_left_out":17}
{"sheet":"WA Sch 25","index":8,"n_rows":162,"n_cols":19,"rows_kept":162,"cut":false,"hidden":false,"merged":[]}
["Washington Schedule 25 Billing Determinants",null,null,null,null,null,null,null,null,null,null,null,null,null,null,null,"1st",{"$f":"Q2","v":500000},{"$f":"R2","v":6000000}]
[null,null,null,null,null,null,null,null,null,null,null,null,null,null,null,"12-mo Ended",500000,6000000,99999999]
["KWHs",null,"Acct No.","2016-01-01","2016-02-01","2016-03-01","2016-04-01","2016-05-01","2016-06-01","2016-07-01","2016-08-01","2016-09-01","2016-10-01","2016-11-01","2016-12-01","Total","kwhs/mo","kwhs/mo","kwhs/mo"]
[1,null,null,5944684,5687484,5985071,6549182,6748753,6526653,6417310,6083633,5148267,5901483,5729997,5673129,{"$f":"SUM(D4:O4)","v":72395646},{"$f":"Q$2*12-SUMPRODUCT(--($D4:$O4<=Q$2),Q$2-$D4:$O4)","v":6000000},{"$f":"R$2*12-SUM($Q4:Q4)-SUMPRODUCT(--($D4:$O4<=R$2),R$2-$D4:$O4)","v":64070115},{"$f":"S$2*12-SUM($Q4:R4)-SUMPRODUCT(--($D4:$O4<=S$2),S$2-$D4:$O4)","v":2325531}]
[2,null,null,3318907,3067797,3266613,3135564,3094136,2916467,2561194,3042291,2878151,3102477,2989875,2136242,35509714,{"$f":"Q$2*12-SUMPRODUCT(--($D5:$O5<=Q$2),Q$2-$D5:$O5)","v":6000000},{"$f":"R$2*12-SUM($Q5:Q5)-SUMPRODUCT(--($D5:$O5<=R$2),R$2-$D5:$O5)","v":29509714},{"$f":"S$2*12-SUM($Q5:R5)-SUMPRODUCT(--($D5:$O5<=S$2),S$2-$D5:$O5)","v":0}]
[3,null,null,1391295,1338046,1435413,1294216,1271885,1269992,1155249,1299417,1165206,1334945,1288563,1463780,15708007,6000000,{"$f":"R$2*12-SUM($Q6:Q6)-SUMPRODUCT(--($D6:$O6<=R$2),R$2-$D6:$O6)","v":9708007},{"$f":"S$2*12-SUM($Q6:R6)-SUMPRODUCT(--($D6:$O6<=S$2),S$2-$D6:$O6)","v":0}]
[4,null,null,1524703,1444680,1624936,1407048,1463662,1355193,1380866,1342047,1347433,1373049,1331770,1481819,17077206,6000000,{"$f":"R$2*12-SUM($Q7:Q7)-SUMPRODUCT(--($D7:$O7<=R$2),R$2-$D7:$O7)","v":11077206},{"$f":"S$2*12-SUM($Q7:R7)-SUMPRODUCT(--($D7:$O7<=S$2),S$2-$D7:$O7)","v":0}]
[5,null,null,1786888,1658540,1754416,{"$f":"3398446/2","v":1699223},1746020,1867767,2095195,2175778,1891955,1730020,1647544,1831007,21884353,6000000,{"$f":"R$2*12-SUM($Q8:Q8)-SUMPRODUCT(--($D8:$O8<=R$2),R$2-$D8:$O8)","v":15884353},{"$f":"S$2*12-SUM($Q8:R8)-SUMPRODUCT(--($D8:$O8<=S$2),S$2-$D8:$O8)","v":0}]
{"$rows_left_out":155}
{"sheet":"Lighting summary","index":9,"n_rows":55,"n_cols":16,"rows_kept":55,"cut":false,"hidden":false,"merged":[[6,2,6,3],[6,5,6,6]]}
[null,"AVISTA UTILITIES"]
[null,"WASHINGTON ELECTRIC"]
[null,"STREET & AREA LIGHT REVENUE UNDER PRESENT & PROPOSED RATES"]
[null,"12 MONTHS ENDED DECEMBER 31, 2016"]
[]
[]
[null,null,{"$f":"\"Present \"&IF(Base1_Billing2=2,\"Billing \",\"\")&\"Rates(1)\"","v":"Present Rates(1)"},{"$f":"\"Present \"&IF(Base1_Billing2=2,\"Billing\",\"\")&\" Rates\"","v":"Present  Rates"},null,{"$f":"\"Proposed \"&IF(Base1_Billing2=2,\"Billing \",\"\")&\"Rates(2)\"","v":"Proposed Rates(2)"},{"$f":"\"Proposed \"&IF(Base1_Billing2=2,\"Billing \",\"\")&\"Rates\"","v":"Proposed Rates"},null,"% Revenue Change"]
[null,null,"Monthly ","Annual",null,"Monthly ","Annual",null,null,null,null,"Target Base",null,"Annual","Present","Proposed"]
{"$rows_left_out":48}
{"sheet":"St Lts","index":10,"n_rows":140,"n_cols":74,"rows_kept":140,"cut":false,"hidden":false,"merged":[[92,8,99,11]]}
["Street Light Summary",null,null,null,null,null,null,null,"WASHINGTON Street Lights",null,null,null,null,null,null,null,null,null,null,null,null,null,null,null,null,null,null,null,null,null,null,null,null,null,null,"% rate increase -->",{"$f":"'Lighting summary'!L11","v":2.1399999999999999E-2},{"$f":"'Lighting summary'!L12","v":2.1399999999999999E-2},{"$f":"'Lighting summary'!L13","v":2.1399999999999999E-2},{"$f":"'Lighting summary'!L14","v":2.1399999999999999E-2},{"$f":"'Lighting summary'!L15","v":2.1399999999999999E-2},null,null,null,null,null,null,null,null,null,null,null,null,null,null,{"$f":"-0.00065","v":-6.4999999999999997E-4},"compare input Present Billing Rates to calculated Present Billing Rates",null,null,null,null,null,null,{"$f":"BE2","v":1.0129999999999999}]
["R-120291 Report as of 1/1/17",null,null,null,null,null,null,null,null,null,null,null,"Number of Lights(1)",null,null,null,null,null,"Present Rates",null,null,null,null,null,"Monthly Revenue at Present Rates",null,null,null,null,null,"Number of Lights",null,null,null,null,null,"Proposed Rates",null,null,null,null,null,"Monthly Revenue at Proposed Rates",null,null,null,null,null,null,"Present Billing Rates",null,null,null,null,null,1.2149999999999999E-2,{"$f":"1+'Lighting summary'!I39","v":1.0129999999999999},"Sch 91 & 98",null,null,null,null,null,"New Billing Rates",null,null,null,null,null,"Increase"]
[null,null,null,null,null,null,null,null,"Fixture Type","Pole Facility","Size","Sched","041","042","044","045","046",null,"041","042","044","045","046",null,"041","042","044","045","046",null,"041","042","044","045","046",null,"041","042","044","045","046",null,"041","042","044","045","046",null,"kwh","041","042","044","045","046",null,"Sch 93/94","041","042","044","045","046",null,null,"041","042","044","045","046",null,"041","042","044","045","046"]
[null,null,null,null,null,null,null,null,"Single Mercury Vapor","Direct Burial",4000,214,{"$f":"SUMIF($G:$G,TEXT(M$3,\"000\")&TEXT($L4,\"000\"),$E:$E)","v":72},0,0,0,0,null,13.99,0,0,0,0,null,{"$f":"IF(AND(M4<>0,S4=0),#VALUE!,M4*S4)","v":1007.28},{"$f":"IF(AND(N4<>0,T4=0),#VALUE!,N4*T4)","v":0},{"$f":"IF(AND(O4<>0,U4=0),#VALUE!,O4*U4)","v":0},{"$f":"IF(AND(P4<>0,V4=0),#VALUE!,P4*V4)","v":0},{"$f":"IF(AND(Q4<>0,W4=0),#VALUE!,Q4*W4)","v":0},null,{"$f":"M4","v":72},{"$f":"N4","v":0},0,0,0,null,{"$f":"ROUND(S4*(1+AK$1),2)","v":14.29},0,{"$f":"ROUND(U4*(1+AM$1),2)","v":0},{"$f":"ROUND(V4*(1+AN$1),2)","v":0},{"$f":"ROUND(W4*(1+AO$1),2)","v":0},null,{"$f":"IF(AND(AE4<>0,AK4=0),#VALUE!,AE4*AK4)","v":1028.8799999999999},{"$f":"IF(AND(AF4<>0,AL4=0),#VALUE!,AF4*AL4)","v":0},{"$f":"IF(AND(AG4<>0,AM4=0),#VALUE!,AG4*AM4)","v":0},{"$f":"IF(AND(AH4<>0,AN4=0),#VALUE!,AH4*AN4)","v":0},{"$f":"IF(AND(AI4<>0,AO4=0),#VALUE!,AI4*AO4)","v":0},{"$f":"SUM(AQ4:AU4)-SUM(Y4:AC4)","v":21.599999999999909},42,14.5,null,null,null,null,null,{"$f":"ROUND(AW4*$BD$2,2)+ROUND(AW4*$BD$1,2)","v":0.48},{"$f":"ROUND((S4*$BE$2),2)+ROUND($BD4-AX4,2)","v":0.15000000000000036},null,null,null,null,null,null,{"$f":"AK4*$BL$1","v":14.475769999999997},{"$f":"AL4*$BL$1","v":0},{"$f":"AM4*$BL$1","v":0},{"$f":"AN4*$BL$1","v":0},{"$f":"AO4*$BL$1","v":0},null,{"$f":"BL4-AX4","v":-2.423000000000286E-2},{"$f":"BM4-AY4","v":0},{"$f":"BN4-AZ4","v":0},{"$f":"BO4-BA4","v":0},{"$f":"BP4-BB4","v":0}]
[null,"State","Sched","Rate Sub","# of Lights",null,null,null,"Single High-Pressure Sodium Vapor","Direct Burial","50W",234,0,125,0,0,0,null,0,13.14,0,0,0,null,{"$f":"IF(AND(M5<>0,S5=0),#VALUE!,M5*S5)","v":0},{"$f":"IF(AND(N5<>0,T5=0),#VALUE!,N5*T5)","v":1642.5},{"$f":"IF(AND(O5<>0,U5=0),#VALUE!,O5*U5)","v":0},{"$f":"IF(AND(P5<>0,V5=0),#VALUE!,P5*V5)","v":0},{"$f":"IF(AND(Q5<>0,W5=0),#VALUE!,Q5*W5)","v":0},null,{"$f":"M5","v":0},125,0,0,0,null,0,13.42,0,0,0,null,0,1677.5,0,0,0,35,20,null,13.46,null,null,null,null,{"$f":"ROUND(AW5*$BD$2,2)+ROUND(AW5*$BD$1,2)","v":0.22999999999999998},null,{"$f":"ROUND((T5*$BE$2)+$BD5-AY5,2)","v":0.08},null,null,null,null,null,{"$f":"AK5*$BL$1","v":0},{"$f":"AL5*$BL$1","v":13.594459999999998},{"$f":"AM5*$BL$1","v":0},{"$f":"AN5*$BL$1","v":0},{"$f":"AO5*$BL$1","v":0},null,{"$f":"BL5-AX5","v":0},{"$f":"BM5-AY5","v":0.13445999999999714},{"$f":"BN5-AZ5","v":0},{"$f":"BO5-BA5","v":0},{"$f":"BP5-BB5","v":0}]
[null,null,null,null,null,null,null,null,"High-Pressure Sodium Vapor","Dusk to Dawn","70W",335,0,0,0,0,64,null,0,0,0,0,3.38,null,0,0,0,0,216.32,null,0,0,0,0,64,null,0,0,0,0,3.45,null,0,0,0,0,220.8,4.4800000000000182,25,null,null,null,null,3.63,null,0.27999999999999997,null,null,null,null,{"$f":"ROUND((W6*$BE$2)+$BD6-BB6,2)","v":7.0000000000000007E-2},null,null,0,0,0,0,3.49485,null,0,0,0,0,-0.13514999999999988]
[null,2,"041",214,72,null,{"$f":"IF(OR(ISBLANK(C7),ISBLANK(D7)),\"\",TEXT(C7,\"000\")&TEXT(D7,\"000\"))","v":"041214"},null,"Single Mercury Vapor","Wood Pole",7000,411,5,0,0,0,0,null,15.17,0,0,0,0,null,75.849999999999994,0,0,0,0,null,5,0,0,0,0,null,15.49,0,0,0,0,null,77.45,0,0,0,0,1.6000000000000085,80,16.010000000000002,null,null,null,null,null,0.91999999999999993,{"$f":"ROUND((S7*$BE$2)+$BD7-AX7,2)","v":0.28000000000000003},null,null,null,null,null,null,15.691369999999999,0,0,0,0,null,-0.31863000000000241,0,0,0,0]
[null,2,"041",411,5,null,"041411",null,"Mercury Vapor","Dusk to Dawn",7000,415,0,0,0,66,0,null,0,0,0,6.66,0,null,0,0,0,439.56,0,null,0,0,0,66,0,null,0,0,0,6.8,0,null,0,0,0,448.8,0,9.2400000000000091,80,null,null,null,7.4,null,null,0.91999999999999993,null,null,null,{"$f":"ROUND((V8*$BE$2)+$BD8-BA8,2)","v":0.27},null,null,null,0,0,0,6.888399999999999,0,null,0,0,0,-0.51160000000000139,0]
{"$rows_left_out":133}
{"sheet":"Area Lts","index":11,"n_rows":72,"n_cols":49,"rows_kept":72,"cut":false,"hidden":false,"merged":[]}
["Area Light Summary",null,null,null,null,null,null,null,"WASHINGTON Area Lights",null,null,null,null,null,null,null,null,null,"Monthly Rev.",null,null,null,null,null,null,{"$f":"SL_RateIncr","v":0},null,null,"% rate increase -->",{"$f":"'Lighting summary'!L16","v":2.1399999999999999E-2},null,null,"Monthly Rev.",null,null,-8.0999999999999996E-4,1.2149999999999999E-2,{"$f":"-0.00065","v":-6.4999999999999997E-4},null,null,null,"compare input Present Billing Rates to calculated Present Billing Rates"]
[{"$f":"'St Lts'!A2","v":"R-120291 Report as of 1/1/17"},null,null,null,null,null,null,null,null,null,null,null,"# of Lights(1)",null,null,"Pres. Rates",null,null,"at Pres. Rates",null,null,"# of Lights(1)",null,null,null,null,"# of Lights",null,null,"Prop. Rates",null,null,"at Prop. Rates",null,null,null,"Pres. Billing Rates",null,null,null,null,{"$f":"'St Lts'!BE2","v":1.0129999999999999},{"$f":"'St Lts'!BF2","v":"Sch 91 & 98"},null,"New Billing Rates",null,{"$f":"'Lighting summary'!I39","v":1.2999999999999999E-2},"Increase"]
[null,null,null,null,null,null,null,null,"Fixture Type","Pole Facility","Size","Sched","047","048",null,"047","048",null,"047","048",null,"047","048",null,null,null,"047","048",null,"047","048",null,"047","048",null,"kwh","047","048","Sch 59","Sch 93","Sch 98","047","048",null,"047","048",null,"047","048"]
[null,null,null,null,null,null,null,null,"Sodium Vapor","Granville w/16' decorative pole","100W","HAG",{"$f":"SUMIF($G:$G,TEXT(M$3,\"000\")&TEXT($L4,\"000\"),$E:$E)","v":6},0,null,29.35,{"$f":"P4","v":29.35},null,{"$f":"IF(AND(M4<>0,P4=0),#VALUE!,M4*P4)","v":176.10000000000002},{"$f":"IF(AND(N4<>0,Q4=0),#VALUE!,N4*Q4)","v":0},null,{"$f":"SUMIF($G:$G,TEXT(V$3,\"000\")&TEXT($L4,\"000\"),$E:$E)","v":6},0,null,null,null,{"$f":"M4","v":6},{"$f":"N4","v":0},null,{"$f":"ROUND(P4*(1+AD$1),2)","v":29.98},{"$f":"AD4","v":29.98},null,{"$f":"IF(AND(AA4<>0,AD4=0),#VALUE!,AA4*AD4)","v":179.88},{"$f":"IF(AND(AB4<>0,AE4=0),#VALUE!,AB4*AE4)","v":0},null,40,30.04,30.02,{"$f":"ROUND($AJ$1*$AJ4,2)","v":-0.03},{"$f":"ROUND($AK$1*$AJ4,2)","v":0.49},{"$f":"ROUND($AL$1*$AJ4,2)","v":-0.03},{"$f":"ROUND(P4*$AP$2-AK4+AN4+AO4,2)","v":0.15},{"$f":"ROUND(Q4*$AP$2-AL4+AM4+AN4+AO4,2)","v":0.14000000000000001},null,{"$f":"AD4*$AU$2","v":0.38973999999999998},{"$f":"AE4*$AU$2+AM4","v":0.35973999999999995},null,{"$f":"AS4-AK4","v":-29.650259999999999},{"$f":"AT4-AL4","v":-29.660260000000001}]
[null,"State","Sched","Rate Sub","# of Lights",null,null,null,"Sodium Vapor","Floodlight on existing standard","250W","HAH",109,8,null,21.72,{"$f":"P5","v":21.72},null,{"$f":"IF(AND(M5<>0,P5=0),#VALUE!,M5*P5)","v":2367.48},173.76,null,109,8,null,null,null,{"$f":"M5","v":109},8,null,22.18,{"$f":"AD5","v":22.18},null,2417.62,177.44,null,107,22.86,22.81,{"$f":"ROUND($AJ$1*$AJ5,2)","v":-0.09},{"$f":"ROUND($AK$1*$AJ5,2)","v":1.3},{"$f":"ROUND($AL$1*$AJ5,2)","v":-7.0000000000000007E-2},{"$f":"ROUND(P5*$AP$2-AK5+AN5+AO5,2)","v":0.37},{"$f":"ROUND(Q5*$AP$2-AL5+AM5+AN5+AO5,2)","v":0.33},null,{"$f":"AD5*$AU$2","v":0.28833999999999999},{"$f":"AE5*$AU$2+AM5","v":0.19833999999999999},null,{"$f":"AS5-AK5","v":-22.571659999999998},{"$f":"AT5-AL5","v":-22.611659999999997}]
[null,null,null,null,null,null,null,null,"Sodium Vapor","Kim light w/25' fiberglass pole","100W","HAI",17,2,null,28.35,28.35,null,481.95000000000005,56.7,null,17,2,null,null,null,17,2,null,28.96,{"$f":"AD6","v":28.96},null,492.32,57.92,null,40,29.02,29,-0.03,0.49,-0.03,0.16,0.15,null,{"$f":"AD6*$AU$2","v":0.37647999999999998},0.34648000000000001,null,-28.643519999999999,-28.65352]
[null,"WA","047","HAG",6,null,{"$f":"IF(OR(ISBLANK(C7),ISBLANK(D7)),\"\",TEXT(C7,\"000\")&TEXT(D7,\"000\"))","v":"047HAG"},null,"Sodium Vapor","Post Top w/16' decorative pole","100W","HAP",0,1,null,27.99,27.99,null,0,27.99,null,0,1,null,null,null,0,1,null,28.59,28.59,null,0,28.59,null,40,28.66,28.64,-0.03,0.49,-0.03,0.15,0.14000000000000001,null,0.37167,0.34167000000000003,null,-28.288329999999998,-28.29833]
[null,"WA","047","HAH",109,null,{"$f":"IF(OR(ISBLANK(C8),ISBLANK(D8)),\"\",TEXT(C8,\"000\")&TEXT(D8,\"000\"))","v":"047HAH"},null,"Sodium Vapor","on existing standard","100W","HPA",735,901,null,13.46,13.46,null,9893.1,{"$f":"IF(AND(N8<>0,Q8=0),#VALUE!,N8*Q8)","v":12127.460000000001},null,735,901,null,null,null,735,901,null,13.75,13.75,null,10106.25,12388.75,null,40,13.95,13.93,-0.03,0.49,-0.03,{"$f":"ROUND(P8*$AP$2,2)-AK8+AN8+AO8","v":0.14000000000000148},0.13,null,0.17874999999999999,0.14874999999999999,null,-13.771249999999998,-13.78125]
{"$rows_left_out":65}
{"sheet":"Capital Recovery Factor Calc","index":12,"n_rows":40,"n_cols":16,"rows_kept":40,"cut":false,"hidden":false,"merged":[]}
[]
[]
[]
[]
["Avista",null,null,null,null,"Avista",null,null,null,null,null,"Avista"]
["Capital Recovery Factor Calculation",null,null,null,null,"Capital Recovery Factor Calculation",null,null,null,null,null,"Capital Recovery Factor Calculation"]
["Present - UE-120436",null,null,null,null,"Present - UE-150204",null,null,null,null,null,"Final - UE- 170485"]
[]
{"$rows_left_out":33}
{"sheet":"TIB","index":13,"n_rows":22,"n_cols":6,"rows_kept":22,"cut":false,"hidden":false,"merged":[]}
[]
["Avista"]
["TIB Rate Calculation"]
["Schedule 42"]
[]
[null,"Engineering Estimate","Capital Cost  ","Annual Capital ","Monthly Capital "]
[null,"of Cost","Recovery Factor","Component Cost","Component Cost"]
["TIB Rate Credit 70W LED",{"$f":"B22","v":476.77},0.13156000000000001,{"$f":"B8*C8","v":62.723861200000002},{"$f":"D8/12","v":5.2269884333333332}]
{"$rows_left_out":15}
{"sheet":"Block Data","index":14,"n_rows":101,"n_cols":19,"rows_kept":101,"cut":false,"hidden":false,"merged":[]}
[]
[]
["WASHINGTON ELECTRIC SYSTEM"]
[null,null,"January","February","March","April","May","June","July","August","September","October","November","December","Annual Total"]
["Rate Design Program Monthly Results"]
[null,"Schedule 001/002"]
[null,"Block 1",{"$f":"'REVRUNS 12ME1216'!D55+'REVRUNS 12ME1216'!D70","v":148613330.66685},{"$f":"'REVRUNS 12ME1216'!E55+'REVRUNS 12ME1216'!E70","v":140451829.33333001},{"$f":"'REVRUNS 12ME1216'!F55+'REVRUNS 12ME1216'!F70","v":133948729.66681001},{"$f":"'REVRUNS 12ME1216'!G55+'REVRUNS 12ME1216'!G70","v":128587759.33341001},{"$f":"'REVRUNS 12ME1216'!H55+'REVRUNS 12ME1216'!H70","v":119373587.00015},{"$f":"'REVRUNS 12ME1216'!I55+'REVRUNS 12ME1216'!I70","v":121180795.26669},{"$f":"'REVRUNS 12ME1216'!J55+'REVRUNS 12ME1216'!J70","v":123278172.66658001},{"$f":"'REVRUNS 12ME1216'!K55+'REVRUNS 12ME1216'!K70","v":127548898.00004001},{"$f":"'REVRUNS 12ME1216'!L55+'REVRUNS 12ME1216'!L70","v":128489177.66689999},{"$f":"'REVRUNS 12ME1216'!M55+'REVRUNS 12ME1216'!M70","v":119828997.66689999},{"$f":"'REVRUNS 12ME1216'!N55+'REVRUNS 12ME1216'!N70","v":129040212.66655999},{"$f":"'REVRUNS 12ME1216'!O55+'REVRUNS 12ME1216'!O70","v":144622050.33321998},{"$f":"SUM(C7:N7)","v":1564963540.2674398},null,null,0,{"$f":"R7/$R$10","v":{"$error":"#DIV/0!"}}]
[null,"Block 2",{"$f":"'REVRUNS 12ME1216'!D56+'REVRUNS 12ME1216'!D71","v":70469522.333149999},{"$f":"'REVRUNS 12ME1216'!E56+'REVRUNS 12ME1216'!E71","v":53175483.666669995},{"$f":"'REVRUNS 12ME1216'!F56+'REVRUNS 12ME1216'!F71","v":42263932.333190002},{"$f":"'REVRUNS 12ME1216'!G56+'REVRUNS 12ME1216'!G71","v":33341395.666589998},{"$f":"'REVRUNS 12ME1216'!H56+'REVRUNS 12ME1216'!H71","v":22360083.999850001},{"$f":"'REVRUNS 12ME1216'!I56+'REVRUNS 12ME1216'!I71","v":24854579.333310001},{"$f":"'REVRUNS 12ME1216'!J56+'REVRUNS 12ME1216'!J71","v":29743746.333419997},{"$f":"'REVRUNS 12ME1216'!K56+'REVRUNS 12ME1216'!K71","v":36103956.999960005},{"$f":"'REVRUNS 12ME1216'!L56+'REVRUNS 12ME1216'!L71","v":34991283.333099999},{"$f":"'REVRUNS 12ME1216'!M56+'REVRUNS 12ME1216'!M71","v":21818273.333100002},{"$f":"'REVRUNS 12ME1216'!N56+'REVRUNS 12ME1216'!N71","v":31443123.333440002},{"$f":"'REVRUNS 12ME1216'!O56+'REVRUNS 12ME1216'!O71","v":58460361.666779995},{"$f":"SUM(C8:N8)","v":459025742.33256006},null,null,0,{"$f":"R8/$R$10","v":{"$error":"#DIV/0!"}}]
{"$rows_left_out":94}
{"sheet":"REVRUNS 12ME1216","index":15,"n_rows":568,"n_cols":16,"rows_kept":568,"cut":false,"hidden":false,"merged":[]}
[]
[]
["Electric Revenue Meters Report by Location  Twelve Months Ended  for Report Date : '12/31/2016'"]
[]
["State Cde:WA"]
[]
[null,null,"Meters"]
[null,"Period","201601","201602","201603","201604","201605","201606","201607","201608","201609","201610","201611","201612","12 Month Average"]
{"$rows_left_out":560}