{"text_format":"1","workbook":"xlsx","n_sheets":15,"sheets":["Pres & Prop Rev","Rate Design","Exh1","Exh2","Exh3","Exh4","Exh5","ROR","Rate Spread","Bill Impact","Bill Determ","Block Usage","Big Schedules","12MEDEC16","BFG"],"not_rendered":{"charts":0,"images":0,"macros":1,"external_links":0,"defined_names":21,"comments":8,"pivot_tables":0},"unopened":[],"bounds":{"document_bytes":16777216,"sheet_cells":100000,"rows_first":2000,"rows_last":500,"rows_between":2000,"halvings":0,"cell_chars":16384,"cell_head_chars":4096},"cells_cut":0,"cells_raw":0,"read":"whole","date_system":"1900"}

{"sheet":"Pres & Prop Rev","index":0,"n_rows":284,"n_cols":17,"rows_kept":284,"cut":false,"hidden":false,"merged":[[5,16,10,18]]}
[]
[]
[null,null,null,null,null,null,null,null,null,"TRANSPORT"]
["WORK PAPER",null," ","GEN SERVICE","LRG GEN SVC","EX LRG GEN SVC","INTERRUPTIBLE","TRANSPORT","TRANSPORT","SCH 148 - WSU"]
["REFERENCE",null,"TOTAL","SCH. 101 & 102","SCH. 111&112","SCH. 121&122","SCH. 131&132","SCHEDULE 146","SCHEDULE 148","ANN. MINIMUM",null,null,null,null,null,null,"Print Header for all printed pages on this worksheet:"]
[null,"PRESENT BILL DETERMINANTS",null,null,null,null,null,null,null,null,null,null,"Calculate all revenue exhibits using  ____ rates:",null,null,null,{"$f":"\"AVISTA UTILITIES\nWASHINGTON NATURAL GAS\nPRO FORMA REVENUE UNDER PRESENT AND PROPOSED \"&O9&\" RATES\n12 MONTHS ENDED DECEMBER 31, 2016\"","v":"AVISTA UTILITIES\nWASHINGTON NATURAL GAS\nPRO FORMA REVENUE UNDER PRESENT AND PROPOSED BASE TARIFF RATES\n12 MONTHS ENDED DECEMBER 31, 2016"}]
[null,"THERMS",null,null,null,null,null,null,null,null,null,"1)","BASE TARIFF"]
["PDE-G-8","BLOCK 1",null,{"$f":"'Bill Determ'!E7","v":70235874.566509634},{"$f":"'Bill Determ'!B12","v":5785416.1845811373},{"$f":"'Bill Determ'!B23","v":135552.62671391058},{"$f":"'Bill Determ'!B30","v":239134},{"$f":"'Bill Determ'!B34","v":8323425},{"$f":"'Bill Determ'!B40","v":22950008},{"$f":"'Bill Determ'!B46","v":9620298},null,null,"or",null,1]
["PDE-G-8","BLOCK 2",null,{"$f":"'Bill Determ'!F7","v":35679396.760770366},{"$f":"'Bill Determ'!C12","v":14299408.700184943},{"$f":"'Bill Determ'!C23","v":135552.88442443256},{"$f":"'Bill Determ'!C30","v":304419},{"$f":"'Bill Determ'!C34","v":7106130},{"$f":"'Bill Determ'!B41","v":6615705},null,null,"2)","BILLING",null,{"$f":"CHOOSE(Base1_Billing2,M7,M9)","v":"BASE TARIFF"}]
["PDE-G-8","BLOCK 3",null,null,{"$f":"'Bill Determ'!D12","v":23171234.598493919},{"$f":"'Bill Determ'!D23","v":2127459.9945706716},{"$f":"'Bill Determ'!D30","v":295331},{"$f":"'Bill Determ'!D34","v":10674881},{"$f":"'Bill Determ'!B42","v":1996121},null,null,null,null,null,{"$f":"CHOOSE(Base1_Billing2,\"Base\",\"Billing\")","v":"Base"}]
{"$rows_left_out":275}
{"sheet":"Rate Design","index":1,"n_rows":122,"n_cols":22,"rows_kept":122,"cut":false,"hidden":false,"merged":[]}
["PRESENT RATES",null,null,1,2,3,4,5,null,null,null,"Tiers - used for bill comparisons"]
[null,null,"TOTAL","SCH. 101","SCH. 111,112","SCH. 121,122","SCH. 132","SCH. 146",null,"Range Name",null,"SCH. 101","SCH. 111,112","SCH. 121,122","SCH. 131,132","SCH. 146"]
[null,"Base Tariff Rates"]
[1,"BASIC CHARGE",null,9,null,null,null,525]
[2,"MONTHLY MINIMUM",null,null,101.44,252.28]
[3,"BLOCK 1 PER THERM",null,38.685000000000002,0,0,25.277000000000001,10.009,null,null,null,9999999,200,500,10000,20000]
[4,"BLOCK 2 PER THERM",null,50.279000000000003,34.033999999999999,35.67,20.291,8.9049999999999994,{"$f":"H7/H6-1","v":-0.11030072934359081},null,null,9999999,1000,1000,25000,50000]
[5,"BLOCK 3 PER THERM",null,null,25.943000000000001,27.396999999999998,19.067,8.0299999999999994,{"$f":"H8/H7-1","v":-9.8259404828747954E-2},"Rates_Base_Present",null,9999999,9999999,10000,50000,300000]
[6,"BLOCK 4 PER THERM",null,null,null,22.202000000000002,18.661999999999999,7.4260000000000002,-7.5217932752179251E-2,null,null,9999999,9999999,25000,9999999,500000]
[7,"BLOCK 5 PER THERM",null,null,null,14.725,null,5.5810000000000004,{"$f":"H10/H9-1","v":-0.24845138701858327},null,null,9999999,9999999,9999999,9999999,9999999]
{"$rows_left_out":113}
{"sheet":"Exh1","index":2,"n_rows":38,"n_cols":14,"rows_kept":38,"cut":false,"hidden":false,"merged":[[0,13,2,14]]}
["AVISTA UTILITIES",null,null,null,null,null,null,null,null,null,null,null,null,"This worksheet pulls data from 'Pres & Prop Rev' tab."]
["WASHINGTON NATURAL GAS"]
["PROPOSED INCREASE BY SERVICE SCHEDULE"]
["12 MONTHS ENDED DECEMBER 31, 2016"]
["(000s of Dollars)"]
[]
[]
[null,null,null,"Base Tariff",null,"Base Tariff","Base","Total Billed",null,null,"Percent "]
[null,null,null,"Distribution Revenue","Proposed","Distribution Revenue","Tariff","Revenue","Sch. 191","Proposed","Increase"]
["Line","Type of","Schedule","Under Present","General","Under Proposed","Percent","at Present","LIRAP/DSM","General","on Billed"]
{"$rows_left_out":29}
{"sheet":"Exh2","index":3,"n_rows":20,"n_cols":12,"rows_kept":20,"cut":false,"hidden":false,"merged":[]}
["AVISTA UTILITIES",null,null,null,null,null,null,null,null,null,null,"This worksheet pulls data from 'ROR' tab."]
["WASHINGTON NATURAL GAS"]
["PRESENT & PROPOSED RATES OF RETURN BY RATE SCHEDULE"]
["12 MONTHS ENDED DECEMBER 31, 2016"]
[]
[]
[]
[]
[null,null,null,"Present Rates",null,null,"Base",null,"Proposed Rates"]
[null,null,null,"Present","Present",null,"Tariff",null,"Proposed","Proposed","% Move"]
{"$rows_left_out":11}
{"sheet":"Exh3","index":4,"n_rows":62,"n_cols":26,"rows_kept":62,"cut":false,"hidden":false,"merged":[[9,0,9,2],[14,21,14,22]]}
["AVISTA UTILITIES",null,null,null,null,null,null,null,null,null,null,null,null,null,null,"This worksheet uses Base & Billing rates from 'Rate Design' tab."]
["WASHINGTON NATURAL GAS"]
["PRESENT AND PROPOSED RATE COMPONENTS BY SCHEDULE"]
[]
[]
[]
[null,null,null,null,null,null,null,null,"Proposed"]
[null,null,null,"Present Base","Present",null,"General ","Proposed ","Base "]
[null,null,null,"Distribution","Billing","Present ","Rate ","Billing ","Distribution",null,null,null,"GRC"]
["Type of Service",null,null,"Rate","Rate Adj. (1)","Billing Rate","Increase","Rate(1)","Rate",null,"Base","Bill ","Revenue"]
{"$rows_left_out":53}
{"sheet":"Exh4","index":5,"n_rows":55,"n_cols":6,"rows_kept":55,"cut":false,"hidden":false,"merged":[]}
[]
[]
[]
[]
["AVISTA UTILITIES"]
["WASHINGTON NATURAL GAS"]
["PROPOSED INCREASE BY SERVICE SCHEDULE"]
["12 MONTHS ENDED DECEMBER 31, 2016"]
["(000s of Dollars)"]
["May 1, 2019 Increase"]
{"$rows_left_out":46}
{"sheet":"Exh5","index":6,"n_rows":49,"n_cols":8,"rows_kept":49,"cut":false,"hidden":false,"merged":[[43,0,44,6],[1,0,1,7],[2,0,2,7],[3,0,3,7],[4,0,4,7],[5,0,5,7]]}
[]
["AVISTA UTILITIES"]
["WASHINGTON NATURAL GAS"]
["PROPOSED RATE PLAN (SCHEDULE 196) INCREASE"]
["12 MONTHS ENDED DECEMBER 31, 2016"]
["(000s of Dollars)"]
[]
["May 1, 2019 Increase"]
[null,null,null,"Year 1"]
[null,null,null,"Schedule 196"]
{"$rows_left_out":40}
{"sheet":"ROR","index":7,"n_rows":94,"n_cols":17,"rows_kept":94,"cut":false,"hidden":false,"merged":[]}
[null,"AVISTA UTILITIES"]
[null,"WASHINGTON GAS"]
[null,"PRESENT & PROPOSED RATE OF RETURN BY RATE SCHEDULE"]
[null,"12 MONTHS ENDED DECEMBER 31, 2016"]
[]
[]
[null,null,"Total","Sch 101","Sch 111","Sch 121","Sch 131","Sch 146"]
[null,"Total Rate Base",{"$f":"SUM(D8:H8)","v":319539000.00000012},253134828.19643533,47803920.18675594,3601397.3503710367,710124.55744277372,14288729.70899497,"from COS","\"Summary\" Line 467",null,null,{"$f":"D8/$C$8","v":0.79218758335112538},{"$f":"E8/$C$8","v":0.14960277207713588},1.1270603432980123E-2,2.2223408017261539E-3,4.4716700337032303E-2]
[]
[null,"Revenue From Retail Rates",{"$f":"SUM(D10:H10)","v":87219000},67621992.251017526,15462087.994031742,1024175.8447014581,190167.59656801663,2920576.3136812649,"from COS","\"Summary\" Line 469",null,null,{"$f":"D10/$C$10","v":0.77531262971391013},{"$f":"E10/$C$10","v":0.17727889558504159},1.174257724465378E-2,2.1803459861729282E-3,3.3485551470221683E-2]
{"$rows_left_out":85}
{"sheet":"Rate Spread","index":8,"n_rows":23,"n_cols":10,"rows_kept":23,"cut":false,"hidden":false,"merged":[]}
[]
["Avista"]
["Natural Gas"]
["Rate Spread"]
[]
[]
[null,null,null,"Base Tariff",null,"Base",null,"Base Tariff","Total Billed","Percent "]
[null,null,null,"Distribution Revenue","Percentage ","Tariff","Proposed","Distribution Revenue","Revenue","Increase"]
["Line","Type of","Schedule","Under Present","of Base","Percent","General","Under Proposed","at Present","on Billed"]
["No.","Service","Number","Rates","Increase","Increase","Increase","Rates","Rates (1)","Revenue"]
{"$rows_left_out":14}
{"sheet":"Bill Impact","index":9,"n_rows":102,"n_cols":15,"rows_kept":102,"cut":false,"hidden":false,"merged":[]}
[]
["Schedule 101 Bill Impact"]
[]
[]
[]
["Schedule 101 Present",null,null,null,null,null,"Schedule 101 Proposed"]
[null,"Basic Charge","Block 1","Block 2","Total Bill",null,"Basic Charge","Block 1","Block 2","Total Bill",null,"Bill Impact","% Change"]
[null,{"$f":"'Rate Design'!D4","v":9},{"$f":"'Rate Design'!D16/100","v":0.75597999999999999},{"$f":"'Rate Design'!D17/100","v":0.87191999999999992},null,null,{"$f":"'Rate Design'!D26","v":10},{"$f":"'Rate Design'!D38/100","v":0.79059999999999986},{"$f":"'Rate Design'!D39/100","v":0.91691999999999996}]
[10,{"$f":"$B$8","v":9},{"$f":"A9*$C$8","v":7.5598000000000001},null,{"$f":"SUM(B9:D9)","v":16.559799999999999},null,{"$f":"$G$8","v":10},{"$f":"A9*$H$8","v":7.9059999999999988},null,{"$f":"SUM(G9:I9)","v":17.905999999999999},null,{"$f":"J9-E9","v":1.3461999999999996},{"$f":"L9/E9","v":8.1293252333965366E-2}]
[{"$f":"A9+10","v":20},{"$f":"$B$8","v":9},15.1196,null,{"$f":"SUM(B10:D10)","v":24.119599999999998},null,{"$f":"$G$8","v":10},{"$f":"A10*$H$8","v":15.811999999999998},null,25.811999999999998,null,1.6923999999999992,7.0167001111129515E-2]
{"$rows_left_out":93}
{"sheet":"Bill Determ","index":10,"n_rows":92,"n_cols":8,"rows_kept":92,"cut":false,"hidden":false,"merged":[]}
["AVISTA UTILITIES"]
["WASHINGTON GAS"]
["USAGE & BILLINGS BY RATE SCHEDULE"]
["12 MONTHS ENDED DECEMBER 31, 2016"]
[]
["Schedule 101/102","Total therms","Total Billings",null,"0-70",">70","Total Therms"]
["therms per Revenue Run(1)(2)",{"$f":"'12MEDEC16'!P149","v":105915271.32728},{"$f":"'12MEDEC16'!O25","v":1847462},null,{"$f":"'Block Usage'!O17","v":70235874.566509634},{"$f":"'Block Usage'!O18","v":35679396.760770366},{"$f":"SUM(D7:F7)","v":105915271.32728}]
[null,null,null,null,null,null,{"$f":"'12MEDEC16'!P149","v":105915271.32728}]
["Schedule 111,112","0-200 thms","201-1000 thms","> 1000 thms","Total","Billings",{"$f":"G8-G7","v":0}]
["therms by block(2)",{"$f":"'Block Usage'!O35","v":5785416.1845811373},{"$f":"'Block Usage'!O36","v":14299408.700184943},{"$f":"'Block Usage'!O37","v":23171234.598493919},{"$f":"SUM(B10:D10)","v":43256059.483259998}]
{"$rows_left_out":83}
{"sheet":"Block Usage","index":11,"n_rows":66,"n_cols":16,"rows_kept":66,"cut":false,"hidden":false,"merged":[]}
["WASHINGTON NATURAL GAS SYSTEM"]
[null,null,"January","February","March","April","May","June","July","August","September","October","November","December","Annual Total"]
["Rate Design Program Monthly Results"]
[null,"Schedule 101/102"]
[null,"Block 1",{"$f":"'12MEDEC16'!D53+'12MEDEC16'!D66","v":10079673.23711},{"$f":"'12MEDEC16'!E53+'12MEDEC16'!E66","v":9640633.7859199997},{"$f":"'12MEDEC16'!F53+'12MEDEC16'!F66","v":8901007.1121299993},{"$f":"'12MEDEC16'!G53+'12MEDEC16'!G66","v":7422308.8340100003},{"$f":"'12MEDEC16'!H53+'12MEDEC16'!H66","v":3968450.2366599999},{"$f":"'12MEDEC16'!I53+'12MEDEC16'!I66","v":3064515.30902},{"$f":"'12MEDEC16'!J53+'12MEDEC16'!J66","v":2295120.2576600001},{"$f":"'12MEDEC16'!K53+'12MEDEC16'!K66","v":1916083.8395199999},{"$f":"'12MEDEC16'!L53+'12MEDEC16'!L66","v":2334645.54764},{"$f":"'12MEDEC16'!M53+'12MEDEC16'!M66","v":4091395.9512900002},{"$f":"'12MEDEC16'!N53+'12MEDEC16'!N66","v":6991446.4496200001},{"$f":"'12MEDEC16'!O53+'12MEDEC16'!O66","v":9629464.6075100005},{"$f":"SUM(C5:N5)","v":70334745.168089986}]
[null,"Block 2",{"$f":"'12MEDEC16'!D54+'12MEDEC16'!D67","v":12052145.00203},{"$f":"'12MEDEC16'!E54+'12MEDEC16'!E67","v":7146815.9800200006},{"$f":"'12MEDEC16'!F54+'12MEDEC16'!F67","v":3958738.1168800001},{"$f":"'12MEDEC16'!G54+'12MEDEC16'!G67","v":1692620.5999800002},{"$f":"'12MEDEC16'!H54+'12MEDEC16'!H67","v":300617.88334},{"$f":"'12MEDEC16'!I54+'12MEDEC16'!I67","v":217188.92998000002},{"$f":"'12MEDEC16'!J54+'12MEDEC16'!J67","v":242645.43633999999},{"$f":"'12MEDEC16'!K54+'12MEDEC16'!K67","v":214557.85000999999},{"$f":"'12MEDEC16'!L54+'12MEDEC16'!L67","v":270068.03203},{"$f":"'12MEDEC16'!M54+'12MEDEC16'!M67","v":362122.40171000001},{"$f":"'12MEDEC16'!N54+'12MEDEC16'!N67","v":1318938.40438},{"$f":"'12MEDEC16'!O54+'12MEDEC16'!O67","v":8021156.5224899994},{"$f":"SUM(C6:N6)","v":35797615.159190007}]
["Therms","Total",{"$f":"SUM(C5:C6)","v":22131818.23914},16787449.765939999,12859745.229009999,9114929.4339899998,4269068.12,3281704.2390000001,2537765.6940000001,2130641.6895300001,2604713.5796699999,4453518.3530000001,8310384.8540000003,17650621.129999999,106132360.32727998]
[null,"Billed Customers",{"$f":"'12MEDEC16'!C25","v":152912},{"$f":"'12MEDEC16'!D25","v":153882},{"$f":"'12MEDEC16'!E25","v":153511},{"$f":"'12MEDEC16'!F25","v":153360},{"$f":"'12MEDEC16'!G25","v":153389},{"$f":"'12MEDEC16'!H25","v":153224},{"$f":"'12MEDEC16'!I25","v":153459},{"$f":"'12MEDEC16'!J25","v":153740},{"$f":"'12MEDEC16'!K25","v":154156},{"$f":"'12MEDEC16'!L25","v":154684},{"$f":"'12MEDEC16'!M25","v":155353},{"$f":"'12MEDEC16'!N25","v":155792},{"$f":"SUM(C8:N8)","v":1847462}]
[null,"Block 1 Limit",{"$f":"C8*70","v":10703840},{"$f":"D8*70","v":10771740},10745770,10735200,10737230,10725680,10742130,10761800,10790920,10827880,10874710,10905440,{"$f":"SUM(C9:N9)","v":129322340}]
[null,"Revenue Run Total",{"$f":"'12MEDEC16'!D149","v":21914729.23914},{"$f":"'12MEDEC16'!E149","v":16787449.765939999},{"$f":"'12MEDEC16'!F149","v":12859745.229009999},{"$f":"'12MEDEC16'!G149","v":9114929.4339899998},{"$f":"'12MEDEC16'!H149","v":4269068.12},{"$f":"'12MEDEC16'!I149","v":3281704.2390000001},{"$f":"'12MEDEC16'!J149","v":2537765.6940000001},{"$f":"'12MEDEC16'!K149","v":2130641.6895300001},{"$f":"'12MEDEC16'!L149","v":2604713.5796699999},{"$f":"'12MEDEC16'!M149","v":4453518.3530000001},{"$f":"'12MEDEC16'!N149","v":8310384.8540000003},{"$f":"'12MEDEC16'!O149","v":17650621.129999999},{"$f":"SUM(C10:N10)","v":105915271.32728}]
{"$rows_left_out":57}
{"sheet":"Big Schedules","index":12,"n_rows":138,"n_cols":46,"rows_kept":138,"cut":false,"hidden":false,"merged":[]}
[null,"Washington Gas Billing Determinants by Customer"]
[null,null,null,null,null,null,null,null,null,null,null,null,null,null,null,null,"1st",{"$f":"Q3","v":20000},{"$f":"R3","v":50000},{"$f":"S3","v":300000},{"$f":"T3","v":500000},null,"Present","Proposed"]
[null,"ANNUAL USAGE, Sch 146",null,null,null,null,null,null,null,null,null,null,null,null,"12-mo ended",null,20000,50000,300000,500000,99999999,null,"Annual","Annual","Present Base","Proposed Base"]
[null,"Washington","2016-01-01","2016-02-01","2016-03-01","2016-04-01","2016-05-01","2016-06-01","2016-07-01","2016-08-01","2016-09-01","2016-10-01","2016-11-01","2016-12-01","Total",null,"thms/mo","thms/mo","thms/mo","thms/mo","thms/mo",null,"Minimum","Minimum","Revenue","Revenue"]
[1,null,431908,411425,300178,267490,123005,29280,20801,11702,11761,19731,147520,237184,{"$f":"SUM(C5:N5)","v":2011985},null,{"$f":"Q$3*12-SUMPRODUCT(--($C5:$N5<=Q$3),Q$3-$C5:$N5)","v":223194},{"$f":"R$3*12-SUM($Q5:Q5)-SUMPRODUCT(--($C5:$N5<=R$3),R$3-$C5:$N5)","v":220081},{"$f":"S$3*12-SUM($Q5:R5)-SUMPRODUCT(--($C5:$N5<=S$3),S$3-$C5:$N5)","v":1325199},{"$f":"T$3*12-SUM($Q5:S5)-SUMPRODUCT(--($C5:$N5<=T$3),T$3-$C5:$N5)","v":243511},{"$f":"U$3*12-SUM($Q5:T5)-SUMPRODUCT(--($C5:$N5<=U$3),U$3-$C5:$N5)","v":0},null,{"$f":"IF(O5<250000,(250000-O5)*'Exh3'!$E$54,0)","v":0},{"$f":"IF(O5<250000,(250000-O5)*'Exh3'!$I$54,0)","v":0},{"$f":"Q5*'Exh3'!$D$49+'Big Schedules'!R5*'Exh3'!$D$50+'Big Schedules'!S5*'Exh3'!$D$51+'Big Schedules'!T5*'Exh3'!$D$52+'Big Schedules'!U5*'Exh3'!$D$53+'Exh3'!$D$47*12+W5","v":172734.30706999998},{"$f":"Q5*'Exh3'!$I$49+'Big Schedules'!R5*'Exh3'!$I$50+'Big Schedules'!S5*'Exh3'!$I$51+'Big Schedules'!T5*'Exh3'!$I$52+'Big Schedules'!U5*'Exh3'!$I$53+'Exh3'!$I$47*12+X5","v":189554.88357000001},{"$f":"Z5/Y5-1","v":9.7378319254110668E-2}]
[2,null,27826,24870,25519,28601,25034,26023,25799,22827,25921,23830,24874,25654,{"$f":"SUM(C6:N6)","v":306778},null,240000,{"$f":"R$3*12-SUM($Q6:Q6)-SUMPRODUCT(--($C6:$N6<=R$3),R$3-$C6:$N6)","v":66778},{"$f":"S$3*12-SUM($Q6:R6)-SUMPRODUCT(--($C6:$N6<=S$3),S$3-$C6:$N6)","v":0},{"$f":"T$3*12-SUM($Q6:S6)-SUMPRODUCT(--($C6:$N6<=T$3),T$3-$C6:$N6)","v":0},{"$f":"U$3*12-SUM($Q6:T6)-SUMPRODUCT(--($C6:$N6<=U$3),U$3-$C6:$N6)","v":0},null,{"$f":"IF(O6<250000,(250000-O6)*'Exh3'!$E$54,0)","v":0},{"$f":"IF(O6<250000,(250000-O6)*'Exh3'!$I$54,0)","v":0},{"$f":"Q6*'Exh3'!$D$49+'Big Schedules'!R6*'Exh3'!$D$50+'Big Schedules'!S6*'Exh3'!$D$51+'Big Schedules'!T6*'Exh3'!$D$52+'Big Schedules'!U6*'Exh3'!$D$53+'Exh3'!$D$47*12+W6","v":36268.180899999999},{"$f":"Q6*'Exh3'!$I$49+'Big Schedules'!R6*'Exh3'!$I$50+'Big Schedules'!S6*'Exh3'!$I$51+'Big Schedules'!T6*'Exh3'!$I$52+'Big Schedules'!U6*'Exh3'!$I$53+'Exh3'!$I$47*12+X6","v":39544.098420000002},{"$f":"Z6/Y6-1","v":9.0324836777242457E-2}]
[3,null,14381,10434,13531,17747,14025,13443,14815,10215,11475,15044,12761,13049,160920,null,160920,{"$f":"R$3*12-SUM($Q7:Q7)-SUMPRODUCT(--($C7:$N7<=R$3),R$3-$C7:$N7)","v":0},{"$f":"S$3*12-SUM($Q7:R7)-SUMPRODUCT(--($C7:$N7<=S$3),S$3-$C7:$N7)","v":0},{"$f":"T$3*12-SUM($Q7:S7)-SUMPRODUCT(--($C7:$N7<=T$3),T$3-$C7:$N7)","v":0},{"$f":"U$3*12-SUM($Q7:T7)-SUMPRODUCT(--($C7:$N7<=U$3),U$3-$C7:$N7)","v":0},null,{"$f":"IF(O7<250000,(250000-O7)*'Exh3'!$E$54,0)","v":7932.5739999999987},{"$f":"IF(O7<250000,(250000-O7)*'Exh3'!$I$54,0)","v":8720.0411999999997},{"$f":"Q7*'Exh3'!$D$49+'Big Schedules'!R7*'Exh3'!$D$50+'Big Schedules'!S7*'Exh3'!$D$51+'Big Schedules'!T7*'Exh3'!$D$52+'Big Schedules'!U7*'Exh3'!$D$53+'Exh3'!$D$47*12+W7","v":30339.056799999998},{"$f":"Q7*'Exh3'!$I$49+'Big Schedules'!R7*'Exh3'!$I$50+'Big Schedules'!S7*'Exh3'!$I$51+'Big Schedules'!T7*'Exh3'!$I$52+'Big Schedules'!U7*'Exh3'!$I$53+'Exh3'!$I$47*12+X7","v":33026.068800000001},8.856610202859061E-2]
[4,null,19386,33497,33411,29733,29013,28805,25148,21759,28922,26397,31134,29530,336735,null,239386,{"$f":"R$3*12-SUM($Q8:Q8)-SUMPRODUCT(--($C8:$N8<=R$3),R$3-$C8:$N8)","v":97349},{"$f":"S$3*12-SUM($Q8:R8)-SUMPRODUCT(--($C8:$N8<=S$3),S$3-$C8:$N8)","v":0},{"$f":"T$3*12-SUM($Q8:S8)-SUMPRODUCT(--($C8:$N8<=T$3),T$3-$C8:$N8)","v":0},{"$f":"U$3*12-SUM($Q8:T8)-SUMPRODUCT(--($C8:$N8<=U$3),U$3-$C8:$N8)","v":0},null,{"$f":"IF(O8<250000,(250000-O8)*'Exh3'!$E$54,0)","v":0},{"$f":"IF(O8<250000,(250000-O8)*'Exh3'!$I$54,0)","v":0},{"$f":"Q8*'Exh3'!$D$49+'Big Schedules'!R8*'Exh3'!$D$50+'Big Schedules'!S8*'Exh3'!$D$51+'Big Schedules'!T8*'Exh3'!$D$52+'Big Schedules'!U8*'Exh3'!$D$53+'Exh3'!$D$47*12+W8","v":38929.073189999996},{"$f":"Q8*'Exh3'!$I$49+'Big Schedules'!R8*'Exh3'!$I$50+'Big Schedules'!S8*'Exh3'!$I$51+'Big Schedules'!T8*'Exh3'!$I$52+'Big Schedules'!U8*'Exh3'!$I$53+'Exh3'!$I$47*12+X8","v":42469.135190000001},9.0936200374515108E-2]
[5,null,54142,52092,49226,43519,35012,36777,30839,33937,25945,25885,36793,40214,464381,null,240000,{"$f":"R$3*12-SUM($Q9:Q9)-SUMPRODUCT(--($C9:$N9<=R$3),R$3-$C9:$N9)","v":218147},{"$f":"S$3*12-SUM($Q9:R9)-SUMPRODUCT(--($C9:$N9<=S$3),S$3-$C9:$N9)","v":6234},{"$f":"T$3*12-SUM($Q9:S9)-SUMPRODUCT(--($C9:$N9<=T$3),T$3-$C9:$N9)","v":0},{"$f":"U$3*12-SUM($Q9:T9)-SUMPRODUCT(--($C9:$N9<=U$3),U$3-$C9:$N9)","v":0},null,{"$f":"IF(O9<250000,(250000-O9)*'Exh3'!$E$54,0)","v":0},{"$f":"IF(O9<250000,(250000-O9)*'Exh3'!$I$54,0)","v":0},{"$f":"Q9*'Exh3'!$D$49+'Big Schedules'!R9*'Exh3'!$D$50+'Big Schedules'!S9*'Exh3'!$D$51+'Big Schedules'!T9*'Exh3'!$D$52+'Big Schedules'!U9*'Exh3'!$D$53+'Exh3'!$D$47*12+W9","v":50248.180549999997},{"$f":"Q9*'Exh3'!$I$49+'Big Schedules'!R9*'Exh3'!$I$50+'Big Schedules'!S9*'Exh3'!$I$51+'Big Schedules'!T9*'Exh3'!$I$52+'Big Schedules'!U9*'Exh3'!$I$53+'Exh3'!$I$47*12+X9","v":54911.885009999998},9.2813399588853374E-2]
[6,null,25996,26114,31668,36452,36643,31964,30418,21612,28414,28454,33786,28138,359659,null,240000,{"$f":"R$3*12-SUM($Q10:Q10)-SUMPRODUCT(--($C10:$N10<=R$3),R$3-$C10:$N10)","v":119659},{"$f":"S$3*12-SUM($Q10:R10)-SUMPRODUCT(--($C10:$N10<=S$3),S$3-$C10:$N10)","v":0},{"$f":"T$3*12-SUM($Q10:S10)-SUMPRODUCT(--($C10:$N10<=T$3),T$3-$C10:$N10)","v":0},{"$f":"U$3*12-SUM($Q10:T10)-SUMPRODUCT(--($C10:$N10<=U$3),U$3-$C10:$N10)","v":0},null,{"$f":"IF(O10<250000,(250000-O10)*'Exh3'!$E$54,0)","v":0},{"$f":"IF(O10<250000,(250000-O10)*'Exh3'!$I$54,0)","v":0},{"$f":"Q10*'Exh3'!$D$49+'Big Schedules'!R10*'Exh3'!$D$50+'Big Schedules'!S10*'Exh3'!$D$51+'Big Schedules'!T10*'Exh3'!$D$52+'Big Schedules'!U10*'Exh3'!$D$53+'Exh3'!$D$47*12+W10","v":40977.233949999994},{"$f":"Q10*'Exh3'!$I$49+'Big Schedules'!R10*'Exh3'!$I$50+'Big Schedules'!S10*'Exh3'!$I$51+'Big Schedules'!T10*'Exh3'!$I$52+'Big Schedules'!U10*'Exh3'!$I$53+'Exh3'!$I$47*12+X10","v":44720.619510000004},9.13528122607703E-2]
{"$rows_left_out":129}
{"sheet":"12MEDEC16","index":13,"n_rows":194,"n_cols":16,"rows_kept":194,"cut":false,"hidden":false,"merged":[]}
[]
[]
["Gas Revenue Meters Report by Location  Twelve Months Ended  for Report Date : '12/31/2016'"]
[]
["State Cde:WA"]
[]
[null,null,"Meters"]
[null,"Period","201601","201602","201603","201604","201605","201606","201607","201608","201609","201610","201611","201612","12 Month Average"]
["Rate Schedule Num"]
["0101",null,152821,153750,153321,153114,153138,152971,153203,153486,153911,154438,155110,155552,153734.58333333302]
{"$rows_left_out":185}
{"sheet":"BFG","index":14,"n_rows":24,"n_cols":6,"rows_kept":24,"cut":false,"hidden":false,"merged":[]}
["AVISTA UTILITIES"]
["GAS ANNUAL MINIMUM DEFICIENCY FOR B.F. GOODRICH"]
["STATE OF WASHINGTON"]
["BASED ON 2007 ANNUAL MINIMUM"]
[]
[null,null,null,null,null,"Gas"]
["Annual Minimum Usage Requirement(1)",null,null,null,null,10500000]
["Less: Jan 09 - Dec 09 Usage(2)",null,null,null,null,{"$f":"SUMIF('Big Schedules'!$B$4:$B$48,\"BF Goodrich\",'Big Schedules'!$O$4:$O$48)","v":0}]
["Usage Deficiency",null,null,null,null,{"$f":"F7-F8","v":10500000}]
["Deficiency Charge per therm(3)",null,null,null,null,0]
{"$rows_left_out":14}