{"text_format":"1","workbook":"xlsx","n_sheets":4,"sheets":["FIA","CompressionService","Therms","ConstructionCosts"],"not_rendered":{"charts":0,"images":6,"macros":1,"external_links":0,"defined_names":80,"comments":4,"pivot_tables":0},"unopened":[],"bounds":{"document_bytes":16777216,"sheet_cells":100000,"rows_first":2000,"rows_last":500,"rows_between":2000,"halvings":0,"cell_chars":16384,"cell_head_chars":4096},"cells_cut":0,"cells_raw":0,"read":"whole","date_system":"1900"}

{"sheet":"FIA","index":0,"n_rows":296,"n_cols":47,"rows_kept":296,"cut":false,"hidden":false,"merged":[[288,4,293,5],[10,1,12,2],[171,2,171,3],[76,4,76,8],[77,5,79,5],[77,8,79,8],[77,7,79,7],[77,6,79,6],[159,1,160,2],[77,1,79,1],[42,1,42,4],[16,2,16,8],[76,1,76,2],[77,2,79,2],[54,5,54,6],[77,9,77,13],[76,9,76,13],[56,8,56,9],[264,4,269,5],[276,4,281,5],[41,34,46,34],[42,32,46,33],[41,7,47,8],[4,11,4,12],[5,11,5,12],[0,16,0,28],[1,16,1,28],[8,0,9,1],[6,0,7,2],[9,4,9,7],[0,2,0,6],[1,3,1,8],[0,7,0,8],[7,4,7,7],[5,4,5,7],[8,5,8,6],[6,4,6,7],[0,11,0,12],[1,11,1,12],[2,11,2,12],[3,11,3,12]]}
[null,null,"NATURAL GAS COMPRESSION SERVICE CHARGE ANALYSIS",null,null,null,null,{"$f":"\"Version: P_\"&Q3","v":"Version: P_FIA_CNG_v1_P_12-21-2012.xlsm"},null,null,null,"CNG MODIFICATION KEY:",null,null,null,null,"In compliance with UG-120747 line extension O&M costs and FIT rider, UG-091548 line extension standard costs, and UG-111050 capital structure and margin rates (Password-protected)",null,null,null,null,null,null,null,null,null,null,null,null,null,null,null,"Input Selection"]
[null,null,null,"INPUT PROJECT ATTRIBUTES",null,null,null,null,null,null,null,"New additions",null,null,null,null,"BASE MARGIN RATES -- Effective 5/14/2012"]
[null,null,null,"Attribute A","LATECOMER OR ADDITION PRIOR TO REVIEW? (Yes or No)",null,null,null,"No",null,null,"Add CNG to Formula",null,null,null,null,"FIA_CNG_v1_P_12-21-2012.xlsm",23,31,"31T",41,"41T",53,61,85,"85T",86,"86T",87,"87T",null,null,"Valid Rate Schedules","Yes/No","NCR",null,null,null,"Service/Structure Type","Expected Years of Revenue"]
[null,null,null,"Attribute B","DEVELOPER PLAT? (Yes or No)",null,null,null,"No",null,null,"Input from CompressService Tab",null,null,null,null,"Customer Charge",10.34,33.42,367.59,114.22,440.55,{"$f":"R4","v":10.34},"ADDITIONAL REVENUE",563.45000000000005,901.5,144.01,458.22,579.19000000000005,926.71,null,null,23,"Yes",0.17,null,null,null,"Single Family Residences",33]
[null,null,null,"Attribute C","FINAL REVIEW?",null,null,null,"No",null,null,"Not Applicable",null,null,null,null,"Therm Charge - Block 1",0.38640999999999998,0.32599,{"$f":"-0.00539+S5","v":0.3206},0.14649000000000001,{"$f":"-0.00539+U5","v":0.1411},{"$f":"R5","v":0.38640999999999998},null,{"$f":"0.00682+Z5","v":0.11262},0.10580000000000001,0.21162,0.20480000000000001,{"$f":"0.00539+AD5","v":0.15224000000000001},0.14685000000000001,null,null,31,"No",0.115,null,null,null,"Mobile Home",10]
[null,null,null,"Attribute D","FACILITY MODIFICATION FOR EXISTING GAS CUSTOMER w/ SCHEDULE 7 VOLUME ALLOWANCE? (Yes or No)\nNCR/QP option is not available.  ",null,null,null,"No",{"$f":"IF(OR(AND($I$6=\"Yes\",$I$7=\"Yes\"),AND($I$6=\"Yes\",$I$8=\"Yes\"),AND($I$7=\"Yes\",$I$8=\"Yes\")),\"Please check your entry in CELL I6, I8 & I7 and choose 'Yes' in only one of the three cells.\",\"\")","v":""},null,"Goal Seek Result",null,null,null,null,"Therm Charge - Block 2",null,null,null,0.11953999999999999,{"$f":"-0.00539+U6","v":0.11414999999999999},null,null,6.1059999999999996E-2,5.4239999999999997E-2,0.15365999999999999,0.14684,9.5050000000000009E-2,8.9660000000000004E-2,null,null,"31T",null,null,null,null,null,"Multi-Family Dwellings - (2+ Units, Individual Metered)",33]
["NATURAL GAS COMPRESSION SERVICE CHARGE ANALYSIS",null,null,"Attribute E","FACILITY MODIFICATION FOR EXISTING GAS CUSTOMER w/ NO ADDITIONAL REVENUE? (Yes or No)\nRevenue in this case means incremental revenue to PSE due to increased therm usage by the customer, NOT revenue credits due to Schedule 7 volume allowances.\nNCR/QP option is not available.  ",null,null,null,"No",{"$f":"IF(OR(AND($I$6=\"Yes\",$I$7=\"Yes\"),AND($I$6=\"Yes\",$I$8=\"Yes\"),AND($I$7=\"Yes\",$I$8=\"Yes\")),\"Please check your entry in CELL I6, I8 & I7 and choose 'Yes' in only one of the three cells.\",\"\")","v":""},null,null,null,null,null,null,"Therm Charge - Block 3",null,null,null,null,null,null,null,5.8880000000000002E-2,5.2060000000000002E-2,null,null,6.3280000000000003E-2,5.7889999999999997E-2,null,null,41,null,null,null,null,null,"Multi-Family Dwellings - (2+ Units, Master Metered)",20]
[null,null,null,"Attribute F","NEW FACILITY EXTENSION w/ NO SCHEDULE 7 VOLUME ALLOWANCE? (Yes or No)\nSchedule 7 provides volume allowance ONLY for space heating, water heating range, dryer, hot tub and fireplace uses.\nNCR/QP option is not available. ",null,null,null,"No",{"$f":"IF(OR(AND($I$6=\"Yes\",$I$7=\"Yes\"),AND($I$6=\"Yes\",$I$8=\"Yes\"),AND($I$7=\"Yes\",$I$8=\"Yes\")),\"Please check your entry in CELL I6, I8 & I7 and choose 'Yes' in only one of the three cells.\",\"\")","v":""},null,null,null,null,null,null,"Therm Charge - Block 4",null,null,null,null,null,null,null,null,null,null,null,4.3339999999999997E-2,3.7949999999999998E-2,null,null,"41T",null,null,null,null,null,"Commercial, Industrial, Mixed-Use",20]
[{"$f":"Q1","v":"In compliance with UG-120747 line extension O&M costs and FIT rider, UG-091548 line extension standard costs, and UG-111050 capital structure and margin rates (Password-protected)"},null,null,"Attribute G","EXPECTED YEARS OF REVENUE: (Years)",{"$f":"IF(OR(NOT(ISERROR(FIND(\"T\",LEFT(C19,1)))),NOT(ISERROR(FIND(\"T\",LEFT(D19,1)))),NOT(ISERROR(FIND(\"T\",LEFT(E19,1)))),NOT(ISERROR(FIND(\"T\",LEFT(F19,1)))),NOT(ISERROR(FIND(\"T\",LEFT(G19,1)))),NOT(ISERROR(FIND(\"T\",LEFT(H19,1)))),NOT(ISERROR(FIND(\"T\",LEFT(I19,1))))),AM9,\"\")","v":""},null,10,{"$f":"IF(I11=\"Yes\",CompressionService!B2,AU12)","v":15},null,null,null,null,null,null,null,"Therm Charge - Block 5",null,null,null,null,null,null,null,null,null,null,null,3.3340000000000002E-2,2.7949999999999999E-2,null,null,53,null,null,null,null,null,"Temporary Services or Structures (Please see Project Manager and enter No. of years at the cell H9 .)",{"$f":"H9","v":10}]
[null,null,null,"Attribute H","NEW FACILITY EXTENSION OR FACILITY MODIFICATION FOR COMMUNITY AESTHETICS OR IN THE INTEREST OF PUBLIC SAFETY AND DOES NOT DIRECTLY BENEFIT PARTICULAR PSE CUSTOMERS? (Yes or No)\nPlease refer to RSI No. G-R28 and contact Rates Department.  Special IRS rulings may be applicable. ",null,null,null,"No",null,null,null,null,null,null,null,null,null,null,null,null,null,{"$f":"$AI$42","v":91},null,null,null,null,null,2.7469999999999998E-2,2.2079999999999999E-2,null,null,61]
[null,{"$f":"IF(OR(SUM(Therms!B64:H64)>0,SUM(ConstructionCosts!C41:I44)>0),\"RULE 7 REVIEW\",\"\")","v":""},null,"Attribute I","NATURAL GAS COMPRESSION FACILITIES? (Yes or No)",null,null,null,"Yes",null,null,null,null,null,null,null,null,null,null,null,null,null,null,null,null,null,null,null,null,null,null,null,85]
[null,null,null,null,null,null,null,null,null,null,null,null,null,null,null,null,"Effective 11/1/2011 Schedule 101 ",null,null,null,null,null,null,null,null,null,null,null,null,null,null,null,"85T",null,null,null,null,null,{"$f":"E9","v":"EXPECTED YEARS OF REVENUE: (Years)"},{"$f":"IF(C$23>=1,IF(NOT(ISNA(MATCH(C$19,$AM$4:$AM$9,FALSE))),OFFSET($AN$3,MATCH(C$19,$AM$4:$AM$9,FALSE),0),0))","v":10},{"$f":"IF(D$23>=1,IF(NOT(ISNA(MATCH(D$19,$AM$4:$AM$9,FALSE))),OFFSET($AN$3,MATCH(D$19,$AM$4:$AM$9,FALSE),0),0))","v":false},false,false,false,false,false,{"$f":"MIN(IF(AN12:AT12>0,AN12:AT12))","v":10}]
[null,null,null,null,null,null,null,"TARGET ROR",{"$f":"$G$167","v":7.7700000000000005E-2},null,null,null,null,null,null,null,"GAS COSTS",0.67837999999999998,0.67193000000000003,6.9999999999999999E-4,0.57726,{"$f":"$T$13","v":6.9999999999999999E-4},4.0064099999999998,{"$f":"X4","v":"ADDITIONAL REVENUE"},0.61334999999999995,{"$f":"$T$13","v":6.9999999999999999E-4},0.61817,{"$f":"$T$13","v":6.9999999999999999E-4},0.58521999999999996,{"$f":"$T$13","v":6.9999999999999999E-4},null,null,86,null,null,null,null,null,null,{"$f":"C19","v":0},{"$f":"D19","v":0},0,0,0,0,0]
[null,null,"enter customer name",null,null,"REP:","enter employee name",null,null,null,null,null,null,null,null,null,"Effective 6/22/2012 Schedule 7 Section 6: Operation and Maintenance Expense ",null,null,null,null,null,null,null,null,null,null,null,null,null,null,null,"86T",null,null,null,null,null,null,{"$f":"C21","v":1},{"$f":"D21","v":2},3,4,5,6,7]
[null,"SERVICE ADDRESS:","enter street address",null,null,"ORDER NO:","enter SAP order no.",null,null,null,null,null,null,null,null,null,"CUSTOMER COST",67,196,1974,754,2693,{"$f":"R15","v":67},{"$f":"X4","v":"ADDITIONAL REVENUE"},7799,{"$f":"$Y$15","v":7799},621,1974,{"$f":"$Y$15","v":7799},{"$f":"$Y$15","v":7799},null,null,87]
[null,null,"enter city, state and zip",null,null,"NAICS CODE:","enter NAICS code",null,null,null,null,null,null,null,null,null,null,null,null,null,null,null,null,null,null,null,null,null,null,null,null,null,"87T"]
[null,"PROJECT DESCRIPTION:","enter project description",null,null,null,null,null,null,null,null,null,null,null,null,null,"REVCST1"]
[null,null,null,null,null,null,null,null,null,null,null,null,null,null,null,null,"RATE",{"$f":"R$3","v":23},31,"31T",41,"41T",53,61,85,"85T",86,"86T",87,"87T",null,null,"Gas First Response Trip Charge Calculation - 2012"]
[null,"CUSTOMER GROUP STRUCTURE TYPE:",null,null,null,null,null,null,null,null,null,null,null,null,null,null,"REV/TH",{"$f":"IF($I$6=\"Yes\",(R$5+$R$13),(R$4+(R$5+$R$13)*R22)/R22)","v":{"$error":"#DIV/0!"}},{"$f":"IF($I$6=\"Yes\",(S$5+$S$13),(S$4+(S$5+$S$13)*S22)/S22)","v":{"$error":"#DIV/0!"}},{"$f":"IF($I$6=\"Yes\",(T$5+$T$13),(T$4+(T$5+$T$13)*T22)/T22)","v":{"$error":"#DIV/0!"}},{"$f":"IF($I$6=\"Yes\",(U$13+$U$6),(IF(U22>5000,(U22-5000)*$U$6+4500*$U$5,IF(U22>500,(U22-500)*$U$5,0))+500*$U$5+$U$4+U22*U$13)/U22)","v":{"$error":"#DIV/0!"}},{"$f":"IF($I$6=\"Yes\",(V$13+V$6),(IF(V22>5000,(V22-5000)*V$6+4500*V$5,IF(V22>500,(V22-500)*V$5,0))+500*V$5+V$4+V22*V$13)/V22)","v":{"$error":"#DIV/0!"}},{"$f":"IF($I$6=\"Yes\",(W$5+W$13),(W$4+(W$5+W$13)*W22)/W22)","v":{"$error":"#DIV/0!"}},{"$f":"X$4","v":"ADDITIONAL REVENUE"},{"$f":"IF($I$6=\"Yes\",(Y$13+Y$7),(IF(Y22>50000,(Y22-50000)*(Y$7+Y$13)+25000*(Y$6+Y$13)+25000*(Y$5+Y$13),IF(Y22>25000,(Y22-25000)*(Y$6+Y$13)+25000*(Y$5+Y$13),Y22*(Y$5+Y$13)))+Y$4)/Y22)","v":{"$error":"#DIV/0!"}},{"$f":"IF($I$6=\"Yes\",(Z$13+Z$7),(IF(Z22>50000,(Z22-50000)*(Z$7+Z$13)+25000*(Z$6+Z$13)+25000*(Z$5+Z$13),IF(Z22>25000,(Z22-25000)*(Z$6+Z$13)+25000*(Z$5+Z$13),Z22*(Z$5+Z$13)))+Z$4)/Z22)","v":{"$error":"#DIV/0!"}},{"$f":"IF($I$6=\"Yes\",(AA$6+AA$13),(IF(AA22>1000,(AA22-1000)*(AA$6+AA$13)+1000*(AA$5+AA$13),AA22*(AA$5+AA$13))+AA$4)/AA22)","v":{"$error":"#DIV/0!"}},{"$f":"IF($I$6=\"Yes\",(AB$6+$AB$13),(IF(AB22>1000,(AB22-1000)*(AB$6+$AB$13)+1000*(AB$5+$AB$13),AB22*(AB$5+$AB$13))+$AB$4)/AB22)","v":{"$error":"#DIV/0!"}},{"$f":"IF($I$6=\"Yes\",(AC$10+$AC$13),IF(AC22>500000,(AC22-500000)*(AC$10+$AC$13)+300000*(AC$9+$AC$13)+100000*(AC$8+$AC$13)+50000*(AC$7+$AC$13)+25000*(AC$6+$AC$13)+25000*(AC$5+$AC$13)+AC$4,IF(AC22>200000,(AC22-200000)*(AC$9+$AC$13)+100000*(AC$8+$AC$13)+50000*(AC$7+$AC$13)+25000*(AC$6+$AC$13)+25000*(AC$5+$AC$13)+AC$4,IF(AC22>100000,(AC22-100000)*(AC$8+$AC$13)+50000*(AC$7+$AC$13)+25000*(AC$6+$AC$13)+25000*(AC$5+$AC$13)+AC$4,IF(AC22>50000,(AC22-50000)*(AC$7+$AC$13)+25000*(AC$6+$AC$13)+25000*(AC$5+$AC$13)+AC$4,IF(AC22>25000,(AC22-25000)*(AC$6+$AC$13)+25000*(AC$5+$AC$13)+AC$4,AC22*(AC$5+$AC$13)+AC$4)))))/AC22)","v":{"$error":"#DIV/0!"}},{"$f":"IF($I$6=\"Yes\",(AD$10+AD$13),IF(AD22>500000,(AD22-500000)*(AD$10+AD$13)+300000*(AD$9+AD$13)+100000*(AD$8+AD$13)+50000*(AD$7+AD$13)+25000*(AD$6+AD$13)+25000*(AD$5+AD$13)+AD$4,IF(AD22>200000,(AD22-200000)*(AD$9+AD$13)+100000*(AD$8+AD$13)+50000*(AD$7+AD$13)+25000*(AD$6+AD$13)+25000*(AD$5+AD$13)+AD$4,IF(AD22>100000,(AD22-100000)*(AD$8+AD$13)+50000*(AD$7+AD$13)+25000*(AD$6+AD$13)+25000*(AD$5+AD$13)+AD$4,IF(AD22>50000,(AD22-50000)*(AD$7+AD$13)+25000*(AD$6+AD$13)+25000*(AD$5+AD$13)+AD$4,IF(AD22>25000,(AD22-25000)*(AD$6+AD$13)+25000*(AD$5+AD$13)+AD$4,AD22*(AD$5+AD$13)+AD$4)))))/AD22)","v":{"$error":"#DIV/0!"}},null,null,"(Does not include CC Assessments unless identified below)"]
[null,"CUSTOMER GROUP DESCRIPTION:",null,null,null,null,null,null,null,null,null,null,null,null,null,null,"GAS/TH",{"$f":"R$13","v":0.67837999999999998},0.67193000000000003,6.9999999999999999E-4,0.57726,6.9999999999999999E-4,4.0064099999999998,{"$f":"X$4","v":"ADDITIONAL REVENUE"},{"$f":"Y$13","v":0.61334999999999995},6.9999999999999999E-4,0.61817,6.9999999999999999E-4,0.58521999999999996,6.9999999999999999E-4,null,null,null,null,"CFS Technician"]
{"$rows_left_out":277}
{"sheet":"CompressionService","index":1,"n_rows":127,"n_cols":26,"rows_kept":127,"cut":false,"hidden":false,"merged":[[38,9,38,12],[34,9,34,11],[35,9,35,12],[36,9,36,12],[37,9,37,12],[0,1,0,15],[19,8,20,13],[27,9,32,13],[24,9,24,11],[22,0,22,5],[18,0,18,13],[19,0,20,0],[19,1,20,1],[19,4,20,5],[19,2,20,3],[19,6,20,6],[15,3,16,3],[1,0,2,0],[1,1,2,1],[14,0,14,13],[15,8,16,13],[9,3,10,3],[10,4,11,5],[15,0,16,0],[15,4,16,5],[15,6,16,6],[15,1,16,1],[15,2,16,2]]}
["Version 02","Schedule 54 CNG Pricing Model - Calculation of CNG Contracted Volume Compression Charge and Incremental O&M Charge\n\nPlease enter inputs in the cells in Bold Green Font and click \"CALCULATE\" when done.",null,null,null,null,null,null,null,null,null,null,null,null,null,null,null,null,null,null,null,null,null,null,null,"Print Row"]
[{"$f":"+FIA!E9","v":"EXPECTED YEARS OF REVENUE: (Years)"},15,null,null,null,null,null,null,null,null,null,null,null,null,null,null,null,null,null,null,null,null,null,null,null,"Y"]
[null,null,{"$f":"IF(AND(C$4<=$B$2,OR(C$8<=0)),\"Check Rate/Usage Info.\",\"\")","v":""},"","","","","","","","","","","","","",null,null,null,null,null,null,null,null,null,"Y"]
["REVENUE YEAR",1,2,3,4,5,6,7,8,9,10,11,12,13,14,15,null,null,null,null,null,null,null,null,null,"Y"]
["COMPRESSION STATION CAPITAL COST \n(As detailed in Exhibits B and D of Schdule 54 Service Agreement)",2500000,0,0,0,0,0,0,0,0,0,0,0,0,0,0,null,null,null,null,null,null,null,null,null,"Y"]
["ANNUAL STATION O&M COST\n(As detailed in Exhibits B and D of Schdule 54 Service Agreement)",150000,{"$f":"+B6*1.025","v":153750},{"$f":"+C6*1.025","v":157593.75},161533.59375,165571.93359375,169711.23193359372,173954.01273193356,178302.86305023188,182760.43462648767,187329.44549214985,0,0,0,0,0,null,null,null,null,null,null,null,null,null,"Y"]
["TOTAL NO. OF VEHICLES",{"$f":"IF(B4<=$B$2,SUMIF($C$25:$C$126,\"<=\"&B4,$B$25:$B$126),\"\")","v":7},{"$f":"IF(C4<=$B$2,SUMIF($C$25:$C$126,\"<=\"&C4,$B$25:$B$126),\"\")","v":14},20,20,20,20,20,20,20,20,{"$f":"IF(L4<=$B$2,+SUMIFS($B$25:$B$126,$C$25:$C$126,\"<=\"&L4),\"\")","v":20},{"$f":"IF(M4<=$B$2,+SUMIFS($B$25:$B$126,$C$25:$C$126,\"<=\"&M4),\"\")","v":20},{"$f":"IF(N4<=$B$2,+SUMIFS($B$25:$B$126,$C$25:$C$126,\"<=\"&N4),\"\")","v":20},{"$f":"IF(O4<=$B$2,+SUMIFS($B$25:$B$126,$C$25:$C$126,\"<=\"&O4),\"\")","v":20},{"$f":"IF(P4<=$B$2,+SUMIFS($B$25:$B$126,$C$25:$C$126,\"<=\"&P4),\"\")","v":20},null,null,null,null,null,null,null,null,null,"Y"]
["ANNUAL FLEET USAGE (THERMS)",{"$f":"IF(B4<=$B$2,SUMIF($C$25:$C$126,\"<=\"&B4,$H$25:$H$126),\"\")","v":182695.03546099286},365390.07092198572,521985.81560283678,521985.81560283678,521985.81560283678,521985.81560283678,521985.81560283678,521985.81560283678,521985.81560283678,521985.81560283678,{"$f":"IF(L4<=$B$2,SUMIFS($H$25:$H$126,$C$25:$C$126,\"<=\"&L4),\"\")","v":521985.81560283678},{"$f":"IF(M4<=$B$2,SUMIFS($H$25:$H$126,$C$25:$C$126,\"<=\"&M4),\"\")","v":521985.81560283678},{"$f":"IF(N4<=$B$2,SUMIFS($H$25:$H$126,$C$25:$C$126,\"<=\"&N4),\"\")","v":521985.81560283678},{"$f":"IF(O4<=$B$2,SUMIFS($H$25:$H$126,$C$25:$C$126,\"<=\"&O4),\"\")","v":521985.81560283678},{"$f":"IF(P4<=$B$2,SUMIFS($H$25:$H$126,$C$25:$C$126,\"<=\"&P4),\"\")","v":521985.81560283678},null,null,null,null,null,null,null,null,null,"Y"]
[null,null,null,null,null,null,null,null,null,null,null,null,null,null,null,null,null,null,null,null,null,null,null,null,null,"Y"]
[{"$f":"FIA!H13","v":"TARGET ROR"},{"$f":"+FIA!I13","v":7.7700000000000005E-2},null,"ROR W/ CNG CHARGE",null,null,null,null,null,null,null,null,null,null,null,null,null,null,null,null,null,null,null,null,null,"Y"]
["   PROJECT ROR BEFORE COMPRESSION CHARGE",-0.21222122810623345,null,null,{"$f":"+IF(AND($D$13<>0,$D$13<>FIA!$C$271),\"Please recalculate!\",\"\")","v":""},null,null,null,null,null,null,null,null,null,null,null,null,null,null,null,null,null,null,null,null,"Y"]
[{"$f":"UPPER(+FIA!B270)","v":"CNG FIXED CHARGE "},488445.46,null,7.7699565668839066E-2,null,null,null,null,null,null,null,null,null,null,null,null,null,null,null,null,null,null,null,null,null,"Y"]
[{"$f":"UPPER(+FIA!B272)","v":"CNG VOLUMETRIC CHARGE"},1.03871,null,7.7680234669242454E-2,null,null,null,null,null,null,null,null,null,null,null,null,null,null,null,null,null,null,null,null,null,"Y"]
[null,null,null,null,null,null,null,null,null,null,null,null,null,null,null,null,null,null,null,null,null,null,null,null,null,"Y"]
["CONTRACTED VOLUME COMPRESSION CHARGE - CUSTOMER PAYMENT OPTION",null,null,null,null,null,null,null,null,null,null,null,null,null,null,null,null,null,null,null,null,null,null,null,null,"Y"]
[{"$f":"\"FIXED MONTHLY PAYMENT FOR \"&B2&\" YEARS\"","v":"FIXED MONTHLY PAYMENT FOR 15 YEARS"},"PER MONTH:",{"$f":"+B12/12","v":40703.788333333338},"OR ","PER THERM \nUP TO MONTHLY CONTRACTED VOLUME:",null,{"$f":"+B13","v":1.03871},null,"CONTRACTED VOLUME COMPRESSION CHARGE IS AN ADDITION TO OTHER CNG CHARGES AND THE NATURAL GAS DISTRIBUTION / TRANSPORTATION AND APPLICABLE COMMODITY CHARGES. ",null,null,null,null,null,null,null,null,null,null,null,null,null,null,null,null,"Y"]
[null,null,null,null,null,null,null,null,null,null,null,null,null,null,null,null,null,null,null,null,null,null,null,null,null,"Y"]
[null,null,null,null,null,null,null,null,null,null,null,null,null,null,null,null,null,null,null,null,null,null,null,null,null,"Y"]
["INCREMENTAL O&M CHARGE ",null,null,null,null,null,null,null,null,null,null,null,null,null,null,null,null,null,null,null,null,null,null,null,null,"Y"]
["UNIT PRICE PER THERM",0.2,"WITH SALES AND REVENUE TAXES",null,"PER THERM\nFOR THERMS EXCEEDING THE MONTHLY CONTRACTED VOLUME",null,{"$f":"ROUND(+B20*(1+N38)*(1+N39),5)","v":0.2291},null,"INCREMENTAL O&M CHARGE IS AN ADDITION TO OTHER CNG SERVICE CHARGES AND THE NATURAL GAS SERVICE CHARGES. ",null,null,null,null,null,null,null,null,null,null,null,null,null,null,null,null,"Y"]
{"$rows_left_out":108}
{"sheet":"Therms","index":2,"n_rows":269,"n_cols":10,"rows_kept":269,"cut":false,"hidden":true,"merged":[[0,0,0,8],[6,0,6,7],[35,0,35,7],[62,0,62,7],[18,0,18,7],[27,0,27,7],[28,1,28,7],[31,0,31,7],[32,1,32,7]]}
["CONSUMPTION ESTIMATES"]
["CUSTOMER GROUP NO.",{"$f":"+FIA!C21","v":1},{"$f":"+FIA!D21","v":2},{"$f":"+FIA!E21","v":3},{"$f":"+FIA!F21","v":4},{"$f":"+FIA!G21","v":5},{"$f":"+FIA!H21","v":6},{"$f":"+FIA!I21","v":7}]
[{"$f":"+FIA!B20","v":"CUSTOMER GROUP DESCRIPTION:"},{"$f":"IF(+FIA!C20=0,\"\",+FIA!C20)","v":""},{"$f":"IF(+FIA!D20=0,\"\",+FIA!D20)","v":""},{"$f":"IF(+FIA!E20=0,\"\",+FIA!E20)","v":""},{"$f":"IF(+FIA!F20=0,\"\",+FIA!F20)","v":""},{"$f":"IF(+FIA!G20=0,\"\",+FIA!G20)","v":""},{"$f":"IF(+FIA!H20=0,\"\",+FIA!H20)","v":""},{"$f":"IF(+FIA!I20=0,\"\",+FIA!I20)","v":""}]
[{"$f":"+FIA!B19","v":"CUSTOMER GROUP STRUCTURE TYPE:"},{"$f":"+FIA!C19","v":0},{"$f":"+FIA!D19","v":0},{"$f":"+FIA!E19","v":0},{"$f":"+FIA!F19","v":0},{"$f":"+FIA!G19","v":0},{"$f":"+FIA!H19","v":0},{"$f":"+FIA!I19","v":0}]
[{"$f":"+FIA!B23","v":"NO. OF CUSTOMER/S"},{"$f":"+FIA!C23","v":1},{"$f":"+FIA!D23","v":0},{"$f":"+FIA!E23","v":0},{"$f":"+FIA!F23","v":0},{"$f":"+FIA!G23","v":0},{"$f":"+FIA!H23","v":0},{"$f":"+FIA!I23","v":0}]
["NO. OF RESIDENCIAL CUSTOMERS",{"$f":"IF(OR(FIA!C$19=FIA!$AM$5,FIA!C$19=FIA!$AM$4,FIA!C$19=FIA!$AM$6),+FIA!C23,0)","v":0},{"$f":"IF(OR(FIA!D$19=FIA!$AM$5,FIA!D$19=FIA!$AM$4,FIA!D$19=FIA!$AM$6),+FIA!D23,0)","v":0},{"$f":"IF(OR(FIA!E$19=FIA!$AM$5,FIA!E$19=FIA!$AM$4,FIA!E$19=FIA!$AM$6),+FIA!E23,0)","v":0},{"$f":"IF(OR(FIA!F$19=FIA!$AM$5,FIA!F$19=FIA!$AM$4,FIA!F$19=FIA!$AM$6),+FIA!F23,0)","v":0},{"$f":"IF(OR(FIA!G$19=FIA!$AM$5,FIA!G$19=FIA!$AM$4,FIA!G$19=FIA!$AM$6),+FIA!G23,0)","v":0},{"$f":"IF(OR(FIA!H$19=FIA!$AM$5,FIA!H$19=FIA!$AM$4,FIA!H$19=FIA!$AM$6),+FIA!H23,0)","v":0},{"$f":"IF(OR(FIA!I$19=FIA!$AM$5,FIA!I$19=FIA!$AM$4,FIA!I$19=FIA!$AM$6),+FIA!I23,0)","v":0}]
["GAS LOADS - SINGLE-FAMILY RESIDENCES"]
["INPUT AREA"]
["AVERAGE SQ FOOTAGE OF SINGLE-FAMILY DWELLING BEING REPRESENTED BY THIS COLUMN",0,0,0,0,0,0,0]
["MULTI-FAMILY UNITS METER MANIFOLD ID"]
["SQUARE FOOTAGE OF MULTIFAMILY DWELLING BEING REPRESENTED BY THIS COLUMN",0,0,0,0,0,0,0]
["GAS SPACE HEATING","No","No","No","No","No","No","No"]
["GAS HOT WATER","No","No","No","No","No","No","No"]
["WITH LAUNDRY (MULTI-FAMILY ONLY)","No","No","No","No","No","No","No"]
["GAS COOKING","No","No","No","No","No","No","No"]
["GAS DRYER","No","No","No","No","No","No","No"]
["GAS FIREPLACE","No","No","No","No","No","No","No"]
["GAS HOT TUB","No","No","No","No","No","No","No"]
[" CALCULATED THERMS/PER YEAR"]
["GAS SPACE HEATING",{"$f":"IF(AND(B12=\"Yes\",OR(FIA!C$19=FIA!$AM$5,FIA!C$19=FIA!$AM$4),B6>0),VLOOKUP(B9,Therms!$A$119:$C$269,3,TRUE),0)","v":0},{"$f":"IF(AND(C12=\"Yes\",OR(FIA!D$19=FIA!$AM$5,FIA!D$19=FIA!$AM$4),C6>0),VLOOKUP(C9,Therms!$A$119:$C$269,3,TRUE),0)","v":0},{"$f":"IF(AND(D12=\"Yes\",OR(FIA!E$19=FIA!$AM$5,FIA!E$19=FIA!$AM$4),D6>0),VLOOKUP(D9,Therms!$A$119:$C$269,3,TRUE),0)","v":0},{"$f":"IF(AND(E12=\"Yes\",OR(FIA!F$19=FIA!$AM$5,FIA!F$19=FIA!$AM$4),E6>0),VLOOKUP(E9,Therms!$A$119:$C$269,3,TRUE),0)","v":0},{"$f":"IF(AND(F12=\"Yes\",OR(FIA!G$19=FIA!$AM$5,FIA!G$19=FIA!$AM$4),F6>0),VLOOKUP(F9,Therms!$A$119:$C$269,3,TRUE),0)","v":0},{"$f":"IF(AND(G12=\"Yes\",OR(FIA!H$19=FIA!$AM$5,FIA!H$19=FIA!$AM$4),G6>0),VLOOKUP(G9,Therms!$A$119:$C$269,3,TRUE),0)","v":0},{"$f":"IF(AND(H12=\"Yes\",OR(FIA!I$19=FIA!$AM$5,FIA!I$19=FIA!$AM$4),H6>0),VLOOKUP(H9,Therms!$A$119:$C$269,3,TRUE),0)","v":0}]
{"$rows_left_out":250}
{"sheet":"ConstructionCosts","index":3,"n_rows":190,"n_cols":11,"rows_kept":190,"cut":false,"hidden":true,"merged":[[0,1,0,3],[6,0,10,0],[11,0,17,0],[29,1,29,8],[18,0,19,0],[20,0,28,0],[1,0,1,1],[2,0,2,1],[3,0,3,1],[4,0,4,1],[110,1,110,2],[111,1,111,2],[20,2,20,8],[39,1,39,8],[156,1,156,3],[112,1,112,2],[113,1,113,2],[119,1,119,2],[120,1,120,2],[114,3,114,4]]}
[null,"STANDARD AND NON-STANDARD COSTS  ESTIMATES"]
["CUSTOMER GROUP NO.",null,{"$f":"+FIA!C21","v":1},{"$f":"+FIA!D21","v":2},{"$f":"+FIA!E21","v":3},{"$f":"+FIA!F21","v":4},{"$f":"+FIA!G21","v":5},{"$f":"+FIA!H21","v":6},{"$f":"+FIA!I21","v":7}]
[{"$f":"+FIA!B20","v":"CUSTOMER GROUP DESCRIPTION:"},null,{"$f":"IF(+FIA!C20=0,\"\",+FIA!C20)","v":""},{"$f":"IF(+FIA!D20=0,\"\",+FIA!D20)","v":""},{"$f":"IF(+FIA!E20=0,\"\",+FIA!E20)","v":""},{"$f":"IF(+FIA!F20=0,\"\",+FIA!F20)","v":""},{"$f":"IF(+FIA!G20=0,\"\",+FIA!G20)","v":""},{"$f":"IF(+FIA!H20=0,\"\",+FIA!H20)","v":""},{"$f":"IF(+FIA!I20=0,\"\",+FIA!I20)","v":""}]
[{"$f":"+FIA!B19","v":"CUSTOMER GROUP STRUCTURE TYPE:"},null,{"$f":"IF(+FIA!C19=0,\"\",+FIA!C19)","v":""},{"$f":"IF(+FIA!D19=0,\"\",+FIA!D19)","v":""},{"$f":"IF(+FIA!E19=0,\"\",+FIA!E19)","v":""},{"$f":"IF(+FIA!F19=0,\"\",+FIA!F19)","v":""},{"$f":"IF(+FIA!G19=0,\"\",+FIA!G19)","v":""},{"$f":"IF(+FIA!H19=0,\"\",+FIA!H19)","v":""},{"$f":"IF(+FIA!I19=0,\"\",+FIA!I19)","v":""}]
[{"$f":"+FIA!B22","v":"RATE SCHEDULE:"},null,{"$f":"IF(+FIA!C22=0,\"\",+FIA!C22)","v":""},{"$f":"IF(+FIA!D22=0,\"\",+FIA!D22)","v":""},{"$f":"IF(+FIA!E22=0,\"\",+FIA!E22)","v":""},{"$f":"IF(+FIA!F22=0,\"\",+FIA!F22)","v":""},{"$f":"IF(+FIA!G22=0,\"\",+FIA!G22)","v":""},{"$f":"IF(+FIA!H22=0,\"\",+FIA!H22)","v":""},{"$f":"IF(+FIA!I22=0,\"\",+FIA!I22)","v":""}]
[null,"INPUT AREA"]
["GAS MAIN","GAS MAIN (1)\n(UP TO 4\" PE)","NOT APPLICABLE","NOT APPLICABLE","NOT APPLICABLE","NOT APPLICABLE","NOT APPLICABLE","NOT APPLICABLE","NOT APPLICABLE"]
[null,"LENGTH OF THE MAIN (FT)",0,0,0,0,0,0,0]
[null,"GAS MAIN (2)\n(UP TO 4\" PE)","NOT APPLICABLE","NOT APPLICABLE","NOT APPLICABLE","NOT APPLICABLE","NOT APPLICABLE","NOT APPLICABLE","NOT APPLICABLE"]
[null,"LENGTH OF THE MAIN (FT)",0,0,0,0,0,0,0]
[null,"SITE-SPECIFIC, NON-STANDARD MAIN CONSTRUCTION COSTS",0,0,0,0,0,0,0]
["GAS SERVICE","GAS SERVICE (1)\nRESIDENTIAL: ANY SIZE PE SERVICE\nCOMMERCIAL: UP TO 4\" PE IN SIZE","NOT APPLICABLE","NOT APPLICABLE","NOT APPLICABLE","NOT APPLICABLE","NOT APPLICABLE","NOT APPLICABLE","NOT APPLICABLE"]
[null,"LENGTH OF THE SERVICE (FT)",0,0,0,0,0,0,0]
[null,"GAS SERVICE (2)\nRESIDENTIAL: ANY SIZE PE SERVICE\nCOMMERCIAL: UP TO 4\" PE IN SIZE","NOT APPLICABLE","NOT APPLICABLE","NOT APPLICABLE","NOT APPLICABLE","NOT APPLICABLE","NOT APPLICABLE","NOT APPLICABLE"]
[null,"LENGTH OF THE SERVICE (FT)",0,0,0,0,0,0,0]
[null,"GAS SERVICE (3)\nRESIDENTIAL: ANY SIZE PE SERVICE\nCOMMERCIAL: UP TO 4\" PE IN SIZE","NOT APPLICABLE","NOT APPLICABLE","NOT APPLICABLE","NOT APPLICABLE","NOT APPLICABLE","NOT APPLICABLE","NOT APPLICABLE"]
[null,"LENGTH OF THE SERVICE (FT)",0,0,0,0,0,0,0]
[null,"SITE-SPECIFIC, NON-STANDARD SERVICE CONSTRUCTION COSTS",0,0,0,0,0,0,0]
["MSA","METER SET ASSEMBLY","NOT APPLICABLE","NOT APPLICABLE","NOT APPLICABLE","NOT APPLICABLE","NOT APPLICABLE","NOT APPLICABLE","NOT APPLICABLE"]
[null,"SITE-SPECIFIC, NON-STANDARD MSA CONSTRUCTION COSTS",0,0,0,0,0,0,0]
{"$rows_left_out":170}