{"text_format":"1","workbook":"xlsx","n_sheets":15,"sheets":["Pres & Prop Rev","Rate Design","Att A pg 1","Att A pg 3","Colstrip","Rate Spread GRC","Bill Determ","Sp Cnt Exh B","Bill Impact","WA Sch 25","Lighting summary","St Lts","Area Lts","Block Data","REVRUNS 12ME0921"],"not_rendered":{"charts":0,"images":0,"macros":1,"external_links":1,"defined_names":41,"comments":8,"pivot_tables":0},"unopened":[],"bounds":{"document_bytes":16777216,"sheet_cells":100000,"rows_first":2000,"rows_last":500,"rows_between":2000,"halvings":0,"cell_chars":16384,"cell_head_chars":4096},"cells_cut":0,"cells_raw":0,"read":"whole","date_system":"1900"}

{"sheet":"Pres & Prop Rev","index":0,"n_rows":305,"n_cols":19,"rows_kept":305,"cut":false,"hidden":false,"merged":[[5,18,10,20],[94,1,95,10]]}
[]
[null,{"$f":"IF(Base1_Billing2=2,\"BILLED\",\"\")","v":""}]
[]
[null,null," ","RESIDENTIAL","GENERAL SVC. ","GENERAL SVC. ","LG. GEN. SVC.","LG. GEN. SVC.","EX LG GEN SVC","EX LG GEN SVC","PUMPING","ST & AREA LTG"]
[null,null,"TOTAL","SCHEDULE 1,2","SCH. 11,12","SCH. 13","SCH. 21,22","SCH. 23","SCHEDULE 25","SCHEDULE 25I","SCH. 30, 31, 32","SCH. 41-48",null,null,null,null,null,null,"Print Header for all printed pages on this worksheet:"]
[null,"PRESENT BILL DETERMINANTS",null,null,null,null,null,null,null,null,null,null,null,null,"Calculate all revenue exhibits using  ____ rates:",null,null,null,{"$f":"\"AVISTA UTILITIES\nWASHINGTON ELECTRIC\nPRO FORMA REVENUE UNDER PRESENT AND PROPOSED \"&Q9&\" RATES\n12 MONTHS ENDED SEPTEMBER 30, 2021\"","v":"AVISTA UTILITIES\nWASHINGTON ELECTRIC\nPRO FORMA REVENUE UNDER PRESENT AND PROPOSED BASE TARIFF RATES\n12 MONTHS ENDED SEPTEMBER 30, 2021"}]
[null,"KILOWATT HOURS (KWHS)",null,null,null,null,null,null,null,null,null,null,null,"1)","BASE TARIFF"]
[null,"BLOCK 1",null,{"$f":"'Bill Determ'!$B$9","v":1699114425.539248},{"$f":"'Bill Determ'!$B$17","v":440976955.79465711},{"$f":"'Bill Determ'!$B$27","v":0},{"$f":"'Bill Determ'!$B$38","v":1176388254.2851541},{"$f":"'Bill Determ'!$B$49","v":0},{"$f":"'Bill Determ'!$B$58","v":125726244.40000001},{"$f":"'Bill Determ'!$B$62","v":6000000},{"$f":"SUM('Bill Determ'!$B$68:$C$68)","v":51510333.791929998},null,null,null,"or",null,1]
[null,"BLOCK 2",null,{"$f":"'Bill Determ'!$C$9","v":560062332.55344331},{"$f":"'Bill Determ'!$C$17","v":206157623.47196287},{"$f":"'Bill Determ'!$C$27","v":0},{"$f":"'Bill Determ'!$C$38","v":143363345.501926},{"$f":"'Bill Determ'!$C$49","v":0},{"$f":"'Bill Determ'!$C$58","v":435765470.8599999},{"$f":"'Bill Determ'!$C$62","v":66000000},{"$f":"'Bill Determ'!$D$68","v":112757486.25633},null,null,"2)","BILLING",null,{"$f":"CHOOSE(Base1_Billing2,O7,O9)","v":"BASE TARIFF"}]
[null,"BLOCK 3",null,{"$f":"'Bill Determ'!$D$9","v":314000634.28427869},null,null,null,null,{"$f":"'Bill Determ'!$D$58","v":0},{"$f":"'Bill Determ'!$D$62","v":387738120},null,null,null,null,null,null,{"$f":"CHOOSE(Base1_Billing2,\"Base\",\"Billing\")","v":"Base"}]
[null,"BLOCK 4"]
[null,"STREET & AREA LIGHTS",null,null,null,null,null,null,null,null,null,{"$f":"'REVRUNS 12ME0921'!P341","v":16979796.48079}]
[]
[null,"SUBTOTAL",{"$f":"SUM(D14:L14)","v":5742541023.2197199},{"$f":"SUM(D8:D12)","v":2573177392.3769703},647134579.26661992,{"$f":"SUM(F8:F12)","v":0},1319751599.78708,{"$f":"SUM(H8:H12)","v":0},{"$f":"SUM(I8:I12)","v":561491715.25999987},{"$f":"SUM(J8:J12)","v":459738120},164267820.04826,16979796.48079]
[]
[]
[null,"SUBTOTAL",{"$f":"SUM(D17:L17)","v":5742541023.2197199},{"$f":"D14+D15","v":2573177392.3769703},647134579.26661992,{"$f":"F14+F15","v":0},1319751599.78708,{"$f":"H14+H15","v":0},561491715.25999987,{"$f":"J14+J15","v":459738120},164267820.04826,16979796.48079]
[null,"ADJUSTMENT TO ACTUAL",{"$f":"SUM(D18:L18)","v":0},{"$f":"'Bill Determ'!$E$11","v":0},{"$f":"'Bill Determ'!$D$21","v":0},{"$f":"'Bill Determ'!$D$21","v":0},{"$f":"'Bill Determ'!$D$43","v":0},{"$f":"'Bill Determ'!$D$43","v":0},0,0,{"$f":"'Bill Determ'!$E$70","v":0},0]
[]
[null,"TOTAL BEFORE ADJUSTMENT",{"$f":"SUM(D20:L20)","v":5742541023.2197199},{"$f":"D17+D18","v":2573177392.3769703},647134579.26661992,{"$f":"F17+F18","v":0},1319751599.78708,{"$f":"H17+H18","v":0},561491715.25999987,{"$f":"J17+J18","v":459738120},164267820.04826,16979796.48079]
[null,"WEATHER & UNBILLED ADJ. KWHS",{"$f":"SUM(D21:L21)","v":-106488975},{"$f":"D142+D145","v":-73774001},-12331152,{"$f":"F142+F145","v":0},-19392888,{"$f":"H142+H145","v":0},0,{"$f":"J142+J145","v":0},-990934,0]
[null,null,null,null,null,null,null,null,null,null,null,null,null,null," "]
[null,"TOTAL PROFORMA KWHS",{"$f":"IF(ROUND(SUM(D23:L23),3)<>ROUND(SUM(C20:C21),3),#VALUE!,SUM(D23:L23))","v":5636052048.2197199},{"$f":"D20+D21","v":2499403391.3769703},634803427.26661992,{"$f":"F20+F21","v":0},1300358711.78708,{"$f":"H20+H21","v":0},561491715.25999987,{"$f":"J20+J21","v":459738120},163276886.04826,16979796.48079]
[]
[null,"TOTAL BILLS",null,{"$f":"'Bill Determ'!$F$9","v":2681552},{"$f":"'Bill Determ'!$F$17","v":403355},{"$f":"'Bill Determ'!$F$27","v":0},{"$f":"'Bill Determ'!$F$38","v":21942},{"$f":"'Bill Determ'!$F$29","v":0},{"$f":"'Bill Determ'!$G$58","v":252},{"$f":"'Bill Determ'!$G$62","v":12},{"$f":"'Bill Determ'!$F$66","v":30331}]
[null,"MINIMUM BILLS"]
[null,"EXCESS DEMAND",null,null,{"$f":"'Bill Determ'!$E$17","v":555536.70615384611},{"$f":"'Bill Determ'!$E$27","v":0},{"$f":"'Bill Determ'!$E$38","v":2822572.7138461536},{"$f":"'Bill Determ'!$E$49","v":0},{"$f":"'Bill Determ'!$F$58+'Bill Determ'!F59","v":475862.63199999998},{"$f":"'Bill Determ'!$F$62","v":703831.30999999994}]
[]
[null,"PROPOSED BILL DETERMINANTS"]
[null,"KILOWATT HOURS (KWHS)"]
[null,"BLOCK 1",null,{"$f":"D8","v":1699114425.539248},440976955.79465711,{"$f":"F8","v":0},1176388254.2851541,{"$f":"H8","v":0},125726244.40000001,{"$f":"J8","v":6000000},51510333.791929998,0]
[null,"BLOCK 2",null,{"$f":"D9","v":560062332.55344331},206157623.47196287,{"$f":"F9","v":0},143363345.501926,{"$f":"H9","v":0},{"$f":"'Bill Determ'!$C$58","v":435765470.8599999},{"$f":"'Bill Determ'!$C$62","v":66000000},112757486.25633,0]
[null,"BLOCK 3",null,314000634.28427869,0,{"$f":"F10","v":0},0,{"$f":"H10","v":0},{"$f":"'Bill Determ'!$D$58","v":0},{"$f":"'Bill Determ'!$D$62","v":387738120},0,0]
[null,"BLOCK 4",null,0,0,{"$f":"F11","v":0},0,{"$f":"H11","v":0},0,{"$f":"J11","v":0},0,0]
[null,"STREET & AREA LIGHTS",null,0,0,{"$f":"F12","v":0},0,{"$f":"H12","v":0},0,{"$f":"J12","v":0},0,{"$f":"L12","v":16979796.48079}]
[]
[null,"SUBTOTAL",{"$f":"SUM(D37:L37)","v":5742541023.2197199},{"$f":"SUM(D31:D35)","v":2573177392.3769703},647134579.26661992,{"$f":"SUM(F31:F35)","v":0},1319751599.78708,{"$f":"SUM(H31:H35)","v":0},561491715.25999987,{"$f":"SUM(J31:J35)","v":459738120},164267820.04826,16979796.48079]
[null,null,{"$f":"SUM(D38:L38)","v":0},{"$f":"D15","v":0},0,{"$f":"F15","v":0},0,{"$f":"H15","v":0},0,{"$f":"J15","v":0},0,0]
[]
[null,"SUBTOTAL",{"$f":"SUM(D40:L40)","v":5742541023.2197199},{"$f":"D37+D38","v":2573177392.3769703},647134579.26661992,{"$f":"F37+F38","v":0},1319751599.78708,{"$f":"H37+H38","v":0},561491715.25999987,{"$f":"J37+J38","v":459738120},164267820.04826,16979796.48079]
[null,"ADJUSTMENT TO ACTUAL",{"$f":"SUM(D41:L41)","v":0},{"$f":"D18","v":0},0,{"$f":"F18","v":0},0,{"$f":"H18","v":0},0,{"$f":"J18","v":0},0,0]
[]
[null,"TOTAL BEFORE ADJUSTMENT",{"$f":"SUM(D43:L43)","v":5742541023.2197199},{"$f":"D40+D41","v":2573177392.3769703},647134579.26661992,{"$f":"F40+F41","v":0},1319751599.78708,{"$f":"H40+H41","v":0},561491715.25999987,{"$f":"J40+J41","v":459738120},164267820.04826,16979796.48079]
[null,"WEATHER & UNBILLED ADJ. KWHS",{"$f":"SUM(D44:L44)","v":-106488975},{"$f":"D21","v":-73774001},-12331152,{"$f":"F21","v":0},-19392888,{"$f":"H21","v":0},0,{"$f":"J21","v":0},-990934,0]
[]
[null,"TOTAL PROFORMA KWHS",{"$f":"IF(ROUND(SUM(D46:L46),3)<>ROUND(SUM(C43:C44),3),#VALUE!,SUM(D46:L46))","v":5636052048.2197199},{"$f":"D43+D44","v":2499403391.3769703},634803427.26661992,{"$f":"F43+F44","v":0},1300358711.78708,{"$f":"H43+H44","v":0},561491715.25999987,{"$f":"J43+J44","v":459738120},163276886.04826,16979796.48079]
[]
[null,"TOTAL BILLS",null,{"$f":"D25","v":2681552},403355,0,21942,0,252,12,30331]
[null,"MINIMUM BILLS"]
[null,"EXCESS DEMAND",null,null,{"$f":"E27","v":555536.70615384611},0,2822572.7138461536,0,475862.63199999998,{"$f":"J27","v":703831.30999999994}]
[]
[]
[]
[]
[null,null,null,null,2,3,4,5,6,7,8,9,null,null,{"$f":"SUMPRODUCT(--(ISBLANK(D55:L55)))","v":1}]
[null,null," ",{"$f":"D$4","v":"RESIDENTIAL"},"GENERAL SVC. ","GENERAL SVC. ","LG. GEN. SVC.","LG. GEN. SVC.","EX LG GEN SVC","EX LG GEN SVC","PUMPING","ST & AREA LTG",null,null,{"$f":"\"selected in cell \"&CELL(\"address\",Base1_Billing2)&\":\"","v":"selected in cell $Q$8:"}]
[null,null,"TOTAL",{"$f":"D$5","v":"SCHEDULE 1,2"},"SCH. 11,12","SCH. 13","SCH. 21,22","SCH. 23","SCHEDULE 25","SCHEDULE 25I","SCH. 30, 31, 32","SCH. 41-48",null,null,{"$f":"Q10","v":"Base"}]
[null,"PRESENT RATES",null,null,null,null,null,null,null,null,null,null,null,null,{"$f":"\"Rates_\"&$O$57&\"_Present\"","v":"Rates_Base_Present"},null,"- range name where Present Rates table can be found"]
[null,"BASIC CHARGE",null,{"$f":"INDEX(INDIRECT($O$58),$N59,D$55)","v":9},21,21,0,600,0,0,21,0,null,1,{"$f":"\"Rates_\"&$O$57&\"_Proposed\"","v":"Rates_Base_Proposed"},null,"- range name where Proposed Rates table can be found"]
[null,"MONTHLY MINIMUM"]
[]
[null,"BLOCK 1 PER KWH",null,{"$f":"INDEX(INDIRECT($O$58),$N62,D$55)","v":9.4860000000000007},12.379,21.89,7.9269999999999996,16.783999999999999,5.9059999999999997,4.782,11.763,0,null,2]
[null,"BLOCK 2 PER KWH",null,11.035,9.0960000000000001,8.9060000000000006,7.0919999999999996,6.9279999999999999,5.3129999999999997,4.3029999999999999,8.4009999999999998,0,null,3]
[null,"BLOCK 3 PER KWH",null,12.94,0,0,0,0,4.3520000000000003,3.6789999999999998,0,0,null,4]
[null,"BLOCK 4 PER KWH",null,null,null,null,null,null,null,null,null,null,null,5]
[]
[null,"ADJUST TO ACTUAL PER KWH",null,{"$f":"(D124-D111)/D14*100","v":10.244632012971641},{"$f":"(E124-E111-SUM(E117:E120))/E14*100","v":11.333134890290509},0,{"$f":"(G124-G111-SUM(G117:G120))/G14*100","v":7.8362947540040899},0,null,null,{"$f":"(K124-K111-SUM(K117:K120))/K14*100","v":9.4552402140826501}]
[]
[null,"DEMAND BLOCK 1",null,{"$f":"INDEX(INDIRECT($O$58),$N69,D$55)","v":0},0,0,600,0,30650,30650,0,0,null,6]
[null,"DEMAND BLOCK 2",null,0,7.5,0,7.5,0,8.3000000000000007,8.3000000000000007,0,0,null,7]
[]
[]
[]
[]
[null,"PROPOSED RATES"]
[null,"BASIC CHARGE",null,{"$f":"INDEX(INDIRECT($O$59),$N76,D$55)","v":9},{"$f":"INDEX(INDIRECT($O$59),$N76,E$55)","v":21},{"$f":"INDEX(INDIRECT($O$59),$N76,F$55)","v":21},null,{"$f":"INDEX(INDIRECT($O$59),$N76,H$55)","v":600},null,null,{"$f":"INDEX(INDIRECT($O$59),$N76,K$55)","v":21},null,null,1]
[null,"MONTHLY MINIMUM"]
[]
[null,"BLOCK 1 PER KWH",null,{"$f":"INDEX(INDIRECT($O$59),$N79,D$55)","v":9.7210000000000001},12.708,22.472000000000001,8.1669999999999998,17.292000000000002,5.9870000000000001,4.843,12.039,null,null,2]
[null,"BLOCK 2 PER KWH",null,11.307,9.3379999999999992,9.1430000000000007,7.3070000000000004,7.1379999999999999,5.3860000000000001,4.3579999999999997,8.5980000000000008,null,null,3]
[null,"BLOCK 3 PER KWH",null,{"$f":"INDEX(INDIRECT($O$59),$N81,D$55)","v":13.26},null,null,null,null,{"$f":"INDEX(INDIRECT($O$59),$N81,I$55)","v":4.4119999999999999},{"$f":"INDEX(INDIRECT($O$59),$N81,J$55)","v":3.726},null,null,null,4]
[null,"BLOCK 4 PER KWH",null,null,null,null,null,null,null,null,null,null,null,5]
[]
[null,"ADJUST TO ACTUAL PER KWH",null,{"$f":"(D177-D164)/D37*100","v":10.498057621688659},{"$f":"(E177-E164-SUM(E170:E173))/E37*100","v":11.634419305073223},0,{"$f":"(G177-G164-SUM(G170:G173))/G37*100","v":8.0735790285982816},0,null,null,{"$f":"(K177-K164-SUM(K170:K173))/K37*100","v":9.6770126707287361}]
[]
[null,"DEMAND BLOCK 1",null,null,null,null,{"$f":"INDEX(INDIRECT($O$59),$N86,G$55)","v":600},0,30650,30650,null,null,null,6]
[null,"DEMAND BLOCK 2",null,null,{"$f":"INDEX(INDIRECT($O$59),$N87,E$55)","v":7.5},{"$f":"INDEX(INDIRECT($O$59),$N87,F$55)","v":0},7.5,0,8.3000000000000007,8.3000000000000007,null,null,null,7]
[]
[]
[]
[]
[]
[]
[]
[null,{"$f":"CHOOSE(Base1_Billing2,\"Note: Rates do not include BPA Residential Exchange Program Schedule 59, Decoupling Schedule 75, Tax Credit Schedule 76, Public Purpose Adjustment Schedules 89,91,92, REC Revenue Adjustment Schedule 98 or Power Cost Surcharge Schedule 93.\",\"\")","v":"Note: Rates do not include BPA Residential Exchange Program Schedule 59, Decoupling Schedule 75, Tax Credit Schedule 76, Public Purpose Adjustment Schedules 89,91,92, REC Revenue Adjustment Schedule 98 or Power Cost Surcharge Schedule 93."}]
[]
[]
[]
[]
[]
[]
[]
[]
[]
[]
[]
[null,null," ",{"$f":"D$4","v":"RESIDENTIAL"},"GENERAL SVC. ","GENERAL SVC. ","LG. GEN. SVC.","LG. GEN. SVC.","EX LG GEN SVC","EX LG GEN SVC","PUMPING","ST & AREA LTG"]
[null,null,"TOTAL",{"$f":"D$5","v":"SCHEDULE 1,2"},"SCH. 11,12","SCH. 13","SCH. 21,22","SCH. 23","SCHEDULE 25","SCHEDULE 25I","SCH. 30, 31, 32","SCH. 41-48"]
[null,"PRESENT REVENUE"]
[null,{"$f":"UPPER(CHOOSE(Base1_Billing2,$Q$9,$Q$10))&\" REVENUE\"","v":"BASE TARIFF REVENUE"}]
[null,"BASIC CHARGE",{"$f":"SUM(D111:L111)","v":33241374},{"$f":"D25*D59","v":24133968},{"$f":"E25*E59","v":8470455},{"$f":"F25*F59","v":0},null,{"$f":"H25*H59","v":0},null,null,{"$f":"K25*K59","v":636951}]
[null,"MONTHLY MINIMUM",0]
[null,"BLOCK 1",322790301.24000001,{"$f":"ROUND(D8*D62/100,2)","v":161177994.41},54588537.359999999,{"$f":"ROUND(F8*F62/100,2)","v":0},93252296.920000002,{"$f":"ROUND(H8*H62/100,2)","v":0},{"$f":"ROUND(I8*I62/100,2)","v":7425391.9900000002},{"$f":"ROUND(J8*J62/100,2)","v":286920},6059160.5599999996]
[null,"BLOCK 2",126187260.17999999,61802878.399999999,18752097.43,{"$f":"ROUND(F9*F63/100,2)","v":0},10167328.460000001,{"$f":"ROUND(H9*H63/100,2)","v":0},{"$f":"ROUND(I9*I63/100,2)","v":23152219.469999999},{"$f":"ROUND(J9*J63/100,2)","v":2839980},9472756.4199999999]
[null,"BLOCK 3",54896567.509999998,{"$f":"ROUND(D10*D64/100,2)","v":40631682.079999998},null,null,null,null,0,{"$f":"ROUND(J10*J64/100,2)","v":14264885.43}]
[null,"BLOCK 4",0]
[null,"DEMAND BLOCK 1",21256800,null,null,null,{"$f":"G25*G69","v":13165200},null,{"$f":"I25*I69","v":7723800},{"$f":"J25*J69","v":367800}]
[null,"DEMAND BLOCK 2",35127280.368599996,null,{"$f":"E27*E70","v":4166525.2961538457},null,21169295.353846151,null,3949659.8456000001,5841799.8729999997]
[null,"POWER FACTOR ADJUSTMENT",174577.77000000002,null,{"$f":"'Bill Determ'!G17*0.5","v":0},{"$f":"'Bill Determ'!G27*0.5","v":0},{"$f":"('Bill Determ'!G38)*0.5","v":174577.77000000002},{"$f":"('Bill Determ'!G49)*0.5","v":0},null,null,{"$f":"'Bill Determ'!G66*0.5","v":0}]
[null,"PRIMARY VOLTAGE DISCOUNT",-1664472.3742000002,null,null,null,{"$f":"'REVRUNS 12ME0921'!P441+'REVRUNS 12ME0921'!P448","v":-60832.87000000001},{"$f":"'REVRUNS 12ME0921'!P455","v":0},{"$f":"'WA Sch 25'!P108","v":-210365.71260000006},{"$f":"'WA Sch 25'!P119","v":-1393273.7916000001}]
[null,"ANNUAL MINIMUM ADJUSTMENT",0,null,null,null,null,null,{"$f":"'WA Sch 25'!T161","v":0}]
[null,"STREET & AREA LIGHT REVENUE",7163502.4823280005,null,null,null,null,null,null,null,null,{"$f":"'Lighting summary'!D19","v":7163502.4823280005}]
[]
[null,"SUBTOTAL",{"$f":"IF(ROUND(SUM(C111:C122),3)<>ROUND(SUM(D124:L124),3),#VALUE!,SUM(D124:L124))","v":599173191.17672813},{"$f":"SUM(D111:D122)","v":287746522.88999999},85977615.086153835,{"$f":"SUM(F111:F122)","v":0},137867865.63384616,{"$f":"SUM(H111:H122)","v":0},42040705.593000002,{"$f":"SUM(J111:J122)","v":22208111.511399999},16168867.98,7163502.4823280005]
[null,null,{"$f":"SUM(D125:L125)","v":0},{"$f":"ROUND(D15*D67/100,2)","v":0},{"$f":"ROUND(E15*E67/100,2)","v":0},{"$f":"ROUND(F15*F67/100,2)","v":0},{"$f":"ROUND(G15*G67/100,2)","v":0},{"$f":"ROUND(H15*H67/100,2)","v":0},{"$f":"ROUND(I15*I63/100,2)","v":0},{"$f":"ROUND(J15*J63/100,2)","v":0},{"$f":"ROUND(K15*K67/100,2)","v":0}]
[]
[null,"SUBTOTAL",{"$f":"SUM(D127:L127)","v":599173191.17672813},{"$f":"D124+D125","v":287746522.88999999},85977615.086153835,{"$f":"F124+F125","v":0},137867865.63384616,{"$f":"H124+H125","v":0},42040705.593000002,{"$f":"J124+J125","v":22208111.511399999},16168867.98,7163502.4823280005]
[null,"ADJUST TO ACTUAL",{"$f":"SUM(D128:L128)","v":0},{"$f":"ROUND(D18*D67/100,2)","v":0},0,{"$f":"ROUND(F18*F67/100,2)","v":0},0,{"$f":"ROUND(H18*H67/100,2)","v":0},0,{"$f":"ROUND(J18*J67/100,2)","v":0},0,0]
[]
[null,{"$f":"\"TOTAL \"&UPPER(CHOOSE(Base1_Billing2,$Q$9,$Q$10))&\" REVENUE\"","v":"TOTAL BASE TARIFF REVENUE"},{"$f":"IF(ROUND(SUM(D130:L130),3)<>ROUND(SUM(C127:C128),3),#VALUE!,SUM(D130:L130))","v":599173191.17672813},{"$f":"D127+D128","v":287746522.88999999},85977615.086153835,{"$f":"F127+F128","v":0},137867865.63384616,{"$f":"H127+H128","v":0},42040705.593000002,{"$f":"J127+J128","v":22208111.511399999},16168867.98,7163502.4823280005]
[]
[null,"ADJUSTMENT REVENUE"]
[null,"UNBILLED REVENUE ADJUSTMENT",null,null,null,null,null,null,null,null,null,null,null,null,{"$f":"D8/$D$14","v":0.66031764097293444},null,{"$f":"$D$134*O133","v":-7537527.1923413286},null,{"$f":"Q133*(D62/100)","v":-715009.82946549845}]
[null,"UNBILLED LOAD KWHS",{"$f":"SUM(D134:L134)","v":-16518266},{"$f":"'REVRUNS 12ME0921'!P395","v":-11415002},{"$f":"'REVRUNS 12ME0921'!P396","v":-962561},{"$f":"'REVRUNS 12ME0921'!P397","v":0},{"$f":"'REVRUNS 12ME0921'!P398","v":-3149769},{"$f":"'REVRUNS 12ME0921'!P399","v":0},null,null,{"$f":"'REVRUNS 12ME0921'!P402","v":-990934},null,null,null,{"$f":"D9/$D$14","v":0.21765399238024793},null,{"$f":"$D$134*O134","v":-2484520.7583285151},null,{"$f":"Q134*(D63/100)","v":-274166.86568155163}]
[null,"UNBILLED LOAD RATE",null,{"$f":"D67","v":10.244632012971641},{"$f":"E67","v":11.333134890290509},{"$f":"F67","v":0},{"$f":"G67","v":7.8362947540040899},{"$f":"H67","v":0},null,null,{"$f":"K67","v":9.4552402140826501},null,null,null,{"$f":"D10/$D$14","v":0.12202836664681749},null,{"$f":"$D$134*O135","v":-1392954.0493301549},null,{"$f":"Q135*(D64/100)","v":-180248.25398332204}]
[null,"UNBILLED LOAD REVENUE",{"$f":"SUM(D136:L136)","v":-1619033.66},{"$f":"ROUND(D134*D135/100,2)","v":-1169424.95},{"$f":"ROUND(E134*E135/100,2)","v":-109088.34},{"$f":"ROUND(F134*F135/100,2)","v":0},{"$f":"ROUND(G134*G135/100,2)","v":-246825.18},{"$f":"ROUND(H134*H135/100,2)","v":0},null,null,{"$f":"ROUND(K134*K135/100,2)","v":-93695.19},null,null,null,{"$f":"SUM(O133:O135)","v":0.99999999999999989},null,{"$f":"SUM(Q133:Q135)","v":-11415001.999999998},null,{"$f":"SUM(S133:S135)","v":-1169424.9491303721}]
[]
[null,"WEATHER-SENSITIVE KWHS",{"$f":"SUM(D138:L138)","v":0},0,0,0,0,0]
[null,"WEATHER-SENSITIVE RATE",null,{"$f":"I226","v":11.373967028100935},{"$f":"I245","v":9.0960000000000001},{"$f":"J245","v":0},{"$f":"G278","v":7.518932589631631},{"$f":"H278","v":0}]
[null,"WEATHER-SENSITIVE REVENUE",{"$f":"SUM(D140:L140)","v":0},{"$f":"ROUND(D138*D139/100,2)","v":0},{"$f":"ROUND(E138*E139/100,2)","v":0},{"$f":"ROUND(F138*F139/100,2)","v":0},{"$f":"ROUND(G138*G139/100,2)","v":0},{"$f":"ROUND(H138*H139/100,2)","v":0}]
[]
[null,"TOTAL UNBILLED KWH ADJUST",{"$f":"IF(ROUND(C134+C138,3)<>ROUND(SUM(D142:L142),3),#VALUE!,C134+C138)","v":-16518266},{"$f":"D134+D138","v":-11415002},{"$f":"E134+E138","v":-962561},{"$f":"F134+F138","v":0},{"$f":"G134+G138","v":-3149769},{"$f":"H134+H138","v":0},null,null,{"$f":"K134+K138","v":-990934},{"$f":"L134+L138","v":0}]
[null,"TOTAL UNBILLED REVENUE ADJ",{"$f":"IF(ROUND(C136+C140,3)<>ROUND(SUM(D143:L143),3),#VALUE!,C136+C140)","v":-1619033.66},{"$f":"D136+D140","v":-1169424.95},{"$f":"E136+E140","v":-109088.34},{"$f":"F136+F140","v":0},{"$f":"G136+G140","v":-246825.18},{"$f":"H136+H140","v":0},null,null,{"$f":"K136+K140","v":-93695.19}]
[null,"WEATHER NORMALIZATION ADJ"]
[null,"WEATHER-SENSITIVE KWHS",{"$f":"SUM(D145:L145)","v":-89970709},-62358999,-11368591,0,-16243119,0]
[null,"WEATHER-SENSITIVE RATE",null,{"$f":"I226","v":11.373967028100935},{"$f":"I245","v":9.0960000000000001},{"$f":"J245","v":0},{"$f":"G278","v":7.518932589631631},{"$f":"H278","v":0}]
[null,"WEATHER-SENSITIVE REVENUE",{"$f":"SUM(D147:L147)","v":-9348088.1999999993},{"$f":"ROUND(D145*D146/100,2)","v":-7092691.9900000002},{"$f":"ROUND(E145*E146/100,2)","v":-1034087.04},{"$f":"ROUND(F145*F146/100,2)","v":0},{"$f":"ROUND(G145*G146/100,2)","v":-1221309.17},{"$f":"ROUND(H145*H146/100,2)","v":0}]
[]
[null,"TOTAL ADJUSTMENT REVENUE",{"$f":"IF(ROUND(C143+C147,3)<>ROUND(SUM(D149:L149),3),#VALUE!,C143+C147)","v":-10967121.859999999},{"$f":"D147+D143","v":-8262116.9400000004},{"$f":"E147+E143","v":-1143175.3800000001},{"$f":"F147+F143","v":0},{"$f":"G147+G143","v":-1468134.3499999999},{"$f":"H147+H143","v":0},null,null,{"$f":"K147+K143","v":-93695.19}]
[null,{"$f":"B130","v":"TOTAL BASE TARIFF REVENUE"},{"$f":"C130","v":599173191.17672813},287746522.88999999,85977615.086153835,{"$f":"F130","v":0},137867865.63384616,{"$f":"H130","v":0},42040705.593000002,{"$f":"J130","v":22208111.511399999},16168867.98,7163502.4823280005]
[]
[null,"TOTAL PRESENT REVENUE",{"$f":"IF(ROUND(C149+C150,3)<>ROUND(SUM(D152:L152),3),#VALUE!,SUM(D152:L152))","v":588206069.316728},{"$f":"D149+D150","v":279484405.94999999},84834439.70615384,{"$f":"F149+F150","v":0},136399731.28384617,{"$f":"H149+H150","v":0},42040705.593000002,{"$f":"J149+J150","v":22208111.511399999},16075172.790000001,7163502.4823280005]
[]
[]
[]
[]
[]
[]
[]
[null,null," ",{"$f":"D$4","v":"RESIDENTIAL"},"GENERAL SVC. ","GENERAL SVC. ","LG. GEN. SVC.","LG. GEN. SVC.","EX LG GEN SVC","EX LG GEN SVC","PUMPING","ST & AREA LTG"]
[null,null,"TOTAL",{"$f":"D$5","v":"SCHEDULE 1,2"},"SCH. 11,12","SCH. 13","SCH. 21,22","SCH. 23","SCHEDULE 25","SCHEDULE 25I","SCH. 30, 31, 32","SCH. 41-48"]
[null,"PROPOSED REVENUE"]
[null,{"$f":"UPPER(CHOOSE(Base1_Billing2,$Q$9,$Q$10))&\" REVENUE\"","v":"BASE TARIFF REVENUE"}]
[null,"BASIC CHARGE",{"$f":"SUM(D164:L164)","v":33241374},{"$f":"D48*D76","v":24133968},{"$f":"E48*E76","v":8470455},{"$f":"F48*F76","v":0},null,{"$f":"H48*H76","v":0},null,null,{"$f":"K48*K76","v":636951}]
[null,"MONTHLY MINIMUM",0,{"$f":"D49*D77","v":0}]
[null,"BLOCK 1",331305032.91999996,{"$f":"ROUND(D31*D79/100,2)","v":165170913.31},56039351.539999999,{"$f":"ROUND(F31*F79/100,2)","v":0},96075628.730000004,{"$f":"ROUND(H31*H79/100,2)","v":0},7527230.25,{"$f":"ROUND(J31*J79/100,2)","v":290580},{"$f":"ROUND(K31*K79/100,2)","v":6201329.0899999999}]
[null,"BLOCK 2",129094303.41,63326247.939999998,19250998.879999999,{"$f":"ROUND(F32*F80/100,2)","v":0},10475559.66,{"$f":"ROUND(H32*H80/100,2)","v":0},23470328.260000002,{"$f":"ROUND(J32*J80/100,2)","v":2876280},9694888.6699999999]
[null,"BLOCK 3",56083606.460000001,{"$f":"ROUND(D33*D81/100,2)","v":41636484.109999999},null,null,null,null,0,{"$f":"ROUND(J33*J81/100,2)","v":14447122.35}]
[null,"BLOCK 4",0,{"$f":"ROUND(D34*D82/100,2)","v":0}]
[null,"DEMAND BLOCK 1",21256800,null,null,null,{"$f":"ROUND(G48*G86,2)","v":13165200},null,{"$f":"ROUND(I48*I86,2)","v":7723800},{"$f":"ROUND(J48*J86,2)","v":367800}]
[null,"DEMAND BLOCK 2",35127280.370000005,null,{"$f":"ROUND(E50*E87,2)","v":4166525.3},null,21169295.350000001,null,3949659.85,5841799.8700000001]
[null,"POWER FACTOR ADJUSTMENT",174577.77000000002,null,{"$f":"E119","v":0},{"$f":"F119","v":0},{"$f":"G119","v":174577.77000000002},{"$f":"H119","v":0},null,null,{"$f":"K119","v":0}]
[null,"PRIMARY VOLTAGE DISCOUNT",-1664472.3742000002,null,null,null,{"$f":"G120","v":-60832.87000000001},{"$f":"H120","v":0},{"$f":"'WA Sch 25'!P113","v":-210365.71260000006},{"$f":"'WA Sch 25'!P124","v":-1393273.7916000001}]
[null,"ANNUAL MINIMUM ADJUSTMENT",0,null,null,null,null,null,0,0]
[null,"STREET & AREA LIGHT REVENUE",7336496.6423279997,null,null,null,null,null,null,null,null,{"$f":"'Lighting summary'!G19","v":7336496.6423279997}]
[]
[null,"SUBTOTAL",{"$f":"IF(ROUND(SUM(C164:C175),3)<>ROUND(SUM(D177:L177),3),#VALUE!,SUM(D177:L177))","v":611954999.1981281},{"$f":"SUM(D164:D175)","v":294267613.36000001},87927330.719999999,{"$f":"SUM(F164:F175)","v":0},140999428.64000002,{"$f":"SUM(H164:H175)","v":0},42460652.647400007,{"$f":"SUM(J164:J175)","v":22430308.428400002},16533168.76,7336496.6423279997]
[null,null,{"$f":"SUM(D178:L178)","v":0},{"$f":"ROUND(D38*D84/100,2)","v":0},{"$f":"ROUND(E38*E84/100,2)","v":0},{"$f":"ROUND(F38*F84/100,2)","v":0},{"$f":"ROUND(G38*G84/100,2)","v":0},{"$f":"ROUND(H38*H84/100,2)","v":0},{"$f":"ROUND(I38*I80/100,2)","v":0},{"$f":"ROUND(J38*J80/100,2)","v":0},{"$f":"ROUND(K38*K84/100,2)","v":0},0]
[]
[null,"SUBTOTAL",{"$f":"SUM(D180:L180)","v":611954999.1981281},{"$f":"D177+D178","v":294267613.36000001},87927330.719999999,{"$f":"F177+F178","v":0},140999428.64000002,{"$f":"H177+H178","v":0},42460652.647400007,{"$f":"J177+J178","v":22430308.428400002},16533168.76,7336496.6423279997]
[null,"ADJUST TO ACTUAL",{"$f":"SUM(D181:L181)","v":0},{"$f":"ROUND(D41*D84/100,2)","v":0},0,{"$f":"ROUND(F41*F84/100,2)","v":0},0,{"$f":"ROUND(H41*H84/100,2)","v":0},0,{"$f":"ROUND(J41*J84/100,2)","v":0},0,0]
[]
[null,{"$f":"\"SUBTOTAL \"&UPPER(CHOOSE(Base1_Billing2,$Q$9,$Q$10))&\" REVENUE\"","v":"SUBTOTAL BASE TARIFF REVENUE"},{"$f":"IF(ROUND(SUM(D183:L183),3)<>ROUND(SUM(C180:C181),3),#VALUE!,SUM(D183:L183))","v":611954999.1981281},{"$f":"D180+D181","v":294267613.36000001},87927330.719999999,{"$f":"F180+F181","v":0},140999428.64000002,{"$f":"H180+H181","v":0},42460652.647400007,{"$f":"J180+J181","v":22430308.428400002},16533168.76,7336496.6423279997]
[]
[null,"ADJUSTMENT REVENUE"]
[null,"UNBILLED REVENUE ADJUSTMENT"]
[null,"UNBILLED LOAD KWHS",{"$f":"SUM(D187:L187)","v":-16518266},{"$f":"D134","v":-11415002},{"$f":"E134","v":-962561},{"$f":"F134","v":0},{"$f":"G134","v":-3149769},{"$f":"H134","v":0},null,null,{"$f":"K134","v":-990934}]
[null,"UNBILLED LOAD RATE",null,{"$f":"D84","v":10.498057621688659},{"$f":"E84","v":11.634419305073223},{"$f":"F84","v":0},{"$f":"G84","v":8.0735790285982816},{"$f":"H84","v":0},null,null,{"$f":"K84","v":9.6770126707287361}]
[null,"UNBILLED LOAD REVENUE",{"$f":"SUM(D189:L189)","v":-1660533.7700000003},{"$f":"ROUND(D187*D188/100,2)","v":-1198353.49},{"$f":"ROUND(E187*E188/100,2)","v":-111988.38},{"$f":"ROUND(F187*F188/100,2)","v":0},{"$f":"ROUND(G187*G188/100,2)","v":-254299.09},{"$f":"ROUND(H187*H188/100,2)","v":0},null,null,{"$f":"ROUND(K187*K188/100,2)","v":-95892.81}]
[]
[null,"WEATHER-SENSITIVE KWHS",{"$f":"SUM(D191:L191)","v":0},{"$f":"D138","v":0},{"$f":"E138","v":0},{"$f":"F138","v":0},{"$f":"G138","v":0},{"$f":"H138","v":0}]
[null,"WEATHER-SENSITIVE RATE",null,{"$f":"I235","v":11.654821858198178},{"$f":"I253","v":9.3379999999999992},{"$f":"J253","v":0},{"$f":"G286","v":7.7466070859763771},{"$f":"H286","v":0}]
[null,"WEATHER-SENSITIVE REVENUE",{"$f":"SUM(D193:L193)","v":0},{"$f":"ROUND(D191*D192/100,2)","v":0},{"$f":"ROUND(E191*E192/100,2)","v":0},{"$f":"ROUND(F191*F192/100,2)","v":0},{"$f":"ROUND(G191*G192/100,2)","v":0},{"$f":"ROUND(H191*H192/100,2)","v":0}]
[]
[null,"TOTAL UNBILLED KWH ADJUST",{"$f":"IF(ROUND(C187+C191,3)<>ROUND(SUM(D195:L195),3),#VALUE!,SUM(D195:L195))","v":-16518266},{"$f":"D187+D191","v":-11415002},{"$f":"E187+E191","v":-962561},{"$f":"F187+F191","v":0},{"$f":"G187+G191","v":-3149769},{"$f":"H187+H191","v":0},null,null,{"$f":"K187+K191","v":-990934}]
[null,"TOTAL UNBILLED REVENUE ADJ",{"$f":"IF(ROUND(C189+C193,3)<>ROUND(SUM(D196:L196),3),#VALUE!,SUM(D196:L196))","v":-1660533.7700000003},{"$f":"D189+D193","v":-1198353.49},{"$f":"E189+E193","v":-111988.38},{"$f":"F189+F193","v":0},{"$f":"G189+G193","v":-254299.09},{"$f":"H189+H193","v":0},null,null,{"$f":"K189+K193","v":-95892.81}]
[null,"WEATHER NORMALIZATION ADJ"]
[null,"WEATHER-SENSITIVE KWHS",{"$f":"SUM(D198:L198)","v":-89970709},{"$f":"D145","v":-62358999},{"$f":"E145","v":-11368591},{"$f":"F145","v":0},{"$f":"G145","v":-16243119},{"$f":"H145","v":0}]
[null,"WEATHER-SENSITIVE RATE"," ",{"$f":"I235","v":11.654821858198178},{"$f":"I253","v":9.3379999999999992},{"$f":"J253","v":0},{"$f":"G286","v":7.7466070859763771},{"$f":"H286","v":0}]
[null,"WEATHER-SENSITIVE REVENUE",{"$f":"SUM(D200:L200)","v":-9587719.8900000006},{"$f":"ROUND(D198*D199/100,2)","v":-7267830.25},{"$f":"ROUND(E198*E199/100,2)","v":-1061599.03},{"$f":"ROUND(F198*F199/100,2)","v":0},{"$f":"ROUND(G198*G199/100,2)","v":-1258290.6100000001},{"$f":"ROUND(H198*H199/100,2)","v":0}]
[]
[null,"TOTAL ADJUSTMENT REVENUE",{"$f":"IF(ROUND(SUM(D202:L202),3)<>ROUND(C196+C200,3),#VALUE!,SUM(D202:L202))","v":-11248253.660000002},{"$f":"D200+D196","v":-8466183.7400000002},{"$f":"E200+E196","v":-1173587.4100000001},{"$f":"F200+F196","v":0},{"$f":"G200+G196","v":-1512589.7000000002},{"$f":"H200+H196","v":0},null,null,{"$f":"K200+K196","v":-95892.81}]
[null,{"$f":"\"TOTAL \"&UPPER(CHOOSE(Base1_Billing2,$Q$9,$Q$10))&\" REVENUE\"","v":"TOTAL BASE TARIFF REVENUE"},{"$f":"SUM(D203:L203)","v":611954999.1981281},{"$f":"D183","v":294267613.36000001},87927330.719999999,{"$f":"F183","v":0},140999428.64000002,{"$f":"H183","v":0},42460652.647400007,{"$f":"J183","v":22430308.428400002},16533168.76,7336496.6423279997]
[null,"TOTAL PROPOSED REVENUE",{"$f":"IF(ROUND(SUM(D204:L204),3)<>ROUND(SUM(C202:C203),3),#VALUE!,SUM(D204:L204))","v":600706745.53812814},{"$f":"D202+D203","v":285801429.62},{"$f":"E202+E203","v":86753743.310000002},{"$f":"F202+F203","v":0},139486838.94000003,{"$f":"H202+H203","v":0},{"$f":"I202+I203","v":42460652.647400007},{"$f":"J202+J203","v":22430308.428400002},16437275.949999999,7336496.6423279997]
[null,"TOTAL PRESENT REVENUE",{"$f":"SUM(D205:L205)","v":588206069.316728},{"$f":"D152","v":279484405.94999999},84834439.70615384,{"$f":"F152","v":0},136399731.28384617,{"$f":"H152","v":0},{"$f":"I152","v":42040705.593000002},{"$f":"J152","v":22208111.511399999},16075172.790000001,7163502.4823280005]
[]
[null,"TOTAL REVENUE INCREASE",{"$f":"SUM(D207:L207)","v":12500676.221400041},{"$f":"D204-D205","v":6317023.6700000167},1919303.6038461626,{"$f":"F204-F205","v":0},3087107.6561538577,{"$f":"H204-H205","v":0},419947.05440000445,{"$f":"J204-J205","v":222196.91700000316},362103.15999999829,172994.15999999922]
[null,"PERCENT REVENUE INCREASE",{"$f":"C207/C205","v":2.1252205431883893E-2},{"$f":"D207/D205","v":2.2602419081407133E-2},2.2624108917253066E-2,{"$f":"F207/F205","v":{"$error":"#DIV/0!"}},2.2632798665340657E-2,{"$f":"H207/H205","v":{"$error":"#DIV/0!"}},9.9890581872138662E-3,{"$f":"J207/J205","v":1.0005214395917623E-2},2.2525615415173294E-2,{"$f":"L207/L205","v":2.4149382292637866E-2}]
[null,{"$f":"IF(Base1_Billing2=2,\"Pres and Prop Revenues may be incorrect due to Sch 59--for example all of Sch 11 gets benefit of Sch 59 but it s/only be Sch 12; see Billing Rev on Exhibit page for fix\",\"\")","v":""}]
[]
[]
[]
[]
[]
[]
[null,null," ","TOTAL","TOTAL","BASELOAD","BASELOAD","WTHR-SENS.","WTHR-SENS."]
[null,null,"RATES","KWHS","REVENUE","KWHS","REVENUE","KWHS","REVENUE"]
[]
[null,"PRESENT BASELOAD AND WEATHER-SENSITIVE RATES"]
[null,"SCHEDULE 1"]
[null,"0-800 KWHS",{"$f":"D62","v":9.4860000000000007},{"$f":"D8","v":1699114425.539248},{"$f":"C221*D221/100","v":161177994.40665308},{"$f":"MIN(D221,F225)","v":1539210848},{"$f":"F221*C221/100","v":146009541.04128},{"$f":"D221-F221","v":159903577.53924799},{"$f":"H221*C221/100","v":15168453.365373066},null,null,{"$f":"H221/$H$225","v":0.15465063005070437},null,{"$f":"L221*$D$145","v":-9643858.4846812431},{"$f":"N221*(C221/100)","v":-914816.41585686267}]
[null,"801-1500 KWHS",{"$f":"D63","v":11.035},{"$f":"D9","v":560062332.55344331},{"$f":"C222*D222/100","v":61802878.397272475},{"$f":"MIN(F225-F221,D222)","v":0},{"$f":"F222*C222/100","v":0},{"$f":"D222-F222","v":560062332.55344331},{"$f":"H222*C222/100","v":61802878.397272475},null,null,{"$f":"H222/$H$225","v":0.54166388225928153},null,{"$f":"L222*$D$145","v":-33777617.492142655},{"$f":"N222*(C222/100)","v":-3727360.0902579422}]
[null,"OVER 100 KWHS",{"$f":"D64","v":12.94},{"$f":"D10","v":314000634.28427869},{"$f":"C223*D223/100","v":40631682.076385662},{"$f":"MIN(F225-F221-F222,D223)","v":0},{"$f":"F223*C223/100","v":0},{"$f":"D223-F223","v":314000634.28427869},{"$f":"H223*C223/100","v":40631682.076385662},null,null,{"$f":"H223/$H$225","v":0.30368548769001402},null,{"$f":"L223*$D$145","v":-18937523.023176096},{"$f":"N223*(C223/100)","v":-2450515.4791989867}]
[null,null,null,null,null,null,null,null,null,null,null,null,null,{"$f":"SUM(N221:N223)","v":-62358998.999999993},{"$f":"SUM(O221:O223)","v":-7092691.9853137918}]
[null,"TOTAL",null,{"$f":"D221+D222+D223","v":2573177392.3769703},263612554.88031119,{"$f":"574*D25","v":1539210848},146009541.04128,1033966544.3769701,117603013.8390312]
[null,"AVERAGE RATE",null,null,{"$f":"E225/D225*100","v":10.24463201259511},null,{"$f":"G225/F225*100","v":9.4860000000000007},null,{"$f":"I225/H225*100","v":11.373967028100935}]
[]
[null,"PROPOSED BASELOAD AND WEATHER-SENSITIVE RATES"]
[null,"SCHEDULE 1"]
[null,"0-800 KWHS",{"$f":"D79","v":9.7210000000000001},{"$f":"D221","v":1699114425.539248},{"$f":"C230*D230/100","v":165170913.30667031},{"$f":"MIN(D230,F234)","v":1539210848},{"$f":"F230*C230/100","v":149626686.53408},{"$f":"H221","v":159903577.53924799},{"$f":"H230*C230/100","v":15544226.772590296}]
[null,"801-1500 KWHS",{"$f":"D80","v":11.307},{"$f":"D222","v":560062332.55344331},{"$f":"C231*D231/100","v":63326247.941817835},{"$f":"MIN(F234-F230,D231)","v":0},{"$f":"F231*C231/100","v":0},{"$f":"H222","v":560062332.55344331},{"$f":"H231*C231/100","v":63326247.941817835}]
[null,"OVER 1500 KWHS",{"$f":"D81","v":13.26},{"$f":"D223","v":314000634.28427869},{"$f":"C232*D232/100","v":41636484.106095351},{"$f":"MIN(F234-F230-F231,D232)","v":0},{"$f":"F232*C232/100","v":0},{"$f":"H223","v":314000634.28427869},{"$f":"H232*C232/100","v":41636484.106095351}]
[]
[null,"TOTAL",null,{"$f":"D230+D231+D232","v":2573177392.3769703},270133645.3545835,{"$f":"F225","v":1539210848},149626686.53408,1033966544.3769701,120506958.82050347]
[null,"AVERAGE RATE",null,null,{"$f":"E234/D234*100","v":10.498057621478161},null,{"$f":"G234/F234*100","v":9.7210000000000001},null,{"$f":"I234/H234*100","v":11.654821858198178}]
[]
[]
[]
[null,"PRESENT BASELOAD AND WEATHER-SENSITIVE RATES"]
[null,"SCHEDULE 11"]
[null,"0-3650 KWHS",{"$f":"E62","v":12.379},{"$f":"E8","v":440976955.79465711},{"$f":"C241*D241/100","v":54588537.357820608},{"$f":"MIN(D241,F244)","v":440976955.79465711},{"$f":"F241*C241/100","v":54588537.357820608},{"$f":"D241-F241","v":0},{"$f":"H241*C241/100","v":0}]
[null,"over 3650 KWHS",{"$f":"E63","v":9.0960000000000001},{"$f":"E9","v":206157623.47196287},{"$f":"C242*D242/100","v":18752097.431009743},{"$f":"MIN(F244-F241,D242)","v":138240824.20534289},{"$f":"F242*C242/100","v":12574385.369717989},{"$f":"D242-F242","v":67916799.26661998},{"$f":"H242*C242/100","v":6177712.0612917533}]
[]
[null,"TOTAL",null,{"$f":"D241+D242","v":647134579.26661992},73340634.788830355,{"$f":"1436*E25","v":579217780},67162922.727538601,67916799.26661998,6177712.0612917533]
[null,"AVERAGE RATE",null,null,{"$f":"E244/D244*100","v":11.333134890109768},null,{"$f":"G244/F244*100","v":11.595452530400326},null,{"$f":"I244/H244*100","v":9.0960000000000001}]
[]
[null,"PROPOSED BASELOAD AND WEATHER-SENSITIVE RATES"]
[null,"SCHEDULE 11"]
[null,"0-3650 KWHS",{"$f":"E79","v":12.708},{"$f":"E31","v":440976955.79465711},{"$f":"C249*D249/100","v":56039351.542385027},{"$f":"MIN(D249,F252)","v":440976955.79465711},{"$f":"F249*C249/100","v":56039351.542385027},{"$f":"D249-F249","v":0},{"$f":"H249*C249/100","v":0}]
[null,"over 3650 KWHS",{"$f":"E80","v":9.3379999999999992},{"$f":"E32","v":206157623.47196287},{"$f":"C250*D250/100","v":19250998.87981189},{"$f":"MIN(F252-F249,D250)","v":138240824.20534289},{"$f":"F250*C250/100","v":12908928.164294917},{"$f":"D250-F250","v":67916799.26661998},{"$f":"H250*C250/100","v":6342070.7155169733}]
[]
[null,"TOTAL",null,{"$f":"D249+D250","v":647134579.26661992},75290350.422196925,{"$f":"F244","v":579217780},68948279.70667994,67916799.26661998,6342070.7155169733]
[null,"AVERAGE RATE",null,null,{"$f":"E252/D252*100","v":11.634419305412706},null,{"$f":"G252/F252*100","v":11.903688403121869},null,{"$f":"I252/H252*100","v":9.3379999999999992}]
[]
[]
[]
[]
[]
[]
[]
[null,"Note:  Total Base Load for Sch. 1 = Base Load per bill times total billings (base load per bill on JDM-E-18) ="]
[null,{"$f":"\"574 X \"&TEXT(D25,\"#,##0\")&\" = \"&TEXT(F225,\"#,##0\")","v":"574 X 2,681,552 = 1,539,210,848"}]
[null,{"$f":"\"Total Base Load for Sch. 11 = 1,436 X \"&TEXT(E25,\"#,##0\")&\" = \"&TEXT(F244,\"#,##0\")","v":"Total Base Load for Sch. 11 = 1,436 X 403,355 = 579,217,780"}]
[null,{"$f":"IF(Base1_Billing2=2,\"Pres and Prop Revenues may be incorrect due to Sch 59--for example all of Sch 11 gets benefit of Sch 59 but it s/only be Sch 12; see Billing Rev on Exhibit page for fix\",\"\")","v":""}]
[]
[]
[]
[]
[null,null," ","TOTAL","TOTAL","BASELOAD","BASELOAD","WTHR-SENS.","WTHR-SENS."]
[null,null,"RATES","KWHS","REVENUE","KWHS","REVENUE","KWHS","REVENUE"]
[]
[null,"PRESENT BASELOAD AND WEATHER-SENSITIVE RATES"]
[null,"SCHEDULE 21"]
[null,"0-250000 KWHS",{"$f":"G62","v":7.9269999999999996},{"$f":"G8","v":1176388254.2851541},{"$f":"C274*D274/100","v":93252296.917184159},{"$f":"MIN(D274,F277)","v":1176388254.2851541},{"$f":"F274*C274/100","v":93252296.917184159},{"$f":"D274-F274","v":0},{"$f":"H274*C274/100","v":0}]
[null,"OVER 250000 KWHS",{"$f":"G63","v":7.0919999999999996},{"$f":"G9","v":143363345.501926},{"$f":"C275*D275/100","v":10167328.462996591},{"$f":"MIN(F277-F274,D275)","v":143363345.501926},{"$f":"F275*C275/100","v":10167328.462996591},{"$f":"D275-F275","v":0},{"$f":"H275*C275/100","v":0}]
[]
[null,"TOTAL",null,{"$f":"D274+D275","v":1319751599.78708},{"$f":"E274+E275","v":103419625.38018075},{"$f":"62686*G25","v":1375456212},{"$f":"G274+G275","v":103419625.38018075},{"$f":"H274+H275","v":0},{"$f":"I274+I275","v":0}]
[null,"AVERAGE RATE",null,null,{"$f":"E277/D277*100","v":7.8362947540177847},null,{"$f":"G277/F277*100","v":7.518932589631631},null,{"$f":"I277/H277*100","v":{"$error":"#DIV/0!"}}]
[]
[null,"PROPOSED BASELOAD AND WEATHER-SENSITIVE RATES"]
[null,"SCHEDULE 21"]
[null,"0-250000 KWHS",{"$f":"G79","v":8.1669999999999998},{"$f":"D274","v":1176388254.2851541},{"$f":"C282*D282/100","v":96075628.727468535},{"$f":"MIN(D282,F285)","v":1176388254.2851541},{"$f":"F282*C282/100","v":96075628.727468535},{"$f":"H274","v":0},{"$f":"H282*C282/100","v":0}]
[null,"OVER 250000 KWHS",{"$f":"G80","v":7.3070000000000004},{"$f":"D275","v":143363345.501926},{"$f":"C283*D283/100","v":10475559.655825734},{"$f":"MIN(F285-F282,D283)","v":143363345.501926},{"$f":"F283*C283/100","v":10475559.655825734},{"$f":"H275","v":0},{"$f":"H283*C283/100","v":0}]
[]
[null,"TOTAL",null,{"$f":"D282+D283","v":1319751599.78708},{"$f":"E282+E283","v":106551188.38329427},{"$f":"F277","v":1375456212},{"$f":"G282+G283","v":106551188.38329427},{"$f":"H282+H283","v":0},{"$f":"I282+I283","v":0}]
[null,"AVERAGE RATE",null,null,null,null,{"$f":"G285/F285*100","v":7.7466070859763771},null,{"$f":"I285/H285*100","v":{"$error":"#DIV/0!"}}]
[]
[]
[]
[]
[]
[]
[]
[null,"Note:  Total Base Load for Sch. 21 = Base Load per bill times total billings (base load per bill on JDM-E-18) ="]
[null,{"$f":"\"62,686 X \"&TEXT(G25,\"#,##0\")&\" = \"&TEXT(F277,\"#,##0\")","v":"62,686 X 21,942 = 1,375,456,212"}]
[]
[]
[]
[null,null,null,{"$f":"D207/D48","v":2.3557341681235409},{"$f":"E207/E48","v":4.7583483627230665},{"$f":"G207/G48","v":140.6939958141399},{"$f":"I207/I48","v":1666.4565650793827},{"$f":"K207/K48","v":11.938385150506026}]
[null,null,null,{"$f":"D23/D25","v":932.07343783636134},{"$f":"E23/E25","v":1573.8082514574505},{"$f":"G23/G25","v":59263.454187725823},{"$f":"I23/I25","v":2228141.7272222219},{"$f":"K23/K25","v":5383.1685749978569}]
[null,null,null,{"$f":"D300*-#REF!","v":{"$error":"#REF!"}},{"$f":"E300*-#REF!","v":{"$error":"#REF!"}},{"$f":"F300*-#REF!","v":{"$error":"#REF!"}},{"$f":"G300*-#REF!","v":{"$error":"#REF!"}},{"$f":"H300*-#REF!","v":{"$error":"#REF!"}}]
[null,null,null,{"$f":"(800*((D79-D62)/100))+(118*((D80-D63)/100))+(D76-D59)","v":2.2009599999999958}]
[]
[]
[null,null,null,{"$f":"D299+D301","v":{"$error":"#REF!"}},{"$f":"E299+E301","v":{"$error":"#REF!"}},{"$f":"F299+F301","v":{"$error":"#REF!"}},{"$f":"G299+G301","v":{"$error":"#REF!"}},{"$f":"H299+H301","v":{"$error":"#REF!"}}]

{"sheet":"Rate Design","index":1,"n_rows":127,"n_cols":29,"rows_kept":127,"cut":false,"hidden":false,"merged":[]}
["PRESENT RATES",null,null,1,2,3,4,5,6,7,8,9,null,null,null,null,"Tiers - used for bill comparisons"]
[null,null,"TOTAL","SCH. 1,2","SCH. 11,12","SCH. 13","SCH. 21,22","SCH. 23","SCH. 25","SCH. 25I","SCH. 30, 31, 32",null,null,null,"Range Name",null,"SCHEDULE 1,2","SCH. 11,12","SCH. 13","SCH. 21,22","SCH. 23","SCHEDULE 25","SCHEDULE 25I","SCH. 30, 31, 32"]
[null,"Base Tariff Rates"]
[1,"BASIC CHARGE",null,9,21,21,0,600,0,0,21]
[2,"BLOCK 1 PER KWH",null,9.4860000000000007,12.379,21.89,7.9269999999999996,16.783999999999999,5.9059999999999997,4.782,11.763,null,null,null,null,null,800,3650,3650,250000,250000,500000,500000]
[3,"BLOCK 2 PER KWH",null,11.035,9.0960000000000001,8.9060000000000006,7.0919999999999996,6.9279999999999999,5.3129999999999997,4.3029999999999999,8.4009999999999998,null,null,null,null,null,1500,9999999,9999999,9999999,9999999,9999999,9999999]
[4,"BLOCK 3 PER KWH",null,12.94,0,0,0,0,4.3520000000000003,3.6789999999999998,0,null,null,null,"Rates_Base_Present",null,9999999,9999999,9999999,9999999,9999999,9999999,9999999]
[5,"BLOCK 4 PER KWH"]
[6,"DEMAND CHARGE",null,0,0,0,600,0,30650,30650,0]
[7,"DEMAND BLOCK 1",null,0,7.5,0,7.5,0,8.3000000000000007,8.3000000000000007,0,null,null,null,null,null,0,20,20,50,50,3000,3000]
[]
[null,"Billing Rates",null,{"$f":"IF(D13<>'Pres & Prop Rev'!D$5,#VALUE!,\"\")","v":""},{"$f":"IF(E13<>'Pres & Prop Rev'!E$5,#VALUE!,\"\")","v":""},{"$f":"IF(F13<>'Pres & Prop Rev'!F$5,#VALUE!,\"\")","v":""},{"$f":"IF(G13<>'Pres & Prop Rev'!G$5,#VALUE!,\"\")","v":""},{"$f":"IF(H13<>'Pres & Prop Rev'!H$5,#VALUE!,\"\")","v":""},{"$f":"IF(I13<>'Pres & Prop Rev'!I$5,#VALUE!,\"\")","v":""},{"$f":"IF(J13<>'Pres & Prop Rev'!J$5,#VALUE!,\"\")","v":""},{"$f":"IF(K13<>'Pres & Prop Rev'!K$5,#VALUE!,\"\")","v":""}]
[null,null,null,"SCHEDULE 1,2","SCH. 11,12","SCH. 13","SCH. 21,22","SCH. 23","SCHEDULE 25","SCHEDULE 25I","SCH. 30, 31, 32"]
[1,"BASIC CHARGE",null,{"$f":"D4","v":9},21,21,0,600,0,0,21]
[2,"BLOCK 1 PER KWH",null,{"$f":"D5-0.417-0.045-0.428+0.255+0.153-0.015-0.509","v":8.48},{"$f":"E5+0.679-0.267+0.321+0.222-0.015","v":13.318999999999999},{"$f":"F5+0.679-0.267+0.321+0.222-0.015","v":22.830000000000002},{"$f":"G5+0.679-0.192+0.273+0.16-0.016","v":8.8309999999999995},{"$f":"H5+0.679-0.192+0.273+0.16-0.016","v":17.687999999999999},{"$f":"I5-0.25+0.182+0.101-0.016","v":5.923},{"$f":"J5-0.25+0.182+0.101-0.016","v":4.7990000000000004},{"$f":"K5+0.679-0.365+0.236+0.139-0.016-0.448","v":11.988},null,null,null,null,null,{"$f":"Q5","v":800},3650,3650,250000,250000,500000,500000]
[3,"BLOCK 2 PER KWH",null,{"$f":"D6-0.417-0.045-0.496+0.255+0.153-0.015-0.509","v":9.9610000000000003},{"$f":"E6+0.679-0.2+0.321+0.222-0.015","v":10.103},{"$f":"F6+0.679-0.2+0.321+0.222-0.015","v":9.9130000000000003},{"$f":"G6+0.679-0.173+0.273+0.16-0.016","v":8.0149999999999988},{"$f":"H6+0.679-0.173+0.273+0.16-0.016","v":7.851},{"$f":"I6-0.225+0.182+0.101-0.016","v":5.3550000000000004},{"$f":"J6-0.225+0.182+0.101-0.016","v":4.3450000000000006},{"$f":"K6+0.679-0.264+0.236+0.139-0.016-0.448","v":8.7270000000000003},null,null,null,null,null,{"$f":"Q6","v":1500},9999999,{"$f":"S6","v":9999999},9999999,{"$f":"U6","v":9999999},9999999,{"$f":"W6","v":9999999}]
[4,"BLOCK 3 PER KWH",null,{"$f":"D7-0.417-0.045-0.58+0.255+0.153-0.015-0.509","v":11.782},null,null,null,null,{"$f":"I7+0.182-0.016","v":4.5180000000000007},{"$f":"J7+0.182-0.016","v":3.8449999999999998},null,null,null,null,"Rates_Billing_Present",null,9999999,9999999,{"$f":"S7","v":9999999},9999999,{"$f":"U7","v":9999999},9999999,{"$f":"W7","v":9999999}]
[5,"BLOCK 4 PER KWH"]
[6,"DEMAND CHARGE",null,null,null,null,{"$f":"G9","v":600},0,30650,30650]
[7,"DEMAND BLOCK 1",null,null,{"$f":"E10","v":7.5},{"$f":"F10","v":0},7.5,0,8.3000000000000007,8.3000000000000007,null,null,null,null,null,null,{"$f":"Q10","v":0},20,20,50,50,3000,3000]
[]
["PROPOSED RATES"]
[]
[null,"Base Tariff Rates",null,{"$f":"IF(D25<>'Pres & Prop Rev'!D$5,#VALUE!,\"\")","v":""},{"$f":"IF(E25<>'Pres & Prop Rev'!E$5,#VALUE!,\"\")","v":""},{"$f":"IF(F25<>'Pres & Prop Rev'!F$5,#VALUE!,\"\")","v":""},{"$f":"IF(G25<>'Pres & Prop Rev'!G$5,#VALUE!,\"\")","v":""},{"$f":"IF(H25<>'Pres & Prop Rev'!H$5,#VALUE!,\"\")","v":""},{"$f":"IF(I25<>'Pres & Prop Rev'!I$5,#VALUE!,\"\")","v":""},{"$f":"IF(J25<>'Pres & Prop Rev'!J$5,#VALUE!,\"\")","v":""},{"$f":"IF(K25<>'Pres & Prop Rev'!K$5,#VALUE!,\"\")","v":""}]
[null,null,null,"SCHEDULE 1,2","SCH. 11,12","SCH. 13","SCH. 21,22","SCH. 23","SCHEDULE 25","SCHEDULE 25I","SCH. 30, 31, 32",null,null,null,null,null,null,null,null,null,null,null,null,null,null,"Rounding"]
[1,"BASIC CHARGE",null,{"$f":"ROUND(D62,$Z26)","v":9},21,21,0,600,0,0,21,null,null,null,null,null,null,null,null,null,null,null,null,null,null,2,2]
[2,"BLOCK 1 PER KWH",null,{"$f":"ROUND(D85,$Z27)","v":9.7210000000000001},{"$f":"ROUND(E85,$Z27)","v":12.708},{"$f":"ROUND(F85,$Z27)","v":22.472000000000001},8.1669999999999998,{"$f":"ROUND(H85,$Z27)","v":17.292000000000002},5.9870000000000001,{"$f":"ROUND(J85,$Z27)","v":4.843},12.039,null,null,null,null,null,800,3650,3650,250000,250000,500000,500000,null,null,3,3]
[3,"BLOCK 2 PER KWH",null,11.307,{"$f":"ROUND(E86,$Z28)","v":9.3379999999999992},{"$f":"ROUND(F86,$Z28)","v":9.1430000000000007},7.3070000000000004,{"$f":"ROUND(H86,$Z28)","v":7.1379999999999999},5.3860000000000001,{"$f":"ROUND(J86,$Z28)","v":4.3579999999999997},8.5980000000000008,null,null,null,null,null,1500,9999999,9999999,9999999,9999999,6000000,6000000,null,null,3,3]
[4,"BLOCK 3 PER KWH",null,13.26,0,{"$f":"ROUND(F87,$Z29)","v":0},0,{"$f":"ROUND(H87,$Z29)","v":0},4.4119999999999999,{"$f":"ROUND(J87,$Z29)","v":3.726},0,null,null,null,"Rates_Base_Proposed",null,9999999,9999999,9999999,9999999,9999999,99999999,99999999,null,null,3,3]
[5,"BLOCK 4 PER KWH",null,null,null,null,null,null,null,null,null,null,null,null,null,null,null,null,null,null,null,null,null,null,null,3,3]
[6,"DEMAND CHARGE",null,{"$f":"ROUND(D66,$Z31)","v":0},0,0,600,0,30650,30650,0,null,null,null,null,null,null,null,null,null,null,null,null,null,null,2,2]
[7,"DEMAND BLOCK 1",null,{"$f":"ROUND(D69,$Z32)","v":0},7.5,0,7.5,0,8.3000000000000007,8.3000000000000007,0,null,null,null,null,null,0,20,20,50,50,3000,3000,null,null,2,2]
[]
[null,"Billing Rates",null,{"$f":"IF(D35<>'Pres & Prop Rev'!D$5,#VALUE!,\"\")","v":""},{"$f":"IF(E35<>'Pres & Prop Rev'!E$5,#VALUE!,\"\")","v":""},{"$f":"IF(F35<>'Pres & Prop Rev'!F$5,#VALUE!,\"\")","v":""},{"$f":"IF(G35<>'Pres & Prop Rev'!G$5,#VALUE!,\"\")","v":""},{"$f":"IF(H35<>'Pres & Prop Rev'!H$5,#VALUE!,\"\")","v":""},{"$f":"IF(I35<>'Pres & Prop Rev'!I$5,#VALUE!,\"\")","v":""},{"$f":"IF(J35<>'Pres & Prop Rev'!J$5,#VALUE!,\"\")","v":""},{"$f":"IF(K35<>'Pres & Prop Rev'!K$5,#VALUE!,\"\")","v":""}]
[null,null,null,"SCHEDULE 1,2","SCH. 11,12","SCH. 13","SCH. 21,22","SCH. 23","SCHEDULE 25","SCHEDULE 25I","SCH. 30, 31, 32",null,null,null,null,null,null,null,null,null,null,null,null,null,"LIRAP/DSM increase"]
[1,"BASIC CHARGE",null,{"$f":"D26","v":9},21,21,0,{"$f":"H26","v":600},0,0,21,null,null,null,null,null,null,null,null,null,null,null,null,null,1,11,21,25,31]
[2,"BLOCK 1 PER KWH",null,{"$f":"D27-0.417-0.045-0.428+0.255+0.153-0.015-0.509","v":8.7149999999999999},{"$f":"E27+0.679-0.267+0.321+0.222-0.015","v":13.648},{"$f":"F27+0.679-0.267+0.321+0.222-0.015","v":23.412000000000003},{"$f":"G27+0.679-0.192+0.273+0.16-0.016","v":9.0709999999999997},{"$f":"H27+0.679-0.192+0.273+0.16-0.016","v":18.196000000000002},{"$f":"I27-0.25+0.182+0.101-0.016","v":6.0040000000000004},{"$f":"J27-0.25+0.182+0.101-0.016","v":4.8600000000000003},{"$f":"K27+0.679-0.365+0.236+0.139-0.016-0.448","v":12.263999999999999},null,null,null,null,null,{"$f":"Q27","v":800},3650,{"$f":"S27","v":3650},250000,{"$f":"U27","v":250000},500000,{"$f":"W27","v":500000},null,0,0,0,0,0]
[3,"BLOCK 2 PER KWH",null,{"$f":"D28-0.417-0.045-0.496+0.255+0.153-0.015-0.509","v":10.233000000000001},{"$f":"E28+0.679-0.2+0.321+0.222-0.015","v":10.344999999999999},{"$f":"F28+0.679-0.2+0.321+0.222-0.015","v":10.15},{"$f":"G28+0.679-0.173+0.273+0.16-0.016","v":8.23},{"$f":"H28+0.679-0.173+0.273+0.16-0.016","v":8.0609999999999999},{"$f":"I28-0.225+0.182+0.101-0.016","v":5.4280000000000008},{"$f":"J28-0.225+0.182+0.101-0.016","v":4.4000000000000004},{"$f":"K28+0.679-0.264+0.236+0.139-0.016-0.448","v":8.9240000000000013},null,null,null,null,null,1500,9999999,{"$f":"S28","v":9999999},9999999,{"$f":"U28","v":9999999},6000000,{"$f":"W28","v":6000000},null,{"$f":"Y$37","v":0},{"$f":"Z$37","v":0},{"$f":"AA$37","v":0},{"$f":"AB$37","v":0},{"$f":"AC$37","v":0}]
[4,"BLOCK 3 PER KWH",null,{"$f":"D29-0.417-0.045-0.58+0.255+0.153-0.015-0.509","v":12.102},null,null,null,null,{"$f":"I29+0.182-0.016","v":4.5780000000000003},{"$f":"J29+0.182-0.016","v":3.8919999999999999},null,null,null,null,"Rates_Billing_Proposed",null,9999999,9999999,{"$f":"S29","v":9999999},9999999,{"$f":"U29","v":9999999},99999999,{"$f":"W29","v":99999999},null,{"$f":"Y$37","v":0},0,0,0,0]
[5,"BLOCK 4 PER KWH",null,null,null,null,null,null,null,null,null,null,null,null,null,null,null,null,null,null,null,null,null,null,0,0,0,0,0]
[6,"DEMAND CHARGE",null,null,null,null,{"$f":"G31","v":600},0,30650,30650]
[7,"DEMAND BLOCK 1",null,null,{"$f":"E32","v":7.5},{"$f":"F32","v":0},7.5,0,8.3000000000000007,8.3000000000000007,null,null,null,null,null,null,{"$f":"Q32","v":0},20,20,50,50,3000,3000]
[]
[]
[null,null,null,0,"0) ERM=0; 1) ERM as is"]
[]
[" ","Proposed Rate Workup - from Pres & Prop Rev tab"]
[]
[null,"KILOWATT HOURS (KWHS)"]
[null,"BLOCK 1",{"$f":"SUM(D50:K50)","v":3499716213.8109899},{"$f":"'Pres & Prop Rev'!D31","v":1699114425.539248},{"$f":"'Pres & Prop Rev'!E31","v":440976955.79465711},{"$f":"'Pres & Prop Rev'!F31","v":0},{"$f":"'Pres & Prop Rev'!G31","v":1176388254.2851541},{"$f":"'Pres & Prop Rev'!H31","v":0},{"$f":"'Pres & Prop Rev'!I31","v":125726244.40000001},{"$f":"'Pres & Prop Rev'!J31","v":6000000},{"$f":"'Pres & Prop Rev'!K31","v":51510333.791929998}]
[null,"BLOCK 2",{"$f":"SUM(D51:K51)","v":1524106258.643662},{"$f":"'Pres & Prop Rev'!D32","v":560062332.55344331},{"$f":"'Pres & Prop Rev'!E32","v":206157623.47196287},{"$f":"'Pres & Prop Rev'!F32","v":0},{"$f":"'Pres & Prop Rev'!G32","v":143363345.501926},{"$f":"'Pres & Prop Rev'!H32","v":0},{"$f":"'Pres & Prop Rev'!I32","v":435765470.8599999},{"$f":"'Pres & Prop Rev'!J32","v":66000000},{"$f":"'Pres & Prop Rev'!K32","v":112757486.25633}]
[null,"BLOCK 3",{"$f":"SUM(D52:K52)","v":701738754.28427863},{"$f":"'Pres & Prop Rev'!D33","v":314000634.28427869},{"$f":"'Pres & Prop Rev'!E33","v":0},{"$f":"'Pres & Prop Rev'!F33","v":0},{"$f":"'Pres & Prop Rev'!G33","v":0},{"$f":"'Pres & Prop Rev'!H33","v":0},{"$f":"'Pres & Prop Rev'!I33","v":0},{"$f":"'Pres & Prop Rev'!J33","v":387738120},{"$f":"'Pres & Prop Rev'!K33","v":0}]
[null,"ADJ. TO ACTUAL/EE ADJ",{"$f":"SUM(D53:K53)","v":0},{"$f":"'Pres & Prop Rev'!D41+'Pres & Prop Rev'!D38","v":0},{"$f":"'Pres & Prop Rev'!E41+'Pres & Prop Rev'!E38","v":0},{"$f":"'Pres & Prop Rev'!F41+'Pres & Prop Rev'!F38","v":0},{"$f":"'Pres & Prop Rev'!G41+'Pres & Prop Rev'!G38","v":0},{"$f":"'Pres & Prop Rev'!H41+'Pres & Prop Rev'!H38","v":0},{"$f":"'Pres & Prop Rev'!I41+'Pres & Prop Rev'!I38","v":0},{"$f":"'Pres & Prop Rev'!J41+'Pres & Prop Rev'!J38","v":0},{"$f":"'Pres & Prop Rev'!K41+'Pres & Prop Rev'!K38","v":0}]
[null,"WEATHER & U/B KWHS",{"$f":"SUM(D54:K54)","v":-106488975},{"$f":"'Pres & Prop Rev'!D44","v":-73774001},{"$f":"'Pres & Prop Rev'!E44","v":-12331152},{"$f":"'Pres & Prop Rev'!F44","v":0},{"$f":"'Pres & Prop Rev'!G44","v":-19392888},{"$f":"'Pres & Prop Rev'!H44","v":0},{"$f":"'Pres & Prop Rev'!I44","v":0},{"$f":"'Pres & Prop Rev'!J44","v":0},{"$f":"'Pres & Prop Rev'!K44","v":-990934}]
[null,"TOTAL PROFORMA KWHS",{"$f":"IF(ROUND(SUM(D55:L55),3)<>ROUND(SUM(C50:C54),3),#VALUE!,SUM(D55:L55))","v":5619072251.7389297},{"$f":"SUM(D50:D54)","v":2499403391.3769703},634803427.26661992,0,1300358711.78708,0,561491715.25999987,459738120,163276886.04826]
[null,"TOTAL BILLS",null,{"$f":"'Pres & Prop Rev'!D48","v":2681552},{"$f":"'Pres & Prop Rev'!E48","v":403355},{"$f":"'Pres & Prop Rev'!F48","v":0},{"$f":"'Pres & Prop Rev'!G48","v":21942},{"$f":"'Pres & Prop Rev'!H48","v":0},{"$f":"'Pres & Prop Rev'!I48","v":252},{"$f":"'Pres & Prop Rev'!J48","v":12},{"$f":"'Pres & Prop Rev'!K48","v":30331}]
[null,"EXCESS DEMAND",null,{"$f":"'Pres & Prop Rev'!D50","v":0},{"$f":"'Pres & Prop Rev'!E50","v":555536.70615384611},{"$f":"'Pres & Prop Rev'!F50","v":0},{"$f":"'Pres & Prop Rev'!G50","v":2822572.7138461536},{"$f":"'Pres & Prop Rev'!H50","v":0},{"$f":"'Pres & Prop Rev'!I50","v":475862.63199999998},{"$f":"'Pres & Prop Rev'!J50","v":703831.30999999994},{"$f":"'Pres & Prop Rev'!K50","v":0}]
[null,null,null,null,null,null,null,null,null,null,null,null,"Proposed rates:","Formulas to copy"]
[null,"Proposed Revenue",{"$f":"SUM(D59:L59)","v":593378710.75086129},{"$f":"'Rate Spread GRC'!H15*1000","v":285809196.53587133},{"$f":"'Rate Spread GRC'!H17*1000","v":86753893.558005273},{"$f":"'Rate Spread GRC'!H19*1000","v":0},{"$f":"'Rate Spread GRC'!H21*1000","v":139486068.96847069},{"$f":"'Rate Spread GRC'!H23*1000","v":0},{"$f":"'Rate Spread GRC'!H25*1000","v":42460823.954719298},{"$f":"'Rate Spread GRC'!H27*1000","v":22430279.788308769},{"$f":"'Rate Spread GRC'!H29*1000","v":16438447.945485961},null,"same as current","FLOOR","CEILING","OTHER"]
[null,"Targeted Rate Increase",{"$f":"'Rate Spread GRC'!F33","v":2.1251048572672047E-2},{"$f":"'Rate Spread GRC'!F15","v":2.2630209239662587E-2},{"$f":"'Rate Spread GRC'!F17","v":2.262587999048473E-2},{"$f":"'Rate Spread GRC'!F19","v":0},{"$f":"'Rate Spread GRC'!F21","v":2.2627153701658746E-2},{"$f":"'Rate Spread GRC'!F23","v":0},{"$f":"'Rate Spread GRC'!F25","v":9.9979378409112418E-3},{"$f":"'Rate Spread GRC'!F27","v":1.0003924772924782E-2},{"$f":"'Rate Spread GRC'!F31","v":2.2620858799968856E-2},null,"diff than current"]
[null,"Present Basic Charge",null,{"$f":"D4","v":9},21,21,0,600,0,0,{"$f":"K4","v":21}]
[null,"BASIC CHARGE",null,9,21,21,0,600,0,0,21,null,null,{"$f":"FLOOR(N61*(1+N$60),$N63)","v":0},{"$f":"CEILING(O61*(1+O$60),$O63)","v":0},{"$f":"P61*(1+P$60)","v":0}]
[null,"% D in Basic Charge",null,{"$f":"IF(D61,D62/D61-1,0)","v":0},0,0,0,0,0,0,0,null,null,0.05,0.05]
[null,"Basic Charge Revenue",{"$f":"SUM(D64:L64)","v":33241374},{"$f":"D56*D62","v":24133968},8470455,0,0,0,0,0,636951]
[null,"Present Demand Block 1",null,{"$f":"D9","v":0},0,0,600,0,30650,30650,0]
[null,"DEMAND BLOCK 1",null,null,null,null,600,null,30650,30650,null,null,null,{"$f":"FLOOR(N65*(1+N$60),$N67)","v":0},{"$f":"CEILING(O65*(1+O$60),$O67)","v":0},{"$f":"P65*(1+P$60)","v":0}]
[null,"% D in Demand Block 1",null,{"$f":"IF(D65,D66/D65-1,0)","v":0},0,0,0,0,0,0,0,null,null,5,10]
[null,"Present Demand Block 2",null,{"$f":"D10","v":0},{"$f":"E10","v":7.5},0,{"$f":"G10","v":7.5},0,8.3000000000000007,8.3000000000000007,{"$f":"K10","v":0}]
[null,"DEMAND BLOCK 2",null,null,7.5,null,7.5,null,8.3000000000000007,8.3000000000000007,0,null,null,{"$f":"FLOOR(N68*(1+N$60),$N70)","v":0},{"$f":"CEILING(O68*(1+O$60),$O70)","v":0},{"$f":"P68*(1+P$60)","v":0}]
[null,"% D in Demand Block 2",null,{"$f":"IF(D68,D69/D68-1,0)","v":0},0,0,0,0,0,0,0,null,null,0.05,0.05]
[null,"Demand Revenue",{"$f":"SUM(D71:L71)","v":56384080.368599996},{"$f":"D56*D66+D57*D69","v":0},4166525.2961538457,0,34334495.353846148,0,11673459.8456,6209599.8729999997,0]
[null,"Pwr Fctr/Prim Voltg Disc",{"$f":"SUM(D72:L72)","v":-1489894.6042000002},{"$f":"'Pres & Prop Rev'!D172+'Pres & Prop Rev'!D173","v":0},{"$f":"'Pres & Prop Rev'!E172+'Pres & Prop Rev'!E173","v":0},{"$f":"'Pres & Prop Rev'!F172+'Pres & Prop Rev'!F173","v":0},{"$f":"'Pres & Prop Rev'!G172+'Pres & Prop Rev'!G173","v":113744.90000000001},{"$f":"'Pres & Prop Rev'!H172+'Pres & Prop Rev'!H173","v":0},{"$f":"'Pres & Prop Rev'!I172+'Pres & Prop Rev'!I173","v":-210365.71260000006},{"$f":"'Pres & Prop Rev'!J172+'Pres & Prop Rev'!J173","v":-1393273.7916000001},{"$f":"'Pres & Prop Rev'!K172+'Pres & Prop Rev'!K173","v":0}]
[]
[null,"Present Block 1 Base Rate",null,{"$f":"D5","v":9.4860000000000007},12.379,21.89,7.9269999999999996,16.783999999999999,5.9059999999999997,4.782,11.763]
[null,"Present Block 2 Base Rate",null,{"$f":"D6","v":11.035},9.0960000000000001,{"$f":"F6","v":8.9060000000000006},7.0919999999999996,{"$f":"H6","v":6.9279999999999999},5.3129999999999997,{"$f":"J6","v":4.3029999999999999},8.4009999999999998]
[null,"Present Block 3 Base Rate",null,12.94,0,{"$f":"F7","v":0},0,{"$f":"H7","v":0},4.3520000000000003,{"$f":"J7","v":3.6789999999999998},0]
[]
[null,"1) Flat Rate Increase",null,1,1,1,1,1,1,1,1]
[null,"2) % Rate Increase",null,2.4750070885854129E-2,2.6566609857955517E-2,{"$f":"E79","v":2.6566609857955517E-2},3.0250112957949497E-2,{"$f":"G79","v":3.0250112957949497E-2},1.372899905798299E-2,1.2764646621950086E-2,2.3513358076098161E-2,null,null,null,null,{"$f":"P$60","v":0}]
[null,"Method --->",null,2,2,2,2,2,2,2,2]
[]
["Calculated","BLOCK 1 PER KWH",null,{"$f":"CHOOSE(D$80,D74+D$78,D74*(1+D$79))","v":9.7207791724232138},{"$f":"CHOOSE(E$80,E74+E$78,E74*(1+E$79))","v":12.707868063431631},{"$f":"CHOOSE(F$80,F74+F$78,F74*(1+F$79))","v":22.471543089790647},8.1667926454176651,17.291717895886226,5.9870834684364471,4.8430405401461645,{"$f":"CHOOSE(K$80,K74+K$78,K74*(1+K$79))","v":12.039587631049143}]
[null,"BLOCK 2 PER KWH",null,{"$f":"CHOOSE(D$80,D75+D$78,D75*(1+D$79))","v":11.3081170322254},{"$f":"CHOOSE(E$80,E75+E$78,E75*(1+E$79))","v":9.3376498832679644},{"$f":"CHOOSE(F$80,F75+F$78,F75*(1+F$79))","v":9.1426022273949528},7.3065338010977774,{"$f":"CHOOSE(H$80,H75+H$78,H75*(1+H$79))","v":7.1375727825726747},{"$f":"CHOOSE(I$80,I75+I$78,I75*(1+I$79))","v":5.3859421719950635},{"$f":"CHOOSE(J$80,J75+J$78,J75*(1+J$79))","v":4.3579262744142504},{"$f":"CHOOSE(K$80,K75+K$78,K75*(1+K$79))","v":8.598535721197301},null,null,null,null,{"$f":"0.75*P82","v":0}]
[null,"BLOCK 3 PER KWH",null,{"$f":"CHOOSE(D$80,D76+D$78,D76*(1+D$79))","v":13.260265917262952},0,{"$f":"CHOOSE(F$80,F76+F$78,F76*(1+F$79))","v":0},0,{"$f":"CHOOSE(H$80,H76+H$78,H76*(1+H$79))","v":0},{"$f":"CHOOSE(I$80,I76+I$78,I76*(1+I$79))","v":4.4117486039003424},{"$f":"CHOOSE(J$80,J76+J$78,J76*(1+J$79))","v":3.7259611349221538},0]
["Input","BLOCK 1 PER KWH",null,{"$f":"D82","v":9.7207791724232138},{"$f":"E82","v":12.707868063431631},{"$f":"F82","v":22.471543089790647},{"$f":"G82","v":8.1667926454176651},17.291717895886226,{"$f":"I82","v":5.9870834684364471},4.8430405401461645,{"$f":"K82-0.001","v":12.038587631049143},null,null,null,null,{"$f":"P82","v":0}]
[null,"BLOCK 2 PER KWH",null,{"$f":"D83-0.001","v":11.307117032225401},{"$f":"E83","v":9.3376498832679644},{"$f":"F83","v":9.1426022273949528},{"$f":"G83","v":7.3065338010977774},7.1375727825726747,5.3859421719950635,4.3579262744142504,{"$f":"K83-0.001","v":8.5975357211973016},null,{"$f":"I86-I85","v":-0.60114129644138359},null,null,{"$f":"P83","v":0},{"$f":"0.75*(Q85-Q74)+Q75","v":0}]
[null,"BLOCK 3 PER KWH",null,{"$f":"D84","v":13.260265917262952},{"$f":"E84","v":0},{"$f":"F84","v":0},0,{"$f":"H84","v":0},4.4117486039003424,{"$f":"J84","v":3.7259611349221538},0,null,{"$f":"I87-I86","v":-0.97419356809472113},null,null,{"$f":"P84","v":0}]
[null,"Blocks 1-3 Revenue",{"$f":"SUM(D88:L88)","v":516475189.94847399},{"$f":"SUMPRODUCT(D50:D52,D85:D87)/100","v":270131383.67667449},{"$f":"SUMPRODUCT(E50:E52,E85:E87)/100","v":75289046.819999993},0,106548080.73000003,0,30997411.460000001,17613785.429999996,15895481.831799522]
[null,"Adj. to Actual Revenue",{"$f":"SUM(D89:L89)","v":0},{"$f":"'Pres & Prop Rev'!D181+'Pres & Prop Rev'!D178","v":0},{"$f":"'Pres & Prop Rev'!E181+'Pres & Prop Rev'!E178","v":0},{"$f":"'Pres & Prop Rev'!F181+'Pres & Prop Rev'!F178","v":0},{"$f":"'Pres & Prop Rev'!G181+'Pres & Prop Rev'!G178","v":0},{"$f":"'Pres & Prop Rev'!H181+'Pres & Prop Rev'!H178","v":0},{"$f":"'Pres & Prop Rev'!I181+'Pres & Prop Rev'!I178+'Pres & Prop Rev'!I174","v":0},{"$f":"'Pres & Prop Rev'!J181+'Pres & Prop Rev'!J178+'Pres & Prop Rev'!J174","v":0},{"$f":"'Pres & Prop Rev'!K181+'Pres & Prop Rev'!K178","v":0}]
[null,"Weather & U/B Revenue",{"$f":"SUM(D90:L90)","v":-11248253.660000002},{"$f":"'Pres & Prop Rev'!D202","v":-8466183.7400000002},{"$f":"'Pres & Prop Rev'!E202","v":-1173587.4100000001},{"$f":"'Pres & Prop Rev'!F202","v":0},{"$f":"'Pres & Prop Rev'!G202","v":-1512589.7000000002},{"$f":"'Pres & Prop Rev'!H202","v":0},{"$f":"'Pres & Prop Rev'!I202","v":0},{"$f":"'Pres & Prop Rev'!J202","v":0},{"$f":"'Pres & Prop Rev'!K202","v":-95892.81}]
[]
[" ","Revenue Remaining",{"$f":"IF(ROUND(C59-C64-C71-C72-SUM(C88:C90),3)<>ROUND(SUM(D92:L92),3),#VALUE!,SUM(D92:L92))","v":16214.697987301275},{"$f":"D59-D64-D71-D72-SUM(D88:D90)","v":10028.599196851254},{"$f":"E59-E64-E71-E72-SUM(E88:E90)","v":1453.8518514335155},0,2337.6846245080233,{"$f":"H59-H64-H71-H72-SUM(H88:H90)","v":0},318.3617192953825,168.27690877392888,1907.9236864391714,null,"there will be some remainder in Schs. 21 & 25 because some components of their revenue don't change w/a rate change."]
[null,"Revenue Remaining - ¢/kWh",{"$f":"C92/C55*100","v":2.885653940876686E-4},{"$f":"D92/D55*100","v":4.0123972110505545E-4},2.2902394489166675E-4,{"$f":"F92/F55*100","v":{"$error":"#DIV/0!"}},1.7977228923973974E-4,{"$f":"H92/H55*100","v":{"$error":"#DIV/0!"}},5.6699272784098777E-5,{"$f":"J92/J55*100","v":3.66027748088257E-5},1.1685203782458489E-3]
[null,"check - < $6k is rounding",{"$f":"SUM(D94:L94)","v":-7752.842926023528},{"$f":"D59-'Pres & Prop Rev'!D204-D92","v":-2261.6833255290985},{"$f":"E59-'Pres & Prop Rev'!E204-E92","v":-1303.6038461625576},{"$f":"F59-'Pres & Prop Rev'!F204-F92","v":0},{"$f":"G59-'Pres & Prop Rev'!G204-G92","v":-3107.6561538428068},{"$f":"H59-'Pres & Prop Rev'!H204-H92","v":0},{"$f":"I59-'Pres & Prop Rev'!I204-I92","v":-147.05440000444651},{"$f":"J59-'Pres & Prop Rev'!J204-J92","v":-196.91700000688434},{"$f":"K59-'Pres & Prop Rev'!K204-K92","v":-735.92820047773421}]
[{"$f":"IF(Base1_Billing2=2,\"MAKE SURE TO CHANGE Base1_Billing2 to '1' before designing Base Rates\",\"\")","v":""}]
[null,"Proposed Target",{"$f":"SUM(D96:L96)","v":593378710.75086129},{"$f":"D59","v":285809196.53587133},{"$f":"E59","v":86753893.558005273},0,139486068.96847069,0,42460823.954719298,{"$f":"J59","v":22430279.788308769},16438447.945485961]
[null,"Proposed Actual",{"$f":"SUM(D97:L97)","v":593370248.89580011},{"$f":"'Pres & Prop Rev'!D204","v":285801429.62},{"$f":"'Pres & Prop Rev'!E204","v":86753743.310000002},{"$f":"'Pres & Prop Rev'!F204","v":0},{"$f":"'Pres & Prop Rev'!G204","v":139486838.94000003},{"$f":"'Pres & Prop Rev'!H204","v":0},{"$f":"'Pres & Prop Rev'!I204","v":42460652.647400007},{"$f":"'Pres & Prop Rev'!J204","v":22430308.428400002},{"$f":"'Pres & Prop Rev'!K204","v":16437275.949999999}]
[null,null,{"$f":"SUM(D98:K98)","v":-8461.8550612777472},{"$f":"D97-D96","v":-7766.915871322155},-150.24800527095795,0,769.97152933478355,0,-171.30731929093599,28.640091232955456,-1171.9954859614372]
[null,"Rate D Check"]
[null,"Basic Charge",{"$f":"'Pres & Prop Rev'!C164/'Pres & Prop Rev'!C111-1","v":0},{"$f":"'Pres & Prop Rev'!D164/'Pres & Prop Rev'!D111-1","v":0},{"$f":"'Pres & Prop Rev'!E164/'Pres & Prop Rev'!E111-1","v":0},{"$f":"'Pres & Prop Rev'!F164/'Pres & Prop Rev'!F111-1","v":{"$error":"#DIV/0!"}},{"$f":"'Pres & Prop Rev'!G164/'Pres & Prop Rev'!G111-1","v":{"$error":"#DIV/0!"}},{"$f":"'Pres & Prop Rev'!H164/'Pres & Prop Rev'!H111-1","v":{"$error":"#DIV/0!"}},{"$f":"'Pres & Prop Rev'!I164/'Pres & Prop Rev'!I111-1","v":{"$error":"#DIV/0!"}},{"$f":"'Pres & Prop Rev'!J164/'Pres & Prop Rev'!J111-1","v":{"$error":"#DIV/0!"}},{"$f":"'Pres & Prop Rev'!K164/'Pres & Prop Rev'!K111-1","v":0}]
[null,"Demand Charge",{"$f":"SUM('Pres & Prop Rev'!C170:C171)/SUM('Pres & Prop Rev'!C117:C118)-1","v":2.4829915901136701E-11},{"$f":"SUM('Pres & Prop Rev'!D170:D171)/SUM('Pres & Prop Rev'!D117:D118)-1","v":{"$error":"#DIV/0!"}},{"$f":"SUM('Pres & Prop Rev'!E170:E171)/SUM('Pres & Prop Rev'!E117:E118)-1","v":9.2310825650088191E-10},{"$f":"SUM('Pres & Prop Rev'!F170:F171)/SUM('Pres & Prop Rev'!F117:F118)-1","v":{"$error":"#DIV/0!"}},{"$f":"SUM('Pres & Prop Rev'!G170:G171)/SUM('Pres & Prop Rev'!G117:G118)-1","v":-1.1201983785014136E-10},{"$f":"SUM('Pres & Prop Rev'!H170:H171)/SUM('Pres & Prop Rev'!H117:H118)-1","v":{"$error":"#DIV/0!"}},{"$f":"SUM('Pres & Prop Rev'!I170:I171)/SUM('Pres & Prop Rev'!I117:I118)-1","v":3.7692338139549975E-10},{"$f":"SUM('Pres & Prop Rev'!J170:J171)/SUM('Pres & Prop Rev'!J117:J118)-1","v":-4.8312287503904372E-10},{"$f":"SUM('Pres & Prop Rev'!K170:K171)/SUM('Pres & Prop Rev'!K117:K118)-1","v":{"$error":"#DIV/0!"}}]
[null,"Adj. to Actual Revenue",{"$f":"'Pres & Prop Rev'!C181/'Pres & Prop Rev'!C128-1","v":{"$error":"#DIV/0!"}},{"$f":"'Pres & Prop Rev'!D181/'Pres & Prop Rev'!D128-1","v":{"$error":"#DIV/0!"}},{"$f":"'Pres & Prop Rev'!E181/'Pres & Prop Rev'!E128-1","v":{"$error":"#DIV/0!"}},{"$f":"'Pres & Prop Rev'!F181/'Pres & Prop Rev'!F128-1","v":{"$error":"#DIV/0!"}},{"$f":"'Pres & Prop Rev'!G181/'Pres & Prop Rev'!G128-1","v":{"$error":"#DIV/0!"}},{"$f":"'Pres & Prop Rev'!H181/'Pres & Prop Rev'!H128-1","v":{"$error":"#DIV/0!"}},{"$f":"'Pres & Prop Rev'!I181/'Pres & Prop Rev'!I128-1","v":{"$error":"#DIV/0!"}},{"$f":"'Pres & Prop Rev'!J181/'Pres & Prop Rev'!J128-1","v":{"$error":"#DIV/0!"}},{"$f":"'Pres & Prop Rev'!K181/'Pres & Prop Rev'!K128-1","v":{"$error":"#DIV/0!"}}]
[null,"Weather & U/B Revenue",{"$f":"'Pres & Prop Rev'!C202/'Pres & Prop Rev'!C149-1","v":2.5634054548565377E-2},{"$f":"'Pres & Prop Rev'!D202/'Pres & Prop Rev'!D149-1","v":2.4699093644152681E-2},{"$f":"'Pres & Prop Rev'!E202/'Pres & Prop Rev'!E149-1","v":2.660311841215468E-2},{"$f":"'Pres & Prop Rev'!F202/'Pres & Prop Rev'!F149-1","v":{"$error":"#DIV/0!"}},{"$f":"'Pres & Prop Rev'!G202/'Pres & Prop Rev'!G149-1","v":3.0280164754676875E-2},{"$f":"'Pres & Prop Rev'!H202/'Pres & Prop Rev'!H149-1","v":{"$error":"#DIV/0!"}},{"$f":"'Pres & Prop Rev'!I202/'Pres & Prop Rev'!I149-1","v":{"$error":"#DIV/0!"}},{"$f":"'Pres & Prop Rev'!J202/'Pres & Prop Rev'!J149-1","v":{"$error":"#DIV/0!"}},{"$f":"'Pres & Prop Rev'!K202/'Pres & Prop Rev'!K149-1","v":2.3454992726947843E-2}]
[null,"Block Energy Charges",{"$f":"SUM('Pres & Prop Rev'!C166:C169)/SUM('Pres & Prop Rev'!C113:C116)-1","v":2.5023737350388098E-2},{"$f":"SUM('Pres & Prop Rev'!D166:D169)/SUM('Pres & Prop Rev'!D113:D116)-1","v":2.4737404759500814E-2},{"$f":"SUM('Pres & Prop Rev'!E166:E169)/SUM('Pres & Prop Rev'!E113:E116)-1","v":2.6584384435486941E-2},{"$f":"SUM('Pres & Prop Rev'!F166:F169)/SUM('Pres & Prop Rev'!F113:F116)-1","v":{"$error":"#DIV/0!"}},{"$f":"SUM('Pres & Prop Rev'!G166:G169)/SUM('Pres & Prop Rev'!G113:G116)-1","v":3.0280161995303478E-2},{"$f":"SUM('Pres & Prop Rev'!H166:H169)/SUM('Pres & Prop Rev'!H113:H116)-1","v":{"$error":"#DIV/0!"}},{"$f":"SUM('Pres & Prop Rev'!I166:I169)/SUM('Pres & Prop Rev'!I113:I116)-1","v":1.3733808167107897E-2},{"$f":"SUM('Pres & Prop Rev'!J166:J169)/SUM('Pres & Prop Rev'!J113:J116)-1","v":1.2775969488257433E-2},{"$f":"SUM('Pres & Prop Rev'!K166:K169)/SUM('Pres & Prop Rev'!K113:K116)-1","v":2.3454978575349061E-2}]
[null,"Overall Revenue",{"$f":"'Pres & Prop Rev'!C208","v":2.1252205431883893E-2},{"$f":"'Pres & Prop Rev'!D208","v":2.2602419081407133E-2},{"$f":"'Pres & Prop Rev'!E208","v":2.2624108917253066E-2},{"$f":"'Pres & Prop Rev'!F208","v":{"$error":"#DIV/0!"}},{"$f":"'Pres & Prop Rev'!G208","v":2.2632798665340657E-2},{"$f":"'Pres & Prop Rev'!H208","v":{"$error":"#DIV/0!"}},{"$f":"'Pres & Prop Rev'!I208","v":9.9890581872138662E-3},{"$f":"'Pres & Prop Rev'!J208","v":1.0005214395917623E-2},{"$f":"'Pres & Prop Rev'!K208","v":2.2525615415173294E-2}]
[]
[null,"Avg. Usage",null,{"$f":"D55/D56","v":932.07343783636134},1573.8082514574505,{"$error":"#DIV/0!"},59263.454187725823,{"$error":"#DIV/0!"},2228141.7272222219,38311510,5383.1685749978569]
[null,"Bill Compare:",{"$f":"INDEX($D$2:$L$2,N108)","v":"SCH. 1,2"},null,null,{"$f":"INDEX($D$2:$L$2,O108)","v":"SCH. 11,12"},null,null,null,null,null,null,null,1,2]
[null,{"$f":"IF(Base1_Billing2=2,\"BILLING RATES\",\"BASE RATES\")","v":"BASE RATES"},"Pres","Prop","% Incr","Pres","Prop","% Incr"]
[null,100]
[null,200]
[null,300]
[null,400]
[null,500]
[null,600]
[null,700]
[null,800]
[null,900]
[null,1000,{"$f":"ROUND(D14+600*D15/100+400*D16/100,2)","v":99.72},{"$f":"ROUND(D36+600*D37/100+400*D38/100,2)","v":102.22},{"$f":"D119/C119-1","v":2.507019655034104E-2},{"$f":"D119-C119","v":2.5}]
[null,1100]
[null,1200]
[null,1300]
[null,1400]
[null,1500]
[null,null,null,2425727000,{"$f":"395341000+52692000","v":448033000}]
[null,null,null,{"$f":"205474*12","v":2465688},{"$f":"(19967+8691)*12","v":343896}]
[null,null,null,{"$f":"D125/D126","v":983.79316442307379},{"$f":"E125/E126","v":1302.8153860469445}]

{"sheet":"Att A pg 1","index":2,"n_rows":114,"n_cols":28,"rows_kept":114,"cut":false,"hidden":false,"merged":[[0,0,0,18],[1,0,1,18],[2,0,2,18],[3,0,3,18],[4,0,4,18]]}
["AVISTA UTILITIES"]
["WASHINGTON ELECTRIC"]
["PROPOSED INCREASE BY SERVICE SCHEDULE"]
["12 MONTHS ENDED SEPTEMBER 30, 2021"]
["(000s of Dollars)"]
["Rate Year 1"]
[]
[null,null,null,"Base Tariff",null,"Base Tariff","Base","Base Tariff","Total Billed",null,"Adjusted Billed","Base ","Sch 78",null,"Percent",null,null,null,"Percent "]
[null,null,null,"Revenue","Proposed","Revenue","Tariff","Percent","Revenue","Misc","Revenue","Rate","Tax","Total","Increase","Sch. 98","Sch. 93","Proposed","Increase"]
[null,"Type of","Schedule","Under Present","General","Under Proposed","Percent","Change","at Present","Rate Adjustment","at Present","General","Rate ","Net ","on Billed","REC Revenue","ERM","General","on Billed"]
["No.","Service","Number","Rates(1)","Increase","Rates(1)","Increase","from Sp Ct","Rates (2)","Change","Rates (2)","Increase","Credit","Impact","Revenue","Decrease","Increase","Increase","Revenue"]
[null,"(a)","(b)","(c)","(d)","(e)","(f)","(i)","(g)","(h)","(h)","(h)","(i)","(j)","(k)","(j)","(k)","(j)","(k)"]
[null,null,null,{"$f":"IF(Base1_Billing2<>1,\"ERROR\",\"\")","v":""}]
[1,"Residential","1/2",253459.08989999999,26025.316049999983,279484.40594999999,0.10268053933385478,9.3119027380210745E-2,240021.74566977358,0,240021.74566977358,26025.316049999983,-12722,13303.316049999983,5.5425461609228253E-2,0,0,26025.316049999983,{"$f":"L14/I14","v":0.10842899245390084},null,null,{"$f":"G14*2","v":0.20536107866770956},"LIRAP Increase"]
[]
[2,"General Service","11/12",81570.42638307692,3263.8133269230725,84833.83971,4.0012213637272372E-2,3.8473011926375679E-2,87406.540884330403,0,87406.540884330403,3263.8133269230725,0,3263.8133269230725,3.7340607395071786E-2,0,0,3263.8133269230725,{"$f":"L16/I16","v":3.7340607395071786E-2}]
[]
[3,"Transportation - General Service",13,0,0,0,0,3.8473011926375679E-2,0,0,0,0,0,0,0,{"$error":"#REF!"},0,0,{"$error":"#DIV/0!"}]
[null,null,null,null,null,null,null,null,null,null,null,null,null,null,null,null,null,0,{"$error":"#DIV/0!"}]
[3,"Large General Service","21/22",131152.68517692306,5247.0461030769347,136399.73127999998,4.0007157276259697E-2,3.8468155720232704E-2,142808.50547370259,0,142808.50547370259,5247.0461030769347,0,5247.0461030769347,3.6741831907506024E-2,0,0,5247.0461030769347,3.6741831907506024E-2]
[]
[5,"Transportation - Large General Service",23,0,0,0,0,3.8468155720232704E-2,0,0,0,0,0,0,0,{"$error":"#REF!"},0,0,{"$error":"#DIV/0!"}]
[null,null,null,null,null,null,null,null,null,null,null,null,null,null,null,null,null,0,{"$error":"#DIV/0!"}]
[4,"Extra Large General Service",25,41217.656242999998,823.04935440000145,42040.705597399996,1.9968368641527987E-2,1.9577439120120353E-2,41422.051203000003,0,41422.051203000003,823.04935440000145,0,823.04935440000145,1.9869835763719781E-2,0,0,823.04935440000145,1.9869835763719781E-2]
[]
[5,"Extra Large General Service - Special Contract","25I",21772.9124414,435.19906700000166,22208.111508400001,1.9988096134189861E-2,1.9596401379531614E-2,22445.297721399998,0,22445.297721399998,435.19906700000166,0,435.19906700000166,1.9389320311179042E-2,0,0,435.19906700000166,1.9389320311179042E-2]
[]
[6,"Pumping Service","30/31/32",14578.56552,1496.6072700000013,{"$f":"16075.17279+0.4","v":16075.57279},0.10265806110668708,9.3100540165329149E-2,15745.319493805822,0,15745.319493805822,1496.6072700000013,-732,764.60727000000134,4.8560924425877568E-2,0,0,1496.6072700000013,9.5050930569478997E-2]
[]
[7,"Street & Area Lights","41-48",6900.6056423279988,708.77220000000023,{"$f":"7609.377842328+0.2","v":7609.5778423279999},0.10271159326254264,9.3144566439765555E-2,7097.8004199979987,0,7097.8004199979987,708.77220000000023,-346,362.77220000000023,5.1110510092379088E-2,0,0,708.77220000000023,9.9858006432956323E-2]
[]
[8,"Total",null,550651.94130672794,37999.80337139999,588651.74467812793,6.9008752209652302E-2,null,556947.26086601045,0,556947.26086601045,37999.80337139999,-13799.7,24200.10337139999,4.3451337445794561E-2,0,0,37999.80337139999,6.8228728358073254E-2]
[]
["(1) Excludes all present rate adjustments:  Schedule 59 (BPA Residential Exchange), Schedule 75 (Decoupling), Schedule 76 (Tax Credit)"]
["      Scheduke 89 (Low Income Discount), Schedule 91 (DSM), Schedule 92 (LIRAP), Schedule 93 (ERM) and Schedule 98 (REC Revenue)."]
[]
["(2) Includes all present rate adjustments:  Schedule 59 (BPA Residential Exchange), Schedule 75 (Decoupling), Schedule 76 (Tax Credit)"]
["      Scheduke 89 (Low Income Discount), Schedule 91 (DSM), Schedule 92 (LIRAP), Schedule 93 (ERM) and Schedule 98 (REC Revenue)."]
[]
["Rate Year 2"]
[null,null,null,"Base Tariff",null,"Base Tariff","Base","Base Tariff","Total Billed",null,"Adjusted Billed","Base ","Sch 78",null,"Percent",null,null,null,"Percent ",null,null,null,"Percent ","Total Billed"]
[null,null,null,"Revenue","Proposed","Revenue","Tariff","Percent","Revenue","Misc","Revenue","Rate","Tax","Total","Increase","Sch. 98","Sch. 93","Proposed","Increase",null,null,null,"Increase","Revenue"]
[null,"Type of","Schedule","Under Present","General","Under Proposed","Percent","Change","at Present","Rate Adjustment","at Present","General","Rate ","Net ","on Billed","REC Revenue","ERM","General","on Billed",null,null,null,"on Base","at Proposed"]
["No.","Service","Number","Rates(1)","Increase","Rates(1)","Increase","from Sp Ct","Rates (2)","Change","Rates (2)","Increase","Credit","Impact","Revenue","Decrease","Increase","Increase","Revenue",null,null,null,"Revenue","Rates (2)",null,"GRC","Tax","LIRAP"]
[null,"(a)","(b)","(c)","(d)","(e)","(f)","(i)","(g)","(h)","(h)","(h)","(i)","(j)","(k)","(j)","(k)","(j)","(k)",null,{"$f":"\"col (m) source\"","v":"col (m) source"}]
[null,null,null,{"$f":"IF(Base1_Billing2<>1,\"ERROR\",\"\")","v":""}]
[1,"Residential","1/2",{"$f":"'Pres & Prop Rev'!$D$152/1000","v":279484.40594999999},{"$f":"'Pres & Prop Rev'!D207/1000+0.5","v":6317.5236700000169},{"$f":"D47+E47","v":285801.92962000001},{"$f":"E47/D47","v":2.2604208089986342E-2},{"$f":"E47/F47","v":2.2104552192491304E-2},{"$f":"I14+N14","v":253325.06171977357},0,{"$f":"I47+J47","v":253325.06171977357},{"$f":"E47","v":6317.5236700000169},0,{"$f":"L47+M47","v":6317.5236700000169},{"$f":"(L47+M47)/K47","v":2.4938407700807817E-2},0,{"$f":"('Pres & Prop Rev'!D23*(0))/1000","v":0},{"$f":"E47+Q47","v":6317.5236700000169},{"$f":"(R47)/I47","v":2.4938407700807817E-2},null,"from Pres & Prop Rev tab",null,{"$f":"(L47)/D47","v":2.2604208089986342E-2},{"$f":"I47+L47+M47","v":259642.58538977359},null,{"$f":"L47/I47","v":2.4938407700807817E-2},{"$f":"M47/I47","v":0},0]
[]
[2,"General Service","11/12",{"$f":"'Pres & Prop Rev'!$E$152/1000-0.2","v":84834.239706153836},{"$f":"'Pres & Prop Rev'!E207/1000","v":1919.3036038461626},{"$f":"D49+E49-0.2","v":86753.343309999997},{"$f":"E49/D49","v":2.2624162254464539E-2},{"$f":"E49/F49","v":2.212368458225086E-2},{"$f":"I16+N16","v":90670.354211253478},0,{"$f":"I49+J49","v":90670.354211253478},{"$f":"E49","v":1919.3036038461626},0,{"$f":"L49+M49","v":1919.3036038461626},{"$f":"(L49+M49)/K49","v":2.1167928817994511E-2},0,{"$f":"('Pres & Prop Rev'!E23*(0))/1000","v":0},{"$f":"E49+Q49","v":1919.3036038461626},{"$f":"(R49)/I49","v":2.1167928817994511E-2},null,"from below",null,{"$f":"(L49)/D49","v":2.2624162254464539E-2},{"$f":"I49+L49+M49","v":92589.657815099636},null,{"$f":"L49/I49","v":2.1167928817994511E-2},{"$f":"M49/I49","v":0},0]
[]
[3,"Transportation - General Service",13,{"$f":"'Pres & Prop Rev'!$F$152/1000","v":0},{"$f":"'Pres & Prop Rev'!F207/1000","v":0},{"$f":"D51+E51","v":0},0,{"$f":"IF(F51=0,H49,E51/F51)","v":2.212368458225086E-2},{"$f":"I18+N18","v":0},0,{"$f":"I51+J51","v":0},{"$f":"E51","v":0},0,{"$f":"L51+M51","v":0},0,{"$f":"#REF!/1000","v":{"$error":"#REF!"}},{"$f":"('Pres & Prop Rev'!G21*(0))/1000","v":0},0,{"$f":"IF(I51=0,0,(R51)/I51)","v":0},null,"from below",null,{"$error":"#DIV/0!"},0,null,{"$error":"#DIV/0!"},{"$error":"#DIV/0!"},{"$f":"IF(K51=0,0,M51/K51)","v":0}]
[null,null,null,null,null,null,null,null,{"$f":"I19+N19","v":0},null,null,null,null,null,null,null,null,0,null,null,null,null,{"$error":"#DIV/0!"},0,null,{"$error":"#DIV/0!"},{"$error":"#DIV/0!"}]
[3,"Large General Service","21/22",{"$f":"'Pres & Prop Rev'!$G$152/1000","v":136399.73128384617},{"$f":"'Pres & Prop Rev'!G207/1000","v":3087.1076561538575},{"$f":"D53+E53+0.2","v":139487.03894000003},{"$f":"E53/D53","v":2.2632798665340657E-2},{"$f":"E53/F53","v":2.2131860276149159E-2},{"$f":"I20+N20","v":148055.55157677952},0,148055.55157677952,{"$f":"E53","v":3087.1076561538575},0,{"$f":"L53+M53","v":3087.1076561538575},{"$f":"(L53+M53)/K53","v":2.0851009119728463E-2},0,{"$f":"('Pres & Prop Rev'!G23*(0))/1000","v":0},3087.1076561538575,{"$f":"(R53)/I53","v":2.0851009119728463E-2},null,"from below",null,2.2632798665340657E-2,151142.65923293337,null,2.0851009119728463E-2,0,0]
[]
[5,"Transportation - Large General Service",23,{"$f":"'Pres & Prop Rev'!$H$152/1000","v":0},{"$f":"'Pres & Prop Rev'!H207/1000","v":0},{"$f":"D55+E55","v":0},0,{"$f":"IF(F55=0,H53,E55/F55)","v":2.2131860276149159E-2},{"$f":"I22+N22","v":0},0,{"$f":"I55+J55","v":0},{"$f":"E55","v":0},0,{"$f":"L55+M55","v":0},0,{"$f":"#REF!/1000","v":{"$error":"#REF!"}},{"$f":"('Pres & Prop Rev'!G25*(0))/1000","v":0},0,{"$f":"IF(I55=0,0,(R55)/I55)","v":0},null,"from below",null,{"$error":"#DIV/0!"},0,null,{"$error":"#DIV/0!"},{"$error":"#DIV/0!"},{"$f":"IF(K55=0,0,M55/K55)","v":0}]
[null,null,null,null,null,null,null,null,{"$f":"I23+N23","v":0},null,null,null,null,null,null,null,null,0,null,null,null,null,{"$error":"#DIV/0!"},0,null,{"$error":"#DIV/0!"},{"$error":"#DIV/0!"}]
[4,"Extra Large General Service",25,{"$f":"'Pres & Prop Rev'!$I$152/1000","v":42040.705592999999},{"$f":"'Pres & Prop Rev'!I207/1000","v":419.94705440000445},{"$f":"D57+E57+0.2","v":42460.852647400003},{"$f":"E57/D57","v":9.9890581872138662E-3},{"$f":"E57/F57","v":9.8902171816306894E-3},{"$f":"I24+N24","v":42245.100557400001},0,42245.100557400001,{"$f":"E57","v":419.94705440000445},0,{"$f":"L57+M57","v":419.94705440000445},{"$f":"(L57+M57)/K57","v":9.9407280100897531E-3},0,{"$f":"('Pres & Prop Rev'!I23*(0))/1000","v":0},419.94705440000445,{"$f":"(R57)/I57","v":9.9407280100897531E-3},null,"from Pres & Prop Rev tab",null,9.9890581872138662E-3,42665.047611800008,null,9.9407280100897531E-3,0,0]
[]
[5,"Extra Large General Service - Special Contract","25I",{"$f":"'Pres & Prop Rev'!$J$152/1000","v":22208.111511399999},{"$f":"'Pres & Prop Rev'!J207/1000-0.6","v":221.59691700000317},{"$f":"D59+E59+0.2","v":22429.908428400002},{"$f":"E59/D59","v":9.9781972405106004E-3},{"$f":"E59/F59","v":9.8795283853867436E-3},{"$f":"I26+N26","v":22880.4967884},0,{"$f":"I59+J59","v":22880.4967884},{"$f":"E59","v":221.59691700000317},0,{"$f":"L59+M59","v":221.59691700000317},{"$f":"(L59+M59)/K59","v":9.6849696511986938E-3},0,{"$f":"('Pres & Prop Rev'!I25*(0))/1000","v":0},221.59691700000317,{"$f":"IF(I59=0,0,(R59)/I59)","v":9.6849696511986938E-3},null,"from Pres & Prop Rev tab",null,9.9781972405106004E-3,23102.093705400002,null,9.6849696511986938E-3,0,0]
[]
[6,"Pumping Service","30/31/32",{"$f":"'Pres & Prop Rev'!$K$152/1000+0.4","v":16075.57279},{"$f":"'Pres & Prop Rev'!K207/1000","v":362.1031599999983},{"$f":"D61+E61","v":16437.675949999997},{"$f":"E61/D61","v":2.2525054922164195E-2},{"$f":"E61/F61","v":2.2028853780877603E-2},{"$f":"I28+N28","v":16509.926763805823},0,16509.926763805823,{"$f":"E61","v":362.1031599999983},0,{"$f":"L61+M61","v":362.1031599999983},{"$f":"(L61+M61)/K61","v":2.1932451014490588E-2},0,{"$f":"('Pres & Prop Rev'!K23*(0))/1000","v":0},362.1031599999983,{"$f":"(R61)/I61","v":2.1932451014490588E-2},null,"from below",null,2.2525054922164195E-2,16872.029923805821,null,2.1932451014490588E-2,0,0]
[]
[7,"Street & Area Lights","41-48",{"$f":"'Pres & Prop Rev'!$L$152/1000+0.2","v":7163.7024823279999},{"$f":"'Pres & Prop Rev'!L207/1000-0.1","v":172.89415999999923},{"$f":"D63+E63","v":7336.5966423279988},{"$f":"E63/D63","v":2.4134748815505463E-2},{"$f":"E63/F63","v":2.3565989576488103E-2},{"$f":"I30+N30","v":7460.572619997999},0,{"$f":"I63+J63","v":7460.572619997999},{"$f":"E63","v":172.89415999999923},0,{"$f":"L63+M63","v":172.89415999999923},{"$f":"(L63+M63)/K63","v":2.3174382022173198E-2},0,{"$f":"('Pres & Prop Rev'!L23*(0))/1000","v":0},172.89415999999923,{"$f":"(R63)/I63","v":2.3174382022173198E-2},null,"from Pres & Prop Rev tab",null,2.4134748815505463E-2,7633.4667799979979,null,2.3174382022173198E-2,0,0]
[]
[8,"Total",null,{"$f":"SUM(D47:D63)-0.3","v":588206.16931672802},{"$f":"SUM(E47:E63)","v":12500.476221400044},{"$f":"SUM(F47:F63)-0.4","v":600706.94553812791},{"$f":"E65/D65","v":2.1251861801995117E-2},null,{"$f":"SUM(I47:I63)","v":581147.06423741032},{"$f":"SUM(J47:J63)","v":0},581147.06423741032,{"$f":"E65","v":12500.476221400044},{"$f":"SUM(M47:M63)","v":0},{"$f":"L65+M65","v":12500.476221400044},{"$f":"(L65+M65)/K65","v":2.151000493791249E-2},0,{"$f":"SUM(Q47:Q63)","v":0},12500.476221400044,{"$f":"(R65)/I65","v":2.151000493791249E-2},null,"from below",null,2.1251861801995117E-2,593647.5404588104,null,2.151000493791249E-2,0,0]
[]
[]
["(1) Excludes all present rate adjustments:  Schedule 59 (BPA Residential Exchange), Schedule 75 (Decoupling), Schedule 76 (Tax Credit)"]
["      Scheduke 89 (Low Income Discount), Schedule 91 (DSM), Schedule 92 (LIRAP), Schedule 93 (ERM) and Schedule 98 (REC Revenue)."]
[]
["(2) Includes all present rate adjustments:  Schedule 59 (BPA Residential Exchange), Schedule 75 (Decoupling), Schedule 76 (Tax Credit)"]
["      Scheduke 89 (Low Income Discount), Schedule 91 (DSM), Schedule 92 (LIRAP), Schedule 93 (ERM) and Schedule 98 (REC Revenue)."]
[]
[null,null,null,null,null,null,null,null,null,null,null,null,null,null,null,null,null,null,"Street and Area Light Reconciliation"]
[null,"reduce billed revenue for BPA ResEx (already accounted for in Schs 1 & 48)",null,null,null,null,null,null,null,null,null,null,null,null,null,null,null,null,7610000,"Rate Year 1 Final"]
[null,null,null,null,null,"Billing",null,null,"Billed Revenue",null,null,null,null,null,null,null,null,null,-445000,"Colstrip Schedule 99"]
[null,null,null,null,null,"Determinants",null,null,"Impact",null,null,null,null,null,null,null,null,null,{"$f":"SUM(S75:S76)","v":7165000},"Rate Year 1 Revised"]
[null,"Schedule 12 only",null,null,null,{"$f":"'REVRUNS 12ME0921'!P119","v":62671685.550719991},null,null,{"$f":"F78*-0.00417/1000","v":-261.34092874650236},null,null,"Manually deducted in Column K"]
[null,"Schedule 22 only",null,null,null,{"$f":"'REVRUNS 12ME0921'!P164","v":31707816.120000001},null,null,{"$f":"F79*-0.00417/1000","v":-132.22159322040002},null,null,"Manually deducted in Column K",null,null,null,null,null,null,7610000,"Rate Year 1 Final"]
[null,"Schedule 32 only",null,null,null,{"$f":"'REVRUNS 12ME0921'!P249","v":10862713.71563},null,null,{"$f":"F80*-0.00417/1000","v":-45.297516194177099},null,null,"Manually deducted in Column K",null,null,null,null,null,null,-445000,"Colstrip Schedule 99"]
[null,"Schedule 48 only",null,null,null,{"$f":"'REVRUNS 12ME0921'!P313","v":2284668.1255500005},null,null,{"$f":"F81*-0.00417/1000","v":-9.5270660835435024},null,null,null,null,null,null,null,null,null,172000,"Rate Year 2 Stip Increase"]
[null,"Total",null,null,null,{"$f":"SUM(F78:F81)","v":107526883.51189999},null,null,{"$f":"SUM(I78:I81)","v":-448.387104244623},null,null,null,null,null,null,null,null,null,{"$f":"SUM(S79:S81)","v":7337000},"Rate Year 2 Revised"]
[]
[null,"Schedule 98 (REC Revenue Rebate)",null,null,null,null,null,null,null,null,null,null,null,null,null,null,null,null,7782000,"Rate Year 2 Stip"]
[null,"Schedule 41-48 only",null,null,null,{"$f":"'REVRUNS 12ME0921'!P341","v":16979796.48079},null,null,{"$f":"F85*-0.00018/1000","v":-3.0563633665422003},null,null,null,null,null,null,null,null,null,{"$f":"S80","v":-445000},"Colstrip"]
[null,null,null,null,null,null,null,null,null,null,null,null,null,null,null,null,null,null,{"$f":"SUM(S84:S85)","v":7337000},"Rate Year 2 Revised"]
[null,"Schedule 92 (LIRAP)"]
[null,"Schedule 41-48 only",null,null,null,{"$f":"'Lighting summary'!D19","v":7163502.4823280005},null,null,{"$f":"F88*0.0179/1000","v":128.22669443367121}]
[]
[null,"Schedule 93 (ERM)"]
[null,"Schedule 41-48 only",null,null,null,{"$f":"'REVRUNS 12ME0921'!P341","v":16979796.48079},null,null,{"$f":"F91*-0.0061/1000","v":-103.576758532819}]
[]
[null,"Schedule 94 (Remand)"]
[null,"Schedule 41-48 only",null,null,null,{"$f":"'REVRUNS 12ME0921'!P341","v":16979796.48079},null,null,{"$f":"F94*0","v":0}]
[]
[null,"Schedule 91 (DSM)"]
[null,"Schedule 41-48 only",null,null,null,{"$f":"'REVRUNS 12ME0921'!P341","v":16979796.48079},null,null,{"$f":"F97*0.01118/1000","v":189.83412465523222}]
[null,null,null,null,null,null,null,null,null,null,null,null,null,null,null,"ERM Reduction Calc"]
[]
[null,"Schedule 2 only",null,null,null,{"$f":"'REVRUNS 12ME0921'!P89","v":6943426.9003400002},null,null,{"$f":"F100*-0.03064/1000","v":-212.74660022641763},null,null,"Manually deducted in Column K"]
[]
[]
[]
[null,"Schedule 41-48 only Total",null,null,null,null,null,null,{"$f":"I81+I85+I97+I94+I91+I88","v":201.90063110599874},null,null,"Manually deducted in Column K"]
[]
[]
[]
[null,null,null,null,null,null,null,null,null,null,null,null,null,0,1,{"$f":"-D47*$N$109","v":0},null,{"$f":"0/'Pres & Prop Rev'!D23","v":0},{"$f":"(D47/$D$65)*$P$114","v":0}]
[null,null,null,null,null,null,null,null,null,null,null,null,null,{"$f":"N108/D65","v":0},11,{"$f":"-D49*N109","v":0},null,null,{"$f":"(D49/$D$65)*$P$114","v":0}]
[null,null,null,null,null,null,null,null,null,null,null,null,null,null,21,{"$f":"-D53*N109","v":0},null,null,{"$f":"(D53/$D$65)*$P$114","v":0}]
[null,null,null,null,null,null,null,null,null,null,null,null,null,null,25,{"$f":"-D57*N109","v":0},null,null,{"$f":"(D57/$D$65)*$P$114","v":0}]
[null,null,null,null,null,null,null,null,null,null,null,null,null,null,31,{"$f":"-D61*N109","v":0},null,null,{"$f":"(D61/$D$65)*$P$114","v":0}]
[null,null,null,null,null,null,null,null,null,null,null,null,null,null,"41-48",{"$f":"-D63*N109","v":0},null,null,{"$f":"(D63/$D$65)*$P$114","v":0}]
[null,null,null,null,null,null,null,null,null,null,null,null,null,null,null,{"$f":"SUM(P108:P113)","v":0},null,null,{"$f":"SUM(S108:S113)","v":0}]

{"sheet":"Att A pg 3","index":3,"n_rows":89,"n_cols":27,"rows_kept":89,"cut":false,"hidden":false,"merged":[[7,0,7,2],[3,0,3,13]]}
["AVISTA UTILITIES",null,null,null,null,null,null,null,null,null,null,null,null,null,null,null,null,null,null,null,null,null,"This worksheet uses Base & Billing rates from 'Rate Design' tab."]
["WASHINGTON ELECTRIC"]
["PRESENT AND PROPOSED RATE COMPONENTS BY SCHEDULE"]
["RATE YEAR 2"]
[]
[null,null,null,null,null,null,"Misc",null,null,"General ","Sch. 92","Sch. 78","Proposed ","Proposed ","Sch. 98","Sch. 93/94","Proposed Billing","Sch. 99","Revised"]
[null,null,null,"Base Tariff","Present","Present ","Rate","Adjusted",null,"Rate ","LIRAP Rate","Tax ","Billing ","Base Tariff","REC Revenue","ERM/BPA","Rate With","Colstrip","Base Tariff"]
["Type of Service",null,null,"Sch. Rate","Other Adj.(1)","Billing Rate","Adjustment","Billing Rate",null,"Inc/Dec","Increase","Credit","Rate","Rate","Decrease","Increase","ERM Decrease (2)","Rates","Rate",null,null,"non-printing",null,null,"Present","Proposed","Proposed "]
[null,"(a)",null,"(b)","(c)","(d)","(e)","(e)",null,"(e)","(f)","(f)","(g)","(h)","(h)","(i)","(j)","(i)","(j)",null,null,"Base","Billing",null,"Billing","Base","Billing"]
["Residential Service - Schedule 1"]
["Basic Charge",null,null,{"$f":"'Rate Design'!D4","v":9},{"$f":"F11-D11","v":0},{"$f":"'Rate Design'!D14","v":9},null,null,null,{"$f":"IF(ROUND(M11-F11,5)<>ROUND(N11-D11,5),#VALUE!,N11-D11)","v":0},null,null,{"$f":"'Rate Design'!D36","v":9},{"$f":"'Rate Design'!D26","v":9},null,null,{"$f":"N11","v":9},null,{"$f":"Q11","v":9},null,null,{"$f":"J11/D11","v":0},{"$f":"J11/F11","v":0}]
["Energy Charge:"]
[{"$f":"\"First \"&TEXT('Rate Design'!Q5,\"#,##0\")&\" kWhs\"","v":"First 800 kWhs"},null,null,{"$f":"'Rate Design'!D5/100","v":9.486E-2},{"$f":"F13-D13","v":-1.0059999999999999E-2},{"$f":"'Rate Design'!D15/100","v":8.48E-2},null,{"$f":"F13+G13","v":8.48E-2},null,{"$f":"N13-D13","v":2.3500000000000049E-3},0,0,{"$f":"F13+J13+K13+L13","v":8.7150000000000005E-2},{"$f":"'Rate Design'!D27/100","v":9.7210000000000005E-2},{"$f":"#REF!","v":{"$error":"#REF!"}},{"$f":"0.00164+0.00083","v":2.47E-3},{"$f":"M13+O13+P13","v":{"$error":"#REF!"}},-6.536506189192018E-3,{"$f":"N13+R13","v":9.0673493810807984E-2},{"$f":"S13-R13-N13","v":0},null,{"$f":"J13/D13","v":2.4773350200295224E-2},{"$f":"(J13+L13)/F13","v":2.7712264150943453E-2},null,{"$f":"D13+E13-F13","v":0},{"$f":"D13+J13-N13","v":0},{"$f":"F13+G13+J13+K13+L13-M13","v":0}]
[{"$f":"TEXT('Rate Design'!Q5,\"#,##0\")&\" - \"&TEXT('Rate Design'!Q6,\"#,##0\")&\" kWhs\"","v":"800 - 1,500 kWhs"},null,null,{"$f":"'Rate Design'!D6/100","v":0.11035},{"$f":"F14-D14","v":-1.074E-2},{"$f":"'Rate Design'!D16/100","v":9.9610000000000004E-2},null,{"$f":"F14+G14","v":9.9610000000000004E-2},null,{"$f":"N14-D14","v":2.7200000000000002E-3},{"$f":"K13","v":0},{"$f":"L13","v":0},{"$f":"F14+J14+K14+L14","v":0.10233},{"$f":"'Rate Design'!D28/100","v":0.11307},{"$f":"O13","v":{"$error":"#REF!"}},{"$f":"P13","v":2.47E-3},{"$f":"M14+O14","v":{"$error":"#REF!"}},-6.536506189192018E-3,{"$f":"N14+R14","v":0.10653349381080798},{"$f":"S14-R14-N14","v":0},null,{"$f":"J14/D14","v":2.464884458541006E-2},{"$f":"(J14+L14)/F14","v":2.7306495331793999E-2},null,{"$f":"D14+E14-F14","v":0},{"$f":"D14+J14-N14","v":0},{"$f":"F14+G14+J14+K14+L14-M14","v":0}]
[{"$f":"\"All over \"&TEXT('Rate Design'!Q6,\"#,##0\")&\" kWhs\"","v":"All over 1,500 kWhs"},null,null,{"$f":"'Rate Design'!D7/100","v":0.12939999999999999},{"$f":"F15-D15","v":-1.1579999999999993E-2},{"$f":"'Rate Design'!D17/100","v":0.11781999999999999},null,{"$f":"F15+G15","v":0.11781999999999999},null,{"$f":"N15-D15","v":3.2000000000000084E-3},{"$f":"K13","v":0},{"$f":"L13","v":0},{"$f":"F15+J15+K15+L15","v":0.12102},{"$f":"'Rate Design'!D29/100","v":0.1326},{"$f":"O13","v":{"$error":"#REF!"}},{"$f":"P13","v":2.47E-3},{"$f":"M15+O15","v":{"$error":"#REF!"}},-6.536506189192018E-3,0.12606349381080798,{"$f":"S15-R15-N15","v":0},null,{"$f":"J15/D15","v":2.4729520865533299E-2},2.7160074690205472E-2,null,{"$f":"D15+E15-F15","v":0},{"$f":"D15+J15-N15","v":0},{"$f":"F15+G15+J15+K15+L15-M15","v":0}]
[]
["General Services - Schedule 11"]
["Basic Charge",null,null,{"$f":"'Rate Design'!E4","v":21},{"$f":"F18-D18","v":0},{"$f":"'Rate Design'!E14","v":21},null,null,null,{"$f":"IF(ROUND(M18-F18,5)<>ROUND(N18-D18,5),#VALUE!,N18-D18)","v":0},null,null,{"$f":"'Rate Design'!E36","v":21},{"$f":"'Rate Design'!E26","v":21},null,null,{"$f":"N18","v":21},null,{"$f":"Q18","v":21},{"$f":"S18-R18-N18","v":0},null,{"$f":"J18/D18","v":0},{"$f":"J18/F18","v":0}]
["Energy Charge:"]
[{"$f":"\"First \"&TEXT('Rate Design'!R5,\"#,##0\")&\" kWhs\"","v":"First 3,650 kWhs"},null,null,{"$f":"'Rate Design'!E5/100","v":0.12379},{"$f":"F20-D20","v":9.4000000000000056E-3},{"$f":"'Rate Design'!E15/100","v":0.13319},null,{"$f":"F20+G20","v":0.13319},null,{"$f":"N20-D20","v":3.2900000000000013E-3},0,0,{"$f":"F20+J20+K20+L20","v":0.13647999999999999},{"$f":"'Rate Design'!E27/100","v":0.12708},{"$f":"O13","v":{"$error":"#REF!"}},{"$f":"P13","v":2.47E-3},{"$f":"M20+O20","v":{"$error":"#REF!"}},-3.2275432291219838E-3,{"$f":"N20+R20","v":0.12385245677087801},{"$f":"S20-R20-N20","v":0},null,{"$f":"J20/D20","v":2.6577267953792724E-2},{"$f":"(J20+L20)/F20","v":2.4701554170733546E-2},null,{"$f":"D20+E20-F20","v":0},{"$f":"D20+J20-N20","v":0},{"$f":"F20+G20+J20+K20+L20-M20","v":0}]
[{"$f":"\"All over \"&TEXT('Rate Design'!R5,\"#,##0\")&\" kWhs\"","v":"All over 3,650 kWhs"},null,null,{"$f":"'Rate Design'!E6/100","v":9.0959999999999999E-2},{"$f":"F21-D21","v":1.0069999999999996E-2},{"$f":"'Rate Design'!E16/100","v":0.10102999999999999},null,{"$f":"F21+G21","v":0.10102999999999999},null,{"$f":"N21-D21","v":2.4199999999999916E-3},{"$f":"K20","v":0},{"$f":"L20","v":0},{"$f":"F21+J21+K21+L21","v":0.10344999999999999},{"$f":"'Rate Design'!E28/100","v":9.3379999999999991E-2},{"$f":"O20","v":{"$error":"#REF!"}},{"$f":"P20","v":2.47E-3},{"$f":"M21+O21","v":{"$error":"#REF!"}},-3.2275432291219838E-3,{"$f":"N21+R21","v":9.0152456770878006E-2},{"$f":"S21-R21-N21","v":0},null,{"$f":"J21/D21","v":2.6605101143359625E-2},{"$f":"(J21+L21)/F21","v":2.3953281203602808E-2},null,{"$f":"D21+E21-F21","v":0},{"$f":"D21+J21-N21","v":0},{"$f":"F21+G21+J21+K21+L21-M21","v":0}]
["Demand Charge:"]
[{"$f":"TEXT('Rate Design'!R10,\"#,##0\")&\" kW or less\"","v":"20 kW or less"},null,null,"no charge",null,"no charge",null,null,null,"no charge",null,null,null,"no charge",null,null,"no charge",null,"no charge"]
[{"$f":"\"Over \"&TEXT('Rate Design'!R10,\"#,##0\")&\" kW\"","v":"Over 20 kW"},null,null,{"$f":"'Rate Design'!E10","v":7.5},{"$f":"F24-D24","v":0},{"$f":"'Rate Design'!E20","v":7.5},null,null,null,{"$f":"IF(ROUND(M24-F24,5)<>ROUND(N24-D24,5),#VALUE!,N24-D24)","v":0},null,null,{"$f":"'Rate Design'!E42","v":7.5},{"$f":"'Rate Design'!E32","v":7.5},null,null,{"$f":"'Rate Design'!E32","v":7.5},null,{"$f":"N24","v":7.5},null,null,{"$f":"J24/D24","v":0},{"$f":"J24/F24","v":0}]
["Minimums:",null,null,"$21.00 Single Phase Service",null,null,null,null,null,null,null,null,"$21.00 Single Phase Service"]
[null,null,null,"$28.35 Three Phase Service",null,null,null,null,null,null,null,null,"$28.35 Three Phase Service"]
[]
["Transportation General Services - Schedule 13"]
["Basic Charge",null,null,{"$f":"'Rate Design'!F4","v":21},{"$f":"F29-D29","v":0},{"$f":"'Rate Design'!F14","v":21},null,null,null,{"$f":"IF(ROUND(M29-F29,5)<>ROUND(N29-D29,5),#VALUE!,N29-D29)","v":0},null,null,{"$f":"'Rate Design'!F36","v":21},{"$f":"'Rate Design'!F26","v":21},null,null,{"$f":"N29","v":21},null,{"$f":"Q29","v":21},{"$f":"S29-R29-N29","v":0},null,{"$f":"J29/D29","v":0},{"$f":"J29/F29","v":0}]
["Energy Charge:"]
["On-Peak",null,null,{"$f":"'Rate Design'!F5/100","v":0.21890000000000001},{"$f":"F31-D31","v":9.4000000000000195E-3},{"$f":"'Rate Design'!F15/100","v":0.22830000000000003},null,{"$f":"F31+G31","v":0.22830000000000003},null,{"$f":"N31-D31","v":5.8199999999999918E-3},0,0,{"$f":"F31+J31+K31+L31","v":0.23412000000000002},{"$f":"'Rate Design'!F27/100","v":0.22472},{"$f":"O24","v":0},{"$f":"P24","v":0},{"$f":"M31+O31","v":0.23412000000000002},-3.2275432291219838E-3,{"$f":"N31+R31","v":0.22149245677087803},{"$f":"S31-R31-N31","v":0},null,{"$f":"J31/D31","v":2.6587482868889865E-2},{"$f":"(J31+L31)/F31","v":2.5492772667542667E-2},null,{"$f":"D31+E31-F31","v":0},{"$f":"D31+J31-N31","v":0},{"$f":"F31+G31+J31+K31+L31-M31","v":0}]
["Off-Peak",null,null,{"$f":"'Rate Design'!F6/100","v":8.906E-2},{"$f":"F32-D32","v":1.0069999999999996E-2},{"$f":"'Rate Design'!F16/100","v":9.9129999999999996E-2},null,{"$f":"F32+G32","v":9.9129999999999996E-2},null,{"$f":"N32-D32","v":2.370000000000011E-3},{"$f":"K31","v":0},{"$f":"L31","v":0},{"$f":"F32+J32+K32+L32","v":0.10150000000000001},{"$f":"'Rate Design'!F28/100","v":9.1430000000000011E-2},{"$f":"O31","v":0},{"$f":"P31","v":0},{"$f":"M32+O32","v":0.10150000000000001},-3.2275432291219838E-3,{"$f":"N32+R32","v":8.8202456770878027E-2},{"$f":"S32-R32-N32","v":0},null,{"$f":"J32/D32","v":2.6611273298899743E-2},{"$f":"(J32+L32)/F32","v":2.3907999596489569E-2},null,{"$f":"D32+E32-F32","v":0},{"$f":"D32+J32-N32","v":0},{"$f":"F32+G32+J32+K32+L32-M32","v":0}]
["Minimums:",null,null,"$21.00 Single Phase Service",null,null,null,null,null,null,null,null,"$21.00 Single Phase Service"]
[null,null,null,"$28.35 Three Phase Service",null,null,null,null,null,null,null,null,"$28.35 Three Phase Service"]
[]
["Large General Service - Schedule 21"]
["Energy Charge:"]
[{"$f":"\"First \"&TEXT('Rate Design'!T5,\"#,##0\")&\" kWhs\"","v":"First 250,000 kWhs"},null,null,{"$f":"'Rate Design'!G5/100","v":7.9269999999999993E-2},{"$f":"F38-D38","v":9.0400000000000064E-3},{"$f":"'Rate Design'!G15/100","v":8.831E-2},null,{"$f":"F38+G38","v":8.831E-2},null,{"$f":"N38-D38","v":2.3999999999999994E-3},0,0,{"$f":"F38+J38+K38+L38","v":9.0709999999999999E-2},{"$f":"'Rate Design'!G27/100","v":8.1669999999999993E-2},{"$f":"O13","v":{"$error":"#REF!"}},{"$f":"P13","v":2.47E-3},{"$f":"M38+O38","v":{"$error":"#REF!"}},-2.5330148028139782E-3,{"$f":"N38+R38","v":7.9136985197186011E-2},{"$f":"S38-R38-N38","v":0},null,{"$f":"J38/D38","v":3.02762709726252E-2},{"$f":"(J38+L38)/F38","v":2.7176990148341063E-2},null,{"$f":"D38+E38-F38","v":0},{"$f":"D38+J38-N38","v":0},{"$f":"F38+G38+J38+K38+L38-M38","v":0}]
[{"$f":"\"All over \"&TEXT('Rate Design'!T5,\"#,##0\")&\" kWhs\"","v":"All over 250,000 kWhs"},null,null,{"$f":"'Rate Design'!G6/100","v":7.0919999999999997E-2},{"$f":"F39-D39","v":9.2299999999999882E-3},{"$f":"'Rate Design'!G16/100","v":8.0149999999999985E-2},null,{"$f":"F39+G39","v":8.0149999999999985E-2},null,{"$f":"N39-D39","v":2.150000000000013E-3},{"$f":"K38","v":0},{"$f":"L38","v":0},{"$f":"F39+J39+K39+L39","v":8.2299999999999998E-2},{"$f":"'Rate Design'!G28/100","v":7.307000000000001E-2},{"$f":"O38","v":{"$error":"#REF!"}},{"$f":"P38","v":2.47E-3},{"$f":"M39+O39","v":{"$error":"#REF!"}},-2.5330148028139782E-3,{"$f":"N39+R39","v":7.0536985197186028E-2},{"$f":"S39-R39-N39","v":0},null,{"$f":"J39/D39","v":3.0315848843767812E-2},{"$f":"(J39+L39)/F39","v":2.6824703680599044E-2},null,{"$f":"D39+E39-F39","v":0},{"$f":"D39+J39-N39","v":0},{"$f":"F39+G39+J39+K39+L39-M39","v":0}]
["Demand Charge:"]
[{"$f":"TEXT('Rate Design'!T10,\"#,##0\")&\" kW or less\"","v":"50 kW or less"},null,null,{"$f":"'Rate Design'!G9","v":600},{"$f":"F41-D41","v":0},{"$f":"'Rate Design'!G19","v":600},null,null,null,{"$f":"IF(ROUND(M41-F41,5)<>ROUND(N41-D41,5),#VALUE!,N41-D41)","v":0},null,null,{"$f":"'Rate Design'!G41","v":600},{"$f":"'Rate Design'!G31","v":600},null,null,{"$f":"N41","v":600},null,{"$f":"Q41","v":600},{"$f":"S41-R41-N41","v":0},null,{"$f":"J41/D41","v":0},{"$f":"J41/F41","v":0}]
[{"$f":"\"Over \"&TEXT('Rate Design'!T10,\"#,##0\")&\" kW\"","v":"Over 50 kW"},null,null,{"$f":"'Rate Design'!G10","v":7.5},{"$f":"F42-D42","v":0},{"$f":"'Rate Design'!G20","v":7.5},null,null,null,{"$f":"IF(ROUND(M42-F42,5)<>ROUND(N42-D42,5),#VALUE!,N42-D42)","v":0},null,null,{"$f":"'Rate Design'!G42","v":7.5},{"$f":"'Rate Design'!G32","v":7.5},null,null,{"$f":"'Rate Design'!G32","v":7.5},null,{"$f":"N42","v":7.5},{"$f":"S42-R42-N42","v":0},null,{"$f":"J42/D42","v":0},{"$f":"J42/F42","v":0}]
["Primary Voltage Discount",null,null,0.2,{"$f":"F43-D43","v":0},0.2,null,null,null,{"$f":"IF(ROUND(M43-F43,5)<>ROUND(N43-D43,5),#VALUE!,N43-D43)","v":0},null,null,0.2,0.2,null,null,0.2,null,0.2,{"$f":"S43-R43-N43","v":0},null,{"$f":"J43/D43","v":0},{"$f":"J43/F43","v":0}]
[]
["Transportation Large General Service - Schedule 23"]
["Basic Charge",null,null,{"$f":"'Rate Design'!H4","v":600},{"$f":"F46-D46","v":0},{"$f":"'Rate Design'!H14","v":600},null,null,null,{"$f":"IF(ROUND(M46-F46,5)<>ROUND(N46-D46,5),#VALUE!,N46-D46)","v":0},null,null,{"$f":"'Rate Design'!H36","v":600},{"$f":"'Rate Design'!H26","v":600},null,null,{"$f":"N46","v":600},null,{"$f":"Q46","v":600},{"$f":"S46-R46-N46","v":0},null,{"$f":"J46/D46","v":0},{"$f":"J46/F46","v":0}]
["Energy Charge:"]
["On-Peak",null,null,{"$f":"'Rate Design'!H5/100","v":0.16783999999999999},{"$f":"F48-D48","v":9.0399999999999925E-3},{"$f":"'Rate Design'!H15/100","v":0.17687999999999998},null,{"$f":"F48+G48","v":0.17687999999999998},null,{"$f":"N48-D48","v":5.0800000000000289E-3},0,0,{"$f":"F48+J48+K48+L48","v":0.18196000000000001},{"$f":"'Rate Design'!H27/100","v":0.17292000000000002},{"$f":"O22","v":0},{"$f":"P22","v":0},{"$f":"M48+O48","v":0.18196000000000001},-2.5330148028139782E-3,{"$f":"N48+R48","v":0.17038698519718604},{"$f":"S48-R48-N48","v":0},null,{"$f":"J48/D48","v":3.0266920877025913E-2},{"$f":"(J48+L48)/F48","v":2.8720036182722918E-2},null,{"$f":"D48+E48-F48","v":0},{"$f":"D48+J48-N48","v":0},{"$f":"F48+G48+J48+K48+L48-M48","v":0}]
["Off-Peak",null,null,{"$f":"'Rate Design'!H6/100","v":6.9279999999999994E-2},{"$f":"F49-D49","v":9.2300000000000021E-3},{"$f":"'Rate Design'!H16/100","v":7.8509999999999996E-2},null,{"$f":"F49+G49","v":7.8509999999999996E-2},null,{"$f":"N49-D49","v":2.1000000000000046E-3},{"$f":"K48","v":0},0,{"$f":"F49+J49+K49+L49","v":8.0610000000000001E-2},{"$f":"'Rate Design'!H28/100","v":7.1379999999999999E-2},{"$f":"O48","v":0},{"$f":"P48","v":0},{"$f":"M49+O49","v":8.0610000000000001E-2},-2.5330148028139782E-3,{"$f":"N49+R49","v":6.8846985197186017E-2},{"$f":"S49-R49-N49","v":0},null,{"$f":"J49/D49","v":3.031177829099314E-2},{"$f":"(J49+L49)/F49","v":2.6748184944593106E-2},null,{"$f":"D49+E49-F49","v":0},{"$f":"D49+J49-N49","v":0},{"$f":"F49+G49+J49+K49+L49-M49","v":0}]
["Primary Voltage Discount",null,null,0.2,{"$f":"F50-D50","v":0},0.2,null,null,null,{"$f":"IF(ROUND(M50-F50,5)<>ROUND(N50-D50,5),#VALUE!,N50-D50)","v":0},null,null,0.2,0.2,null,null,0.2,null,0.2,{"$f":"S50-R50-N50","v":0},null,{"$f":"J50/D50","v":0},{"$f":"J50/F50","v":0}]
[]
["Extra Large General Service - Schedule 25"]
["Energy Charge:"]
[{"$f":"\"First \"&TEXT('Rate Design'!V5,\"#,##0\")&\" kWhs\"","v":"First 500,000 kWhs"},null,null,{"$f":"'Rate Design'!I5/100","v":5.9059999999999994E-2},{"$f":"F54-D54","v":1.7000000000000348E-4},{"$f":"'Rate Design'!I15/100","v":5.9229999999999998E-2},null,{"$f":"F54+G54","v":5.9229999999999998E-2},null,{"$f":"N54-D54","v":8.1000000000000516E-4},0,0,{"$f":"F54+J54+K54+L54","v":6.0040000000000003E-2},{"$f":"'Rate Design'!I27/100","v":5.987E-2},{"$f":"O13","v":{"$error":"#REF!"}},{"$f":"P13","v":2.47E-3},{"$f":"M54+O54","v":{"$error":"#REF!"}},-9.2017100673336171E-4,{"$f":"N54+R54","v":5.8949828993266638E-2},{"$f":"S54-R54-N54","v":0},null,{"$f":"J54/D54","v":1.3714866237724437E-2},{"$f":"(J54+L54)/F54","v":1.3675502279250467E-2},null,{"$f":"D54+E54-F54","v":0},{"$f":"D54+J54-N54","v":0},{"$f":"F54+G54+J54+K54+L54-M54","v":0}]
[{"$f":"TEXT('Rate Design'!V27,\"#,##0\")&\" - \"&TEXT('Rate Design'!V28,\"#,##0\")&\" kWhs\"","v":"500,000 - 6,000,000 kWhs"},null,null,{"$f":"'Rate Design'!I6/100","v":5.3129999999999997E-2},{"$f":"F55-D55","v":4.2000000000001064E-4},{"$f":"'Rate Design'!I16/100","v":5.3550000000000007E-2},null,{"$f":"F55+G55","v":5.3550000000000007E-2},null,{"$f":"N55-D55","v":7.3000000000000148E-4},{"$f":"K54","v":0},{"$f":"L54","v":0},{"$f":"F55+J55+K55+L55","v":5.4280000000000009E-2},{"$f":"'Rate Design'!I28/100","v":5.3859999999999998E-2},{"$f":"O54","v":{"$error":"#REF!"}},{"$f":"P54","v":2.47E-3},{"$f":"M55+O55","v":{"$error":"#REF!"}},-9.2017100673336171E-4,{"$f":"N55+R55","v":5.2939828993266637E-2},{"$f":"S55-R55-N55","v":0},null,{"$f":"J55/D55","v":1.3739883305100726E-2},{"$f":"(J55+L55)/F55","v":1.3632119514472482E-2},null,{"$f":"D55+E55-F55","v":0},{"$f":"D55+J55-N55","v":0},{"$f":"F55+G55+J55+K55+L55-M55","v":0}]
[{"$f":"\"All over \"&TEXT('Rate Design'!V28,\"#,##0\")&\" kWhs\"","v":"All over 6,000,000 kWhs"},null,null,{"$f":"'Rate Design'!I7/100","v":4.3520000000000003E-2},{"$f":"F56-D56","v":1.6600000000000018E-3},{"$f":"'Rate Design'!I17/100","v":4.5180000000000005E-2},null,{"$f":"F56+G56","v":4.5180000000000005E-2},null,{"$f":"N56-D56","v":5.9999999999999637E-4},0,{"$f":"L54","v":0},4.5780000000000001E-2,{"$f":"'Rate Design'!I29/100","v":4.4119999999999999E-2},{"$f":"O54","v":{"$error":"#REF!"}},{"$f":"P54","v":2.47E-3},{"$f":"M56+O56","v":{"$error":"#REF!"}},-9.2017100673336171E-4,4.3199828993266638E-2,{"$f":"S56-R56-N56","v":0},null,{"$f":"J56/D56","v":1.3786764705882269E-2},1.3280212483399653E-2,null,{"$f":"D56+E56-F56","v":0},{"$f":"D56+J56-N56","v":0},{"$f":"F56+G56+J56+K56+L56-M56","v":0}]
["Demand Charge:"]
[{"$f":"TEXT('Rate Design'!V10,\"#,##0\")&\" kva or less\"","v":"3,000 kva or less"},null,null,{"$f":"'Rate Design'!I9","v":30650},{"$f":"F58-D58","v":0},{"$f":"'Rate Design'!I19","v":30650},null,null,null,{"$f":"IF(ROUND(M58-F58,5)<>ROUND(N58-D58,5),#VALUE!,N58-D58)","v":0},null,null,{"$f":"'Rate Design'!I41","v":30650},{"$f":"'Rate Design'!I31","v":30650},null,null,{"$f":"'Rate Design'!I31","v":30650},null,{"$f":"N58","v":30650},{"$f":"S58-R58-N58","v":0},null,{"$f":"J58/D58","v":0},{"$f":"J58/F58","v":0}]
[{"$f":"\"Over \"&TEXT('Rate Design'!V10,\"#,##0\")&\" kva\"","v":"Over 3,000 kva"},null,null,{"$f":"'Rate Design'!I10","v":8.3000000000000007},{"$f":"F59-D59","v":0},{"$f":"'Rate Design'!I20","v":8.3000000000000007},null,null,null,{"$f":"IF(ROUND(M59-F59,5)<>ROUND(N59-D59,5),#VALUE!,N59-D59)","v":0},null,null,{"$f":"'Rate Design'!I42","v":8.3000000000000007},{"$f":"'Rate Design'!I32","v":8.3000000000000007},null,null,{"$f":"'Rate Design'!I32","v":8.3000000000000007},null,{"$f":"N59","v":8.3000000000000007},{"$f":"S59-R59-N59","v":0},null,{"$f":"J59/D59","v":0},{"$f":"J59/F59","v":0}]
["Primary Volt. Discount"]
["11 - 60 kv",null,null,0.2,{"$f":"F61-D61","v":0},0.2,null,null,null,{"$f":"IF(ROUND(M61-F61,5)<>ROUND(N61-D61,5),#VALUE!,N61-D61)","v":0},null,null,0.2,0.2,null,null,{"$f":"N61","v":0.2},null,{"$f":"Q61","v":0.2},{"$f":"S61-R61-N61","v":0},null,{"$f":"J61/D61","v":0},{"$f":"J61/F61","v":0}]
["60 - 115 kv",null,null,1.52,{"$f":"F62-D62","v":0},1.52,null,null,null,{"$f":"IF(ROUND(M62-F62,5)<>ROUND(N62-D62,5),#VALUE!,N62-D62)","v":0},null,null,1.52,1.52,null,null,{"$f":"N62","v":1.52},null,{"$f":"Q62","v":1.52},{"$f":"S62-R62-N62","v":0},null,{"$f":"J62/D62","v":0},{"$f":"J62/F62","v":0}]
["115 or higher kv",null,null,1.93,{"$f":"F63-D63","v":0},1.93,null,null,null,{"$f":"IF(ROUND(M63-F63,5)<>ROUND(N63-D63,5),#VALUE!,N63-D63)","v":0},null,null,1.93,1.93,null,null,{"$f":"N63","v":1.93},null,{"$f":"Q63","v":1.93},{"$f":"S63-R63-N63","v":0},null,{"$f":"J63/D63","v":0},{"$f":"J63/F63","v":0}]
["Annual Minimum",null,null,"Present:",987810,null,null,null,null,null,null,"Proposed:",{"$f":"6000000*N54+5000000*N55+12*N58","v":996320},null,null,null,{"$f":"M64","v":996320},null,{"$f":"M64","v":996320},{"$f":"S64-R64-N64","v":996320},null,{"$f":"M64/E64-1","v":8.615017057936214E-3}]
[]
["Extra Large General Service Specific Contract - Schedule 25I"]
["Energy Charge:"]
[{"$f":"\"First \"&TEXT('Rate Design'!V19,\"#,##0\")&\" kWhs\"","v":"First 0 kWhs"},null,null,{"$f":"'Rate Design'!J5/100","v":4.7820000000000001E-2},{"$f":"F68-D68","v":1.7000000000000348E-4},{"$f":"'Rate Design'!J15/100","v":4.7990000000000005E-2},null,{"$f":"F68+G68","v":4.7990000000000005E-2},null,{"$f":"N68-D68","v":6.0999999999999943E-4},0,0,{"$f":"F68+J68+K68+L68","v":4.8600000000000004E-2},{"$f":"'Rate Design'!J27/100","v":4.8430000000000001E-2},{"$f":"O27","v":0},{"$f":"P27","v":0},{"$f":"M68+O68","v":4.8600000000000004E-2},-5.9424215816861962E-4,{"$f":"N68+R68","v":4.7835757841831382E-2},{"$f":"S68-R68-N68","v":0},null,{"$f":"J68/D68","v":1.2756168966959419E-2},{"$f":"(J68+L68)/F68","v":1.2710981454469668E-2},null,{"$f":"D68+E68-F68","v":0},{"$f":"D68+J68-N68","v":0},{"$f":"F68+G68+J68+K68+L68-M68","v":0}]
[{"$f":"TEXT('Rate Design'!V41,\"#,##0\")&\" - \"&TEXT('Rate Design'!V42,\"#,##0\")&\" kWhs\"","v":"0 - 3,000 kWhs"},null,null,{"$f":"'Rate Design'!J6/100","v":4.3029999999999999E-2},{"$f":"F69-D69","v":4.2000000000001064E-4},{"$f":"'Rate Design'!J16/100","v":4.3450000000000009E-2},null,{"$f":"F69+G69","v":4.3450000000000009E-2},null,{"$f":"N69-D69","v":5.4999999999999494E-4},{"$f":"K68","v":0},{"$f":"L68","v":0},{"$f":"F69+J69+K69+L69","v":4.4000000000000004E-2},{"$f":"'Rate Design'!J28/100","v":4.3579999999999994E-2},{"$f":"O68","v":0},{"$f":"P68","v":0},{"$f":"M69+O69","v":4.4000000000000004E-2},-5.9424215816861962E-4,{"$f":"N69+R69","v":4.2985757841831375E-2},{"$f":"S69-R69-N69","v":0},null,{"$f":"J69/D69","v":1.2781780153381245E-2},{"$f":"(J69+L69)/F69","v":1.2658227848101146E-2},null,{"$f":"D69+E69-F69","v":0},{"$f":"D69+J69-N69","v":0},{"$f":"F69+G69+J69+K69+L69-M69","v":0}]
[{"$f":"\"All over \"&TEXT('Rate Design'!V42,\"#,##0\")&\" kWhs\"","v":"All over 3,000 kWhs"},null,null,{"$f":"'Rate Design'!J7/100","v":3.6789999999999996E-2},{"$f":"F70-D70","v":1.6600000000000018E-3},{"$f":"'Rate Design'!J17/100","v":3.8449999999999998E-2},null,{"$f":"F70+G70","v":3.8449999999999998E-2},null,{"$f":"N70-D70","v":4.7000000000000514E-4},null,null,3.8920000000000003E-2,{"$f":"'Rate Design'!J29/100","v":3.7260000000000001E-2},{"$f":"O68","v":0},{"$f":"P68","v":0},{"$f":"M70+O70","v":3.8920000000000003E-2},-5.9424215816861962E-4,3.6665757841831383E-2,{"$f":"S70-R70-N70","v":0},null,{"$f":"J70/D70","v":1.2775210655069454E-2},1.2223667100130174E-2,null,{"$f":"D70+E70-F70","v":0},{"$f":"D70+J70-N70","v":0},{"$f":"F70+G70+J70+K70+L70-M70","v":0}]
["Demand Charge:"]
[{"$f":"TEXT('Rate Design'!V24,\"#,##0\")&\" kva or less\"","v":"0 kva or less"},null,null,{"$f":"'Rate Design'!J9","v":30650},{"$f":"F72-D72","v":0},{"$f":"'Rate Design'!J19","v":30650},null,null,null,{"$f":"IF(ROUND(M72-F72,5)<>ROUND(N72-D72,5),#VALUE!,N72-D72)","v":0},null,null,{"$f":"'Rate Design'!J41","v":30650},{"$f":"'Rate Design'!J31","v":30650},null,null,{"$f":"'Rate Design'!I45","v":0},null,{"$f":"N72","v":30650},{"$f":"S72-R72-N72","v":0},null,{"$f":"J72/D72","v":0},{"$f":"J72/F72","v":0}]
[{"$f":"\"Over \"&TEXT('Rate Design'!V24,\"#,##0\")&\" kva\"","v":"Over 0 kva"},null,null,{"$f":"'Rate Design'!J10","v":8.3000000000000007},{"$f":"F73-D73","v":0},{"$f":"'Rate Design'!J20","v":8.3000000000000007},null,null,null,{"$f":"IF(ROUND(M73-F73,5)<>ROUND(N73-D73,5),#VALUE!,N73-D73)","v":0},null,null,{"$f":"'Rate Design'!J42","v":8.3000000000000007},{"$f":"'Rate Design'!J32","v":8.3000000000000007},null,null,{"$f":"'Rate Design'!I46","v":0},null,{"$f":"N73","v":8.3000000000000007},{"$f":"S73-R73-N73","v":0},null,{"$f":"J73/D73","v":0},{"$f":"J73/F73","v":0}]
["Primary Volt. Discount"]
["11 - 60 kv",null,null,0.2,{"$f":"F75-D75","v":0},0.2,null,null,null,{"$f":"IF(ROUND(M75-F75,5)<>ROUND(N75-D75,5),#VALUE!,N75-D75)","v":0},null,null,0.2,0.2,null,null,{"$f":"N75","v":0.2},null,{"$f":"Q75","v":0.2},{"$f":"S75-R75-N75","v":0},null,{"$f":"J75/D75","v":0},{"$f":"J75/F75","v":0}]
["60 - 115 kv",null,null,1.52,{"$f":"F76-D76","v":0},1.52,null,null,null,{"$f":"IF(ROUND(M76-F76,5)<>ROUND(N76-D76,5),#VALUE!,N76-D76)","v":0},null,null,1.52,1.52,null,null,{"$f":"N76","v":1.52},null,{"$f":"Q76","v":1.52},{"$f":"S76-R76-N76","v":0},null,{"$f":"J76/D76","v":0},{"$f":"J76/F76","v":0}]
["115 or higher kv",null,null,1.93,{"$f":"F77-D77","v":0},1.93,null,null,null,{"$f":"IF(ROUND(M77-F77,5)<>ROUND(N77-D77,5),#VALUE!,N77-D77)","v":0},null,null,1.93,1.93,null,null,{"$f":"N77","v":1.93},null,{"$f":"Q77","v":1.93},{"$f":"S77-R77-N77","v":0},null,{"$f":"J77/D77","v":0},{"$f":"J77/F77","v":0}]
[]
["Pumping Service - Schedule 31"]
["Basic Charge",null,null,{"$f":"'Rate Design'!K4","v":21},{"$f":"F80-D80","v":0},{"$f":"'Rate Design'!K14","v":21},null,null,null,{"$f":"IF(ROUND(M80-F80,5)<>ROUND(N80-D80,5),#VALUE!,N80-D80)","v":0},null,null,{"$f":"'Rate Design'!K36","v":21},{"$f":"'Rate Design'!K26","v":21},null,null,{"$f":"N80","v":21},null,{"$f":"Q80","v":21},{"$f":"S80-R80-N80","v":0},null,{"$f":"J80/D80","v":0},{"$f":"J80/F80","v":0}]
["Energy Charge:"]
["First 85 kW/kWh",null,null,{"$f":"'Rate Design'!K5/100","v":0.11763},{"$f":"F82-D82","v":2.250000000000002E-3},{"$f":"'Rate Design'!K15/100","v":0.11988},null,{"$f":"F82+G82","v":0.11988},null,{"$f":"N82-D82","v":2.7599999999999986E-3},0,0,{"$f":"F82+J82+K82+L82","v":0.12264},{"$f":"'Rate Design'!K27/100","v":0.12039},{"$f":"O13","v":{"$error":"#REF!"}},{"$f":"P13","v":2.47E-3},{"$f":"M82+O82","v":{"$error":"#REF!"}},-5.7539907672081786E-3,{"$f":"N82+R82","v":0.11463600923279182},{"$f":"S82-R82-N82","v":0},null,{"$f":"J82/D82","v":2.3463402193318019E-2},{"$f":"(J82+L82)/F82","v":2.3023023023023011E-2},null,{"$f":"D82+E82-F82","v":0},{"$f":"D82+J82-N82","v":0},{"$f":"F82+G82+J82+K82+L82-M82","v":0}]
["Next 80 kW/kWh",null,null,{"$f":"'Rate Design'!K5/100","v":0.11763},{"$f":"F82-D82","v":2.250000000000002E-3},{"$f":"'Rate Design'!K15/100","v":0.11988},null,{"$f":"F83+G83","v":0.11988},null,{"$f":"N82-D82","v":2.7599999999999986E-3},{"$f":"K82","v":0},{"$f":"L82","v":0},{"$f":"F83+J83+K83+L83","v":0.12264},{"$f":"'Rate Design'!K27/100","v":0.12039},null,null,null,-5.7539907672081786E-3,{"$f":"N83+R83","v":0.11463600923279182},{"$f":"S83-R83-N83","v":0},null,{"$f":"J83/D83","v":2.3463402193318019E-2},{"$f":"(J83+L83)/F83","v":2.3023023023023011E-2},null,{"$f":"D83+E83-F83","v":0},{"$f":"D83+J83-N83","v":0},{"$f":"F83+G83+J83+K83+L83-M83","v":0}]
["All additional kWhs",null,null,{"$f":"'Rate Design'!K6/100","v":8.4010000000000001E-2},{"$f":"F84-D84","v":3.259999999999999E-3},{"$f":"'Rate Design'!K16/100","v":8.727E-2},null,{"$f":"F84+G84","v":8.727E-2},null,{"$f":"N84-D84","v":1.9699999999999995E-3},{"$f":"K82","v":0},{"$f":"L82","v":0},8.924E-2,{"$f":"'Rate Design'!K28/100","v":8.5980000000000001E-2},{"$f":"O82","v":{"$error":"#REF!"}},{"$f":"P82","v":2.47E-3},{"$f":"M84+O84","v":{"$error":"#REF!"}},-5.7539907672081786E-3,8.0226009232791828E-2,{"$f":"S84-R84-N84","v":0},null,{"$f":"J84/D84","v":2.3449589334603019E-2},2.2573622092357047E-2,null,{"$f":"D84+E84-F84","v":0},{"$f":"D84+J84-N84","v":0},{"$f":"F84+G84+J84+K84+L84-M84","v":0}]
[]
[]
["(1) Includes all present rate adjustments:  Schedule 59 (BPA Residential Exchange), "]
["     Schedule 75 (Decoupling), Schedule 76 (Tax Customer Credit), Schedule 78 (Residual Tax Customer Credit), "]
["     Schedule 91 (DSM), Schedule 92 (LIRAP), Schedule 93 (ERM), and Schedule 98 (REC Revenue)."]

{"sheet":"Colstrip","index":4,"n_rows":48,"n_cols":18,"rows_kept":48,"cut":false,"hidden":false,"merged":[[47,1,47,9],[0,0,0,11],[1,0,1,11],[2,0,2,11],[3,0,3,11],[4,0,4,11]]}
["AVISTA UTILITIES"]
["WASHINGTON ELECTRIC"]
["PROPOSED INCREASE BY SERVICE SCHEDULE"]
["12 MONTHS ENDED SEPTEMBER 30, 2021"]
["(000s of Dollars)"]
[]
[null,"Schedule 99 - Colstrip"]
[]
[null,null,null,null,null,null,null,"Colstrip"]
[null,null,null,"Base Tariff",null,"Base Tariff","Proportional ","Base ","Base Tariff","Schedule 99","Total","Percent"]
[null,null,null,"Revenue","Proposed","Revenue","Allocation of RY1","Rate","Revenue","Colstrip","Colstrip","Change",null,null,"Base","Schedule 99"]
[null,"Type of","Schedule","Under Present","General","Under Proposed","Base Revenue","Revenue","Under Proposed","Rate ","Net ","on ",null,"Billing","Rate ","Colstrip"]
["No.","Service","Number","Rates(1)","Increase","Rates(1)","Spread","Reduction","Rates(1)","Revenue","Impact","Revenue",null,"Determinants","Reduction","Rate"]
[null,"(a)","(b)","(c)","(d)","(e)","(f)","(g)","(h)","(i)","(j)","(k)"]
[null,null,null,{"$f":"IF(Base1_Billing2<>1,\"ERROR\",\"\")","v":""}]
[1,"Residential","1/2",253459.08989999999,26025.316049999983,279484.40594999999,{"$f":"E16/$E$30","v":0.68488028202765827},{"$f":"-$H$41*G16","v":-16337.365737023085},{"$f":"F16+H16","v":263147.04021297692},{"$f":"-H16","v":16337.365737023085},{"$f":"H16+J16","v":0},{"$f":"(H16+J16)/F16","v":0},null,2499403391.3769703,{"$f":"H16*1000/N16","v":-6.536506189192018E-3},{"$f":"-O16","v":6.536506189192018E-3}]
[]
[2,"General Service","11/12",81570.42638307692,3263.8133269230725,84833.83971,{"$f":"E18/$E$30","v":8.5890268826483845E-2},{"$f":"-$H$41*G18","v":-2048.855503497809},{"$f":"F18+H18","v":82784.984206502195},{"$f":"-H18","v":2048.855503497809},{"$f":"H18+J18","v":0},{"$f":"(H18+J18)/F18","v":0},null,634803427.26661992,{"$f":"H18*1000/N18","v":-3.2275432291219838E-3},{"$f":"-O18","v":3.2275432291219838E-3}]
[]
[3,"Large General Service","21/22",131152.68517692306,5247.0461030769347,136399.73127999998,{"$f":"E20/$E$30","v":0.13808087509805508},{"$f":"-$H$41*G20","v":-3293.827865924789},{"$f":"F20+H20","v":133105.90341407518},3293.827865924789,{"$f":"H20+J20","v":0},{"$f":"(H20+J20)/F20","v":0},null,1300358711.78708,{"$f":"H20*1000/N20","v":-2.5330148028139782E-3},2.5330148028139782E-3]
[]
[4,"Extra Large General Service",25,41217.656242999998,823.04935440000145,42040.705597399996,{"$f":"E22/$E$30","v":2.1659305611551081E-2},{"$f":"-$H$41*G22","v":-516.66839690323616},{"$f":"F22+H22","v":41524.037200496758},516.66839690323616,{"$f":"H22+J22","v":0},{"$f":"(H22+J22)/F22","v":0},null,561491715.25999987,{"$f":"H22*1000/N22","v":-9.2017100673336171E-4},9.2017100673336171E-4]
[]
[5,"Extra Large General Service - Special Contract","25I",21772.9124414,435.19906700000166,22208.111508400001,{"$f":"E24/$E$30","v":1.1452666287414214E-2},{"$f":"-$H$41*G24","v":-273.19577262118383},{"$f":"F24+H24","v":21934.915735778817},273.19577262118383,{"$f":"H24+J24","v":0},{"$f":"(H24+J24)/F24","v":0},null,459738120,{"$f":"H24*1000/N24","v":-5.9424215816861962E-4},5.9424215816861962E-4]
[]
[6,"Pumping Service","30/31/32",14578.56552,1496.6072700000013,16075.57279,{"$f":"E26/$E$30","v":3.9384605635259716E-2},{"$f":"-$H$41*G26","v":-939.49369482018994},{"$f":"F26+H26","v":15136.07909517981},939.49369482018994,{"$f":"H26+J26","v":0},{"$f":"(H26+J26)/F26","v":0},null,163276886.04826,{"$f":"H26*1000/N26","v":-5.7539907672081786E-3},5.7539907672081786E-3]
[]
[7,"Street & Area Lights","41-48",6900.6056423279988,708.77220000000023,7609.577842327999,{"$f":"E28/$E$30","v":1.8651996513577948E-2},{"$f":"-$H$41*G28","v":-444.93102920970995},{"$f":"F28+H28","v":7164.6468131182892},444.93102920970995,{"$f":"H28+J28","v":0},{"$f":"(H28+J28)/F28","v":0},null,16979796.48079,{"$f":"H28/F28","v":-5.8469870264654805E-2},{"$f":"J28*1000/N28","v":2.6203554896142615E-2},null,{"$f":"F28+H28","v":7164.6468131182892}]
[null,null,null,null,null,null,null,null,null,null,null,null,null,null,null,null,null,{"$f":"J28","v":444.93102920970995}]
[8,"Total",null,{"$f":"SUM(D16:D28)","v":550651.94130672794},{"$f":"SUM(E16:E28)","v":37999.80337139999},{"$f":"SUM(F16:F28)+0.4","v":588652.34467812791},{"$f":"SUM(G16:G28)","v":1.0000000000000002},{"$f":"SUM(H16:H28)","v":-23854.338},{"$f":"F30+H30","v":564798.00667812792},{"$f":"SUM(J16:J28)","v":23854.338},{"$f":"H30+J30","v":0},{"$f":"(H30+J30)/F30","v":0},null,{"$f":"SUM(N16:N28)","v":5636052048.2197199},null,null,null,{"$f":"SUM(R28:R29)","v":7609.577842327999}]
[null,null,null,{"$f":"ROUND(D30-'[1]Pres & Prop Rev'!C205/1000,0)","v":0},null,null,null,null,null,null,null,null,null,null,null,null,null,{"$f":"R29/R28","v":6.210090194467819E-2}]
[]
[]
[]
["(1) Excludes all present rate adjustments:  Schedule 59 (BPA Residential Exchange), Schedule 75 (Decoupling), Schedule 76 (Tax Credit)"]
["      Scheduke 89 (Low Income Discount), Schedule 91 (DSM), Schedule 92 (LIRAP), Schedule 93 (ERM) and Schedule 98 (REC Revenue)."]
[]
[]
[]
[]
[null,null,null,null,null,null,"Colstrip Rev Req",23854.338]
[]
[]
[]
[]
[]
[]
[null,"The Settling Parties agreed that the costs removed from base rates would be allocated to the rate schedules through separate Tariff Schedule 99 using a proportional allocation of the Rate Year 1 base revenue spread.  For rate design, revenue would be recovered through the volumetric charges on a uniform cent per kWh basis."]

{"sheet":"Rate Spread GRC","index":5,"n_rows":79,"n_cols":17,"rows_kept":79,"cut":false,"hidden":false,"merged":[]}
[]
[]
["Avista"]
["Electric"]
["Rate Spread"]
[]
[]
[]
[null,null,null,"Base Tariff",null,"Base",null,null,null,"Adjusted Billed",null,null,"Percent"]
[null,null,null,"Revenue","Percentage","Tariff","Proposed","Proposed",null,"Revenue","LIRAP ","Tax","Increase",null,"Total "]
[null,"Type of","Schedule","Under Present","of Base","Percent","General","Base Tariff",null,"at Present","Rate ","Customer","on Billed",null,"Base"]
["No.","Service","Number","Rates(1)","Increase","Increase","Increase","Revenue",null,"Rates (2)","Change","Credit","Revenue",null,"Change","GRC","Tax"]
[null,"(a)","(b)","(e)","(f)","(g)","(h)","(i)",null,"(j)","(k)","(l)","(m)"]
[]
[1,"Residential","1/2",{"$f":"'Pres & Prop Rev'!$D$152/1000","v":279484.40594999999},1.06489847605751,{"$f":"E15*$E$36","v":2.2630209239662587E-2},{"$f":"F15*D15","v":6324.7905858712993},{"$f":"D15+G15","v":285809.19653587131},null,{"$f":"'Att A pg 1'!I47+'Att A pg 1'!J47","v":253325.06171977357},0,{"$f":"'Att A pg 1'!M47","v":0},{"$f":"IF(J15=0,0,(G15+K15+L15)/J15)","v":2.4967093831670468E-2},{"$f":"+G15+K15+L15","v":6324.7905858712993},{"$f":"(G15)/D15","v":2.2630209239662587E-2},{"$f":"(G15)/J15","v":2.4967093831670468E-2},{"$f":"L15/J15","v":0}]
[]
[2,"General Service","11/12",{"$f":"'Pres & Prop Rev'!$E$152/1000","v":84834.439706153833},1.0646947567368821,{"$f":"E17*$E$36","v":2.262587999048473E-2},{"$f":"F17*D17","v":1919.4538518514494},{"$f":"D17+G17","v":86753.893558005278},null,{"$f":"'Att A pg 1'!I49+'Att A pg 1'!J49","v":90670.354211253478},0,{"$f":"'Att A pg 1'!M49","v":0},{"$f":"IF(J17=0,0,(G17+K17+L17)/J17)","v":2.1169585897715816E-2},{"$f":"+G17+K17+L17","v":1919.4538518514494},{"$f":"(G17)/D17","v":2.262587999048473E-2},{"$f":"(G17)/J17","v":2.1169585897715816E-2},{"$f":"L17/J17","v":0}]
[]
[3,"Transportation - General Service",13,{"$f":"'Pres & Prop Rev'!$F$152/1000","v":0},0,{"$f":"E19*$E$36","v":0},{"$f":"F19*D19","v":0},{"$f":"D19+G19","v":0},null,{"$f":"'Att A pg 1'!I51+'Att A pg 1'!J51","v":0},null,{"$f":"'Att A pg 1'!M51","v":0},0,0,{"$error":"#DIV/0!"},{"$error":"#DIV/0!"},{"$f":"IF(J19=0,0,L19/J19)","v":0}]
[null,null,null,null,null,null,null,null,null,null,null,{"$f":"'Att A pg 1'!M52","v":0},0,0,{"$error":"#DIV/0!"},{"$error":"#DIV/0!"}]
[3,"Large General Service","21/22",{"$f":"'Pres & Prop Rev'!$G$152/1000","v":136399.73128384617},1.0647546931287104,{"$f":"E21*$E$36","v":2.2627153701658746E-2},{"$f":"F21*D21","v":3086.3376846245378},{"$f":"D21+G21","v":139486.0689684707},null,{"$f":"'Att A pg 1'!I53+'Att A pg 1'!J53","v":148055.55157677952},0,{"$f":"'Att A pg 1'!M53","v":0},2.0845808561416941E-2,3086.3376846245378,2.2627153701658746E-2,2.0845808561416941E-2,0]
[]
[5,"Transportation - Large General Service",23,{"$f":"'Pres & Prop Rev'!$H$152/1000","v":0},0,{"$f":"E23*$E$36","v":0},{"$f":"F23*D23","v":0},{"$f":"D23+G23","v":0},null,{"$f":"'Att A pg 1'!I55+'Att A pg 1'!J55","v":0},null,{"$f":"'Att A pg 1'!M55","v":0},0,0,{"$error":"#DIV/0!"},{"$error":"#DIV/0!"},{"$f":"IF(J23=0,0,L23/J23)","v":0}]
[null,null,null,null,null,null,null,null,null,null,null,{"$f":"'Att A pg 1'!M56","v":0},0,0,{"$error":"#DIV/0!"},{"$error":"#DIV/0!"}]
[4,"Extra Large General Service",25,{"$f":"'Pres & Prop Rev'!$I$152/1000-0.2","v":42040.505593000002},0.47046797746103541,{"$f":"E25*$E$36","v":9.9979378409112418E-3},{"$f":"F25*D25","v":420.31836171929541},{"$f":"D25+G25","v":42460.823954719301},null,{"$f":"'Att A pg 1'!I57+'Att A pg 1'!J57","v":42245.100557400001},0,{"$f":"'Att A pg 1'!M57","v":0},9.9495173682494394E-3,420.31836171929541,9.9979378409112418E-3,9.9495173682494394E-3,0]
[]
[5,"Extra Large General Service - Specific Contract","25I",{"$f":"'Pres & Prop Rev'!$J$152/1000","v":22208.111511399999},0.47074970153658247,{"$f":"E27*$E$36","v":1.0003924772924782E-2},{"$f":"F27*D27","v":222.16827690877048},{"$f":"D27+G27","v":22430.27978830877},null,{"$f":"'Att A pg 1'!I59+'Att A pg 1'!J59","v":22880.4967884},0,{"$f":"'Att A pg 1'!M59","v":0},9.7099411329829959E-3,222.16827690877048,1.0003924772924782E-2,9.7099411329829959E-3,{"$f":"IF(J27=0,0,L27/J27)","v":0}]
[]
[6,"Pumping Service","30/31/32",{"$f":"'Pres & Prop Rev'!$K$152/1000","v":16075.172790000001},1.063407413333824,{"$f":"E29*$E$36","v":2.2598522593296633E-2},{"$f":"F29*D29","v":363.27515548596227},{"$f":"D29+G29","v":16438.447945485961},null,{"$f":"'Att A pg 1'!I61+'Att A pg 1'!J61","v":16509.926763805823},0,{"$f":"'Att A pg 1'!M61","v":0},2.2003438336404897E-2,363.27515548596227,2.2598522593296633E-2,2.2003438336404897E-2,0]
[null,null,null,null,null,null,null,null,null,null,null,null,null,0]
[7,"Street & Area Lights","41-48",{"$f":"'Pres & Prop Rev'!$L$152/1000","v":7163.502482328},1.0644584770776124,{"$f":"E31*$E$36","v":2.2620858799968856E-2},{"$f":"F31*D31","v":162.04457816596809},{"$f":"D31+G31","v":7325.5470604939683},null,{"$f":"'Att A pg 1'!I63+'Att A pg 1'!J63","v":7460.572619997999},0,{"$f":"'Att A pg 1'!M63","v":0},2.1720126110911248E-2,null,2.2620858799968856E-2,2.1720126110911248E-2,0]
[]
[8,"Total",null,{"$f":"SUM(D15:D31)+0.4","v":588206.26931672788},null,{"$f":"G36/$D$33","v":2.1251048572672047E-2},{"$f":"SUM(G15:G31)","v":12498.388494627283},{"$f":"D33+G33+0.3","v":600704.95781135524},null,{"$f":"'Att A pg 1'!I65+'Att A pg 1'!J65","v":581147.06423741032},0,{"$f":"SUM(L15:L31)","v":0},{"$f":"IF(J33=0,0,(G33+K33+L33)/J33)","v":2.1506412513720347E-2},12498.388494627283,2.1248308878355989E-2,2.1506412513720347E-2,0]
[]
[]
[null,"Revenue Requirement",null,null,{"$f":"G36/(D33)","v":2.1251048572672047E-2},null,12500]
[]
[]
[]
[]
[]
[null,null,null,null,null,null,null,null,null,null,null,null,null,null,"LIRAP Change"]
[null,null,null,null,null,null,null,null,null,null,null,null,"LIRAP"]
[null,null,null,"Schedule 25",null,null,null,null,null,null,null,null,null,null,{"$f":"O15","v":2.2630209239662587E-2}]
[null,null,null,null,"Increase",null,null,null,null,null,null,null,null,null,"x 2"]
[null,null,null,"Base Increase",{"$f":"ROUND(G25*1000,-3)","v":420000},null,null,null,null,null,null,null,null,null,{"$f":"O44*2","v":4.5260418479325173E-2}]
[null,null,null,"MWh",{"$f":"'Pres & Prop Rev'!I23/1000","v":561491.71525999985}]
[]
[null,null,null,"$ Per MWh Change",{"$f":"E46/E47","v":0.74800747470604823}]
[null,null,null,null,{"$f":"E46/E49","v":561491.71525999985}]
[]
[]
[]
[]
[null,null,null,"Special Contract Rate Spread"]
[]
[null,null,null,null,"Rate Calculation"]
[null,null,null,"Schedule 25"]
[]
[null,null,null,"$ Per MWh Change",{"$f":"E49","v":0.74800747470604823}]
[null,null,null,"IEP Rate Factor",{"$f":"0.6509","v":0.65090000000000003}]
[null,null,null,null,{"$f":"E60*E61","v":0.48687806528616684}]
[]
[null,null,null,"IEP MWh's",{"$f":"'Pres & Prop Rev'!J37/1000","v":459738.12}]
[]
[null,null,null,"IEP Increase",{"$f":"(E60*E61)*E64","v":223836.4064038996},{"$f":"(E66/1000)/D27","v":1.0079038295939686E-2}]
[]
[]
[]
[null,null,null,"Rate Factor Calculation for future Special Contract Rate Changes"]
[null,null,null,"UE-190334"]
[]
[null,null,null,null,null,"Rate Year Revenue",null,"MWh",null,"Rate Factor"]
[null,null,null,"Schedule 25",null,45108846.983799994,null,620117.68591500004,null,{"$f":"F74/H74","v":72.742397142311304}]
[]
[null,null,null,"Special Contract",null,21357310.436499998,null,451099.44799999997,null,{"$f":"F76/H76","v":47.345015674902797}]
[]
[]
[null,null,null,null,null,null,null,null,null,{"$f":"J76/J74","v":0.65085861251284116}]

{"sheet":"Bill Determ","index":6,"n_rows":111,"n_cols":7,"rows_kept":111,"cut":false,"hidden":false,"merged":[]}
["AVISTA UTILITIES"]
["WASHINGTON ELECTRIC"]
["ACTUAL / PRO FORMA BILLING DETERMINANTS BY RATE SCHEDULE"]
["12 MONTHS ENDED SEPTEMBER 30, 2021"]
[]
[]
[]
["Schedule 1, 2","0-800 kWhs","801-1500 kWhs","over 1500 kWhs","Total kWhs","Total Billings(2)"]
["kWhs per billing run",{"$f":"'Block Data'!O21","v":1699114425.539248},{"$f":"'Block Data'!O22","v":560062332.55344331},{"$f":"'Block Data'!O23","v":314000634.28427869},{"$f":"B9+C9+D9","v":2573177392.3769703},{"$f":"'REVRUNS 12ME0921'!P39","v":2681552}]
["Total kWhs per Rev. Run",null,null,null,{"$f":"'Block Data'!O13","v":2573177392.3769703}]
["Adjust. kWhs to Actual",null,null,null,{"$f":"E10-E9","v":0}]
[]
[]
["Schedule 11,12, 13","0-3,650 kWhs","over 3,650 kWhs","Total kWhs","kw over 20(1)","Total Billings(2)","kvar billed(1)"]
["kWhs per Revenue Run",{"$f":"'Block Data'!O38","v":440976955.79465711},{"$f":"'Block Data'!O39","v":206157623.47196287},{"$f":"B15+C15","v":647134579.26661992},{"$f":"'Block Data'!O45","v":555536.70615384611},{"$f":"'REVRUNS 12ME0921'!P40+'REVRUNS 12ME0921'!P41","v":403355},{"$f":"'Block Data'!O49","v":0}]
["Schedule Shifting",0,0,{"$f":"SUM(B16:C16)","v":0},0,0,0]
["Total by Block",{"$f":"SUM(B15:B16)","v":440976955.79465711},206157623.47196287,647134579.26661992,555536.70615384611,403355,0]
["Total kWhs per Rev. Run",null,null,{"$f":"'Block Data'!O31","v":647134579.26661992}]
["Schedule Shifting",null,null,{"$f":"D16","v":0}]
["Total Adjusted kWhs",null,null,{"$f":"D18+D19","v":647134579.26661992}]
["Adjust. kWhs to Actual",null,null,{"$f":"D20-D17","v":0}]
[]
[]
["Not Used","0-3,650 kWhs","over 3,650 kWhs","Total kWhs","kw over 20(1)","Total Billings(2)","kvar billed(1)"]
["kWhs per Revenue Run",{"$f":"'Block Data'!O64","v":0},{"$f":"'Block Data'!O65","v":0},{"$f":"B25+C25","v":0},{"$f":"'Block Data'!O71","v":0},0,{"$f":"'Block Data'!O75","v":0}]
["Schedule Shifting",0,0,{"$f":"SUM(B26:C26)","v":0},0,0,0]
["Total by Block",{"$f":"SUM(B25:B26)","v":0},0,0,0,0,0]
["Total kWhs per Rev. Run",null,null,{"$f":"'Block Data'!O57","v":0}]
["Schedule Shifting",null,null,{"$f":"D26","v":0}]
["Total Adjusted kWhs",null,null,{"$f":"D28+D29","v":0}]
["Adjust. kWhs to Actual",null,null,{"$f":"D30-D27","v":0}]
[]
[]
["Schedule 21,22, 23","0-250,000 kWhs","over 250,000 kWhs","Total kWhs","kw over 50(1)","Total Billings(2)","kvar billed(1)"]
["kWhs per Revenue Run",{"$f":"'Block Data'!O90","v":1174888254.2851541},{"$f":"'Block Data'!O91","v":139885749.101926},{"$f":"B35+C35","v":1314774003.3870802},{"$f":"'Block Data'!O97","v":2804857.7138461536},{"$f":"'REVRUNS 12ME0921'!P42+'REVRUNS 12ME0921'!P43","v":21936},{"$f":"'Block Data'!O101","v":349155.54000000004}]
["Schedule 25 to 21",{"$f":"6*250000","v":1500000},{"$f":"-SUM('WA Sch 25'!P34)-B36","v":3477596.3999999994},{"$f":"SUM(B36:C36)","v":4977596.3999999994},17715,6,0]
["Schedule Shifting",0,0,{"$f":"SUM(B37:C37)","v":0},0,0,0]
["Total",{"$f":"SUM(B35:B37)","v":1176388254.2851541},{"$f":"SUM(C35:C37)","v":143363345.501926},{"$f":"SUM(B38:C38)","v":1319751599.78708},{"$f":"SUM(E35:E37)","v":2822572.7138461536},{"$f":"SUM(F35:F37)","v":21942},{"$f":"SUM(G35:G37)","v":349155.54000000004}]
["Total kWhs per Rev. Run",null,null,{"$f":"'Block Data'!O83","v":1314774003.38708}]
["Schedule Shifting",null,null,{"$f":"D36","v":4977596.3999999994}]
["Schedule Shifting",null,null,{"$f":"D37","v":0}]
["Total adjusted kWhs",null,null,{"$f":"D39+D40+D41","v":1319751599.78708}]
["Adjust. kWhs to Actual",null,null,{"$f":"D42-D38","v":0}]
[]
[]
["Not Used","0-250,000 kWhs","over 250,000 kWhs","Total kWhs","kw over 50(1)","Total Billings(2)","kvar billed(1)"]
["kWhs per Revenue Run",{"$f":"'Block Data'!O116","v":0},{"$f":"'Block Data'!O117","v":0},{"$f":"B47+C47","v":0},{"$f":"'Block Data'!O123","v":0},0,{"$f":"'Block Data'!O127","v":0}]
["Schedule Shifting",0,0,{"$f":"SUM(B48:C48)","v":0},0,0,0]
["Total",{"$f":"SUM(B47:B48)","v":0},{"$f":"SUM(C47:C48)","v":0},{"$f":"SUM(B49:C49)","v":0},{"$f":"SUM(E47:E48)","v":0},{"$f":"SUM(F47:F48)","v":0},{"$f":"SUM(G47:G48)","v":0}]
["Total kWhs per Rev. Run",null,null,{"$f":"'Block Data'!O94","v":0}]
["Schedule Shifting",null,null,{"$f":"D47","v":0}]
["Schedule Shifting",null,null,{"$f":"D48","v":0}]
["Total adjusted kWhs",null,null,{"$f":"D50+D51+D52","v":0}]
["Adjust. kWhs to Actual",null,null,{"$f":"D53-D49","v":0}]
[]
[]
["Schedule 25(3)","0-500,000 kWhs","500,001-6M kWhs","> 6M kWhs","Total kWhs","kva over 3,000","Total Billings(2)"]
["Total",{"$f":"'WA Sch 25'!Q27","v":125726244.40000001},{"$f":"'WA Sch 25'!R27","v":435765470.8599999},{"$f":"'WA Sch 25'!S27","v":0},{"$f":"SUM(B58:D58)","v":561491715.25999987},{"$f":"'WA Sch 25'!P97","v":475862.63199999998},{"$f":"(21*12)","v":252}]
[]
[]
["Schedule 25I","0-500,000 kWhs","500,001-6M kWhs","> 6M kWhs","Total kWhs","kva over 3,000","Total Billings(2)"]
["Total",{"$f":"'WA Sch 25'!Q42","v":6000000},{"$f":"'WA Sch 25'!R42","v":66000000},{"$f":"'WA Sch 25'!S42","v":387738120},{"$f":"SUM(B62:D62)","v":459738120},{"$f":"'WA Sch 25'!P101","v":703831.30999999994},12]
[]
[]
["Schedule 30, 31, & 32","Block 1 kWhs","Block 2 kWhs","Block 3 kWhs","Total kWhs","Total Billings(2)","kvar billed(1)"]
["kWhs per billing run (30,31& 32)",{"$f":"'Block Data'!O144","v":38920078.246799998},{"$f":"'Block Data'!O145","v":12590255.54513},{"$f":"'Block Data'!O146","v":112757486.25633},{"$f":"B66+C66+D66","v":164267820.04826},{"$f":"'REVRUNS 12ME0921'!P46","v":30331},{"$f":"'Block Data'!O151","v":0}]
["Schedule Shifting",0,0,{"$f":"-B67-C67","v":0},{"$f":"SUM(B67:D67)","v":0}]
["Total Schs. 30,31&32",{"$f":"B66+B67","v":38920078.246799998},{"$f":"C66+C67","v":12590255.54513},{"$f":"D66+D67","v":112757486.25633},{"$f":"E66+E67","v":164267820.04826}]
["Total kWhs per Rev. Run",null,null,null,{"$f":"'Block Data'!O136","v":164267820.04826}]
["Adjust kWhs to Actual",null,null,null,{"$f":"E69-E68","v":0}]
[]
[]
[]
[]
[]
[]
[]
[]
[]
[]
[]
[]
[]
[]
[]
[]
["Revenue Runs from this sheet",{"$f":"E10+D18+D39+E69+E58","v":5260845510.3389301}]
[]
["actual Revenue Runs",{"$f":"'REVRUNS 12ME0921'!P342","v":5740382365.6097202}]
["less:"]
["Sch 25 Adj",{"$f":"'REVRUNS 12ME0921'!P338-'Bill Determ'!E58","v":462557058.78999996},"rev. runs too high"]
[]
["Sch shifting",{"$f":"D36","v":4977596.3999999994},"not shown on this sheet"]
["Schs 41-48 St & Area Lt",{"$f":"'REVRUNS 12ME0921'!P341","v":16979796.48079},"not shown on this sheet"]
[null,{"$f":"B89-SUM(B91:B94)","v":5255867913.9389305}]
["Diff",{"$f":"B87-B95","v":4977596.3999996185}]
[]
["from Present Rev tab ",{"$f":"'Pres & Prop Rev'!C20-'Pres & Prop Rev'!C15","v":5742541023.2197199}]
["this sheet + SAL",{"$f":"B87+B94+B93","v":5282802903.2197199}]
["Diff",{"$f":"B98-B99","v":459738120}]
[]
[]
["Rev. Run customers",{"$f":"'REVRUNS 12ME0921'!P48","v":3143223}]
["less:"]
["normalize Sch 25",{"$f":"'REVRUNS 12ME0921'!P44-G58","v":19},"rev. runs too low"]
["Sch Shifting",{"$f":"-F36","v":-6},"not shown on this sheet"]
["Schs 41-48 St & Area Lt",{"$f":"'REVRUNS 12ME0921'!P47","v":5778},"not shown on this sheet"]
[null,{"$f":"B103-SUM(B104:B107)","v":3137432}]
[]
["from Present Rev tab",{"$f":"SUM('Pres & Prop Rev'!D25:L25)","v":3137444}]
["Diff",{"$f":"B108-B110","v":-12}]

{"sheet":"Sp Cnt Exh B","index":7,"n_rows":24,"n_cols":27,"rows_kept":24,"cut":false,"hidden":false,"merged":[[4,3,4,5],[4,7,4,9]]}
["Inland Empire Paper"]
["Exhibit B - Rate Design"]
[]
[]
[null,null,null,"Schedule 25",null,null,null,"Special Contract"]
[null,null,null,"Present",2019,"Present ",null,"Proposed",2019,"Proposed",null,null,"Revised Base"]
[null,null,null,"Base Tariff","Billing ","Base",null,"Special Contract","Billing ","Special Contract",null,"Schedule 99","Rate With",null,null,"LIRAP ","DSM",null,null,null,"Rate Factor Calculation for future IEP Special Contract Rate Changes from UE-200900"]
[null,null,null,"Sch. Rate","Determinants","Revenue",null,"Rate","Determinants","Rate",null,"Colstrip Rates","Colstrip "]
["IEP Special Contract"]
["Energy Charge:",null,null,null,null,null,null,null,null,null,null,null,null,null,null,null,null,null,null,null,null,null,"Rate Year Revenue",null,"MWh",null,"Rate Factor"]
["First 500,000 kWhs",null,null,4.7820000000000001E-2,6000000,{"$f":"D11*E11","v":286920},null,{"$f":"'Att A pg 3'!N68","v":4.8430000000000001E-2},{"$f":"E11","v":6000000},{"$f":"H11*I11","v":290580},null,{"$f":"'Att A pg 3'!R68","v":-5.9424215816861962E-4},{"$f":"H11+L11","v":4.7835757841831382E-2},null,null,{"$f":"0.00093*I11","v":5580},{"$f":"0.00182*I11","v":10920},null,null,null,"Schedule 25",null,45108846.983799994,null,620117.68591500004,null,{"$f":"W11/Y11","v":72.742397142311304}]
["500,000 - 6,000,000 kWhs",null,null,4.3029999999999999E-2,66000000,{"$f":"D12*E12","v":2839980},null,{"$f":"'Att A pg 3'!N69","v":4.3579999999999994E-2},{"$f":"E12","v":66000000},{"$f":"H12*I12","v":2876279.9999999995},null,{"$f":"L11","v":-5.9424215816861962E-4},{"$f":"H12+L12","v":4.2985757841831375E-2},null,null,{"$f":"0.00093*I12","v":61380},{"$f":"0.00182*I12","v":120120}]
["All over 6,000,000 kWhs",null,null,3.6790000000000003E-2,387738120,14264885.434800001,null,{"$f":"'Att A pg 3'!N70","v":3.7260000000000001E-2},387738120,{"$f":"H13*I13","v":14447122.351200001},null,{"$f":"L11","v":-5.9424215816861962E-4},{"$f":"H13+L13","v":3.6665757841831383E-2},null,null,null,705683.37840000005,null,null,null,"Special Contract",null,21357310.436499998,null,451099.44799999997,null,{"$f":"W13/Y13","v":47.345015674902797}]
[null,null,null,null,0,null,null,null,null,null,null,null,null,null,null,{"$f":"SUM(P11:P13)","v":66960},{"$f":"SUM(Q11:Q13)","v":836723.37840000005}]
["Demand Charge:"]
["3,000 kva or less",null,null,30650,12,367800,null,30650,{"$f":"E16","v":12},{"$f":"H16*I16","v":367800},null,null,{"$f":"H16","v":30650},null,null,null,null,null,null,null,null,null,null,null,null,null,{"$f":"AA13/AA11","v":0.65085861251284116}]
["Over 3,000 kva",null,null,8.3000000000000007,703831.30999999994,{"$f":"D17*E17","v":5841799.8729999997},null,8.3000000000000007,{"$f":"E17","v":703831.30999999994},{"$f":"H17*I17","v":5841799.8729999997},null,null,{"$f":"H17","v":8.3000000000000007}]
[null,null,null,null,0]
["Primary Volt. Discount"]
["11 - 60 kv",null,null,0.2,0,0,null,0.2,{"$f":"E20","v":0},{"$f":"H20*I20","v":0},null,null,{"$f":"H20","v":0.2}]
["60 - 115 kv",null,null,1.52,119510.13315789473,{"$f":"-D21*E21","v":-181655.40239999999},null,1.52,{"$f":"E21","v":119510.13315789473},{"$f":"-H21*I21","v":-181655.40239999999},null,null,{"$f":"H21","v":1.52}]
["115 or higher kv",null,null,1.93,627781.54880829016,{"$f":"-D22*E22","v":-1211618.3891999999},null,1.93,627781.54880829016,{"$f":"-H22*I22","v":-1211618.3891999999},null,null,{"$f":"H22","v":1.93}]
[]
[null,null,null,"Total Present Revenue",0,{"$f":"SUM(F11:F22)","v":22208111.516200002},null,"Total Proposed Revenue",null,{"$f":"SUM(J11:J22)","v":22430308.432600003},null,null,null,null,{"$f":"J24-F24","v":222196.91640000045}]

{"sheet":"Bill Impact","index":8,"n_rows":28,"n_cols":13,"rows_kept":28,"cut":false,"hidden":false,"merged":[]}
[]
[]
["Schedule 001 Bill Impact"]
[]
[]
[]
["Schedule 001 Present",null,null,null,null,null,"Schedule 001 Proposed"]
[null,"Basic Charge","Block 1","Block 2","Total Bill",null,"Basic Charge","Block 1","Block 2","Total Bill",null,"Bill Impact","% Change"]
[null,{"$f":"'Att A pg 3'!D11","v":9},{"$f":"'Att A pg 3'!H13","v":8.48E-2},{"$f":"'Att A pg 3'!H14","v":9.9610000000000004E-2},null,null,{"$f":"'Att A pg 3'!M11","v":9},{"$f":"'Att A pg 3'!M13","v":8.7150000000000005E-2},{"$f":"'Att A pg 3'!M14","v":0.10233}]
[100,{"$f":"$B$9","v":9},{"$f":"A10*$C$9","v":8.48},null,{"$f":"SUM(B10:D10)","v":17.48},null,{"$f":"$G$9","v":9},{"$f":"A10*$H$9","v":8.7149999999999999},null,{"$f":"SUM(G10:I10)","v":17.715},null,{"$f":"J10-E10","v":0.23499999999999943},{"$f":"L10/E10","v":1.3443935926773423E-2}]
[200,{"$f":"$B$9","v":9},16.96,null,{"$f":"SUM(B11:D11)","v":25.96},null,{"$f":"$G$9","v":9},17.43,null,{"$f":"SUM(G11:I11)","v":26.43},null,{"$f":"J11-E11","v":0.46999999999999886},{"$f":"L11/E11","v":1.8104776579352805E-2}]
[300,{"$f":"$B$9","v":9},25.44,null,{"$f":"SUM(B12:D12)","v":34.44},null,{"$f":"$G$9","v":9},26.145000000000003,null,{"$f":"SUM(G12:I12)","v":35.145000000000003},null,0.7050000000000054,{"$f":"L12/E12","v":2.0470383275261482E-2}]
[400,{"$f":"$B$9","v":9},33.92,null,{"$f":"SUM(B13:D13)","v":42.92},null,{"$f":"$G$9","v":9},34.86,null,{"$f":"SUM(G13:I13)","v":43.86},null,0.93999999999999773,{"$f":"L13/E13","v":2.1901211556383915E-2}]
[500,{"$f":"$B$9","v":9},42.4,null,{"$f":"SUM(B14:D14)","v":51.4},null,{"$f":"$G$9","v":9},43.575000000000003,null,{"$f":"SUM(G14:I14)","v":52.575000000000003},null,1.1750000000000043,{"$f":"L14/E14","v":2.2859922178988409E-2}]
[600,{"$f":"$B$9","v":9},50.88,null,{"$f":"SUM(B15:D15)","v":59.88},null,{"$f":"$G$9","v":9},52.290000000000006,null,{"$f":"SUM(G15:I15)","v":61.290000000000006},null,1.4100000000000037,{"$f":"L15/E15","v":2.3547094188376815E-2}]
[700,9,59.36,null,{"$f":"SUM(B16:D16)","v":68.36},null,9,61.005000000000003,null,{"$f":"SUM(G16:I16)","v":70.004999999999995},null,1.644999999999996,{"$f":"L16/E16","v":2.4063779988297191E-2}]
[800,9,67.84,null,76.84,null,9,{"$f":"A17*$H$9","v":69.72},null,78.72,null,1.8799999999999955,2.4466423737636588E-2]
[{"$f":"ROUND('Pres & Prop Rev'!D46/'Pres & Prop Rev'!D48,0)","v":932},9,{"$f":"ROUND($C$17,2)","v":67.84},{"$f":"ROUND((A18-$A$17)*$D$9,2)","v":13.15},89.990000000000009,null,9,{"$f":"ROUND($H$17,2)","v":69.72},{"$f":"ROUND((A18-$A$17)*$I$9,2)","v":13.51},{"$f":"SUM(G18:I18)","v":92.23},null,2.2399999999999949,{"$f":"L18/E18","v":2.4891654628291973E-2}]
[1000,9,{"$f":"ROUND($C$17,2)","v":67.84},{"$f":"ROUND((A19-$A$17)*$D$9,2)","v":19.920000000000002},96.76,null,9,{"$f":"ROUND($H$17,2)","v":69.72},{"$f":"ROUND((A19-$A$17)*$I$9,2)","v":20.47},99.19,null,2.4299999999999926,2.5113683340223156E-2]
[1100,9,{"$f":"$C$17","v":67.84},{"$f":"(A20-$A$17)*$D$9","v":29.883000000000003},{"$f":"SUM(B20:D20)","v":106.72300000000001},null,9,{"$f":"$H$17","v":69.72},{"$f":"(A20-$A$17)*$I$9","v":30.699000000000002},{"$f":"SUM(G20:I20)","v":109.419},null,2.6959999999999837,{"$f":"L20/E20","v":2.5261658686506032E-2}]
[1200,9,{"$f":"$C$17","v":67.84},{"$f":"(A21-$A$17)*$D$9","v":39.844000000000001},116.684,null,9,{"$f":"$H$17","v":69.72},{"$f":"(A21-$A$17)*$I$9","v":40.932000000000002},119.652,null,2.9680000000000035,2.5436220904322817E-2]
[1300,9,{"$f":"$C$17","v":67.84},{"$f":"(A22-$A$17)*$D$9","v":49.805},{"$f":"SUM(B22:D22)","v":126.64500000000001},null,9,{"$f":"$H$17","v":69.72},{"$f":"(A22-$A$17)*$I$9","v":51.164999999999999},{"$f":"SUM(G22:I22)","v":129.88499999999999},null,3.2399999999999807,{"$f":"L22/E22","v":2.5583323463223819E-2}]
[1400,9,{"$f":"$C$17","v":67.84},{"$f":"(A23-$A$17)*$D$9","v":59.766000000000005},{"$f":"SUM(B23:D23)","v":136.60599999999999},null,9,{"$f":"$H$17","v":69.72},{"$f":"(A23-$A$17)*$I$9","v":61.398000000000003},{"$f":"SUM(G23:I23)","v":140.11799999999999},null,3.5120000000000005,{"$f":"L23/E23","v":2.5708973251540933E-2}]
[1500,9,{"$f":"$C$17","v":67.84},{"$f":"(A24-$A$17)*$D$9","v":69.727000000000004},146.56700000000001,null,9,{"$f":"$H$17","v":69.72},{"$f":"(A24-$A$17)*$I$9","v":71.631},150.351,null,3.7839999999999918,2.5817544194805048E-2]
[]
[]
[]
[null,null,null,null,null,null,{"$f":"(G9-B9)","v":0},{"$f":"(H9-C9)*800","v":1.8800000000000039},{"$f":"(I9-D9)*132","v":0.35904000000000003}]

{"sheet":"WA Sch 25","index":9,"n_rows":189,"n_cols":23,"rows_kept":189,"cut":false,"hidden":false,"merged":[]}
["Washington Schedule 25 Billing Determinants",null,null,null,null,null,null,null,null,null,null,null,null,null,null,null,"1st",{"$f":"Q2","v":500000},{"$f":"R2","v":6000000}]
[null,null,null,null,null,null,null,null,null,null,null,null,null,null,null,"12-mo Ended",500000,6000000,99999999]
["KWHs",null,"Acct No.","2020-10-31",{"$f":"EOMONTH(D3,1)","v":"2020-11-30"},"2020-12-31","2021-01-31","2021-02-28","2021-03-31","2021-04-30","2021-05-31","2021-06-30","2021-07-31","2021-08-31","2021-09-30","Total","kwhs/mo","kwhs/mo","kwhs/mo"]
[1,"Goodrich - North 2311008572","2311008572",2458068.9,1544554.2,1189675.2,1511697.6,1882095.6,2261666.4,1799479.5,2309876.1,2695404.6,2647274.7000000002,2478096.6,3166680.3,{"$f":"SUM(D4:O4)","v":25944569.700000003},{"$f":"Q$2*12-SUMPRODUCT(--($D4:$O4<=Q$2),Q$2-$D4:$O4)","v":6000000},{"$f":"R$2*12-SUM($Q4:Q4)-SUMPRODUCT(--($D4:$O4<=R$2),R$2-$D4:$O4)","v":19944569.700000003},{"$f":"S$2*12-SUM($Q4:R4)-SUMPRODUCT(--($D4:$O4<=S$2),S$2-$D4:$O4)","v":0}]
[2,"Boise Cascade Plywood","8920023327",3024031.5,2843954.4,2473554.2999999998,2885658.3,2744878.5,2980838.7,2910555.9,2901796.8,2761634.4,2818435.2,2414878.2000000002,2830543.8,33590759.999999993,{"$f":"Q$2*12-SUMPRODUCT(--($D5:$O5<=Q$2),Q$2-$D5:$O5)","v":6000000},{"$f":"R$2*12-SUM($Q5:Q5)-SUMPRODUCT(--($D5:$O5<=R$2),R$2-$D5:$O5)","v":27590759.999999993},{"$f":"S$2*12-SUM($Q5:R5)-SUMPRODUCT(--($D5:$O5<=S$2),S$2-$D5:$O5)","v":0}]
[3,"Boise Cascade Sawmill","9920023116",1281416.5,1231090.7,1371597.5,1378001.1,1276487.1000000001,1360394,1246655.2,1204011.2,1244033.7,1159707.5,1143046.8,1107361.5,15003802.799999999,6000000,{"$f":"R$2*12-SUM($Q6:Q6)-SUMPRODUCT(--($D6:$O6<=R$2),R$2-$D6:$O6)","v":9003802.799999997},{"$f":"S$2*12-SUM($Q6:R6)-SUMPRODUCT(--($D6:$O6<=S$2),S$2-$D6:$O6)","v":0}]
[4,"City of Spokane","8970099313",1273549.2,1311429,1427570.55,1480744.65,1399653.15,1642623.15,1599610.95,1655249.4,1732733.1,1807320.9,1615553.1,1391827.5,18337864.650000002,6000000,{"$f":"R$2*12-SUM($Q7:Q7)-SUMPRODUCT(--($D7:$O7<=R$2),R$2-$D7:$O7)","v":12337864.649999999},{"$f":"S$2*12-SUM($Q7:R7)-SUMPRODUCT(--($D7:$O7<=S$2),S$2-$D7:$O7)","v":0}]
[5,"Empire Health Services","0080095044",1565237.1,1501969.35,1579521.3,1563613.8,1462822.2,1593162.9,1625069.25,1785898.8,1999167.45,2213329.65,2118270,1807545.6,20815607.400000002,6000000,{"$f":"R$2*12-SUM($Q8:Q8)-SUMPRODUCT(--($D8:$O8<=R$2),R$2-$D8:$O8)","v":14815607.399999999},{"$f":"S$2*12-SUM($Q8:R8)-SUMPRODUCT(--($D8:$O8<=S$2),S$2-$D8:$O8)","v":0}]
[6,"Gonzaga University","1420028876",1943260.2,1995587.3,1999254.6,2129810.2000000002,2099549.2000000002,2016858.2,1782077.5,1438536.4,1704057.6,1870433.6,1812687.8,1940272.6,22732385.200000003,6000000,{"$f":"R$2*12-SUM($Q9:Q9)-SUMPRODUCT(--($D9:$O9<=R$2),R$2-$D9:$O9)","v":16732385.200000003},{"$f":"S$2*12-SUM($Q9:R9)-SUMPRODUCT(--($D9:$O9<=S$2),S$2-$D9:$O9)","v":0}]
[7,"Honeywell Electronics","0170122152",1313485.6000000001,1266305.6000000001,1310813.7,1312558.8,1225321.3,1312726.1000000001,1295624.3999999999,1371136.9,1504815.9,1596914.9,1557619.7,1419316.5,16486639.4,6000000,{"$f":"R$2*12-SUM($Q10:Q10)-SUMPRODUCT(--($D10:$O10<=R$2),R$2-$D10:$O10)","v":10486639.399999999},{"$f":"S$2*12-SUM($Q10:R10)-SUMPRODUCT(--($D10:$O10<=S$2),S$2-$D10:$O10)","v":0}]
[8,"Huntwood Industries","8640841982",983448.9,872745.3,973484.4,955497.9,914768.4,1072692.6000000001,1100330.7,1063473.6000000001,1203917.3999999999,1309969.5,1190796.6000000001,1071226.8,12712352.100000001,6000000,{"$f":"R$2*12-SUM($Q11:Q11)-SUMPRODUCT(--($D11:$O11<=R$2),R$2-$D11:$O11)","v":6712352.1000000015},{"$f":"S$2*12-SUM($Q11:R11)-SUMPRODUCT(--($D11:$O11<=S$2),S$2-$D11:$O11)","v":0}]
[null,null,null,null,null,null,null,null,null,null,null,null,null,null,null,0,0,{"$f":"R$2*12-SUM($Q12:Q12)-SUMPRODUCT(--($D12:$O12<=R$2),R$2-$D12:$O12)","v":0},{"$f":"S$2*12-SUM($Q12:R12)-SUMPRODUCT(--($D12:$O12<=S$2),S$2-$D12:$O12)","v":0},null,null,{"$f":"P12*0.00205","v":0},"Sch 91"]
[9,"Simplot - Othello","4250473907",5681671.7999999998,4277807.0999999996,4873619.0999999996,5149987.5,4659759.3,5590407.9000000004,5534106.9000000004,5645045.7000000002,5697176.0999999996,5806479,5842979.0999999996,5400992.0999999996,64160031.600000009,6000000,{"$f":"R$2*12-SUM($Q13:Q13)-SUMPRODUCT(--($D13:$O13<=R$2),R$2-$D13:$O13)","v":58160031.600000001},{"$f":"S$2*12-SUM($Q13:R13)-SUMPRODUCT(--($D13:$O13<=S$2),S$2-$D13:$O13)","v":0}]
[10,"McCaine Foods Inc","9060132009",5108659.2230000002,4901879.5,4318007.4000000004,3850310.8,4488337.7,5030074.7,4611767.3,5244211.7,4995937.8,3964338.7,5541515,5633071.5,57688111.322999999,6000000,{"$f":"R$2*12-SUM($Q14:Q14)-SUMPRODUCT(--($D14:$O14<=R$2),R$2-$D14:$O14)","v":51688111.322999999},{"$f":"S$2*12-SUM($Q14:R14)-SUMPRODUCT(--($D14:$O14<=S$2),S$2-$D14:$O14)","v":0}]
[11,"Sacred Heart Medical Center","0030019644",3221788.5,2928910.95,3036522.3,2999695.65,2730817.95,3012507.75,3024783.3,3270666,3789981.3,4103871.45,3847194.75,3259788,39226527.900000006,6000000,{"$f":"R$2*12-SUM($Q15:Q15)-SUMPRODUCT(--($D15:$O15<=R$2),R$2-$D15:$O15)","v":33226527.900000002},{"$f":"S$2*12-SUM($Q15:R15)-SUMPRODUCT(--($D15:$O15<=S$2),S$2-$D15:$O15)","v":0}]
[12,"Spokane County Combined Master","1080099801",978952.8,848800.05,888017.55,878007.9,807562.35,883466.85,909089.47499999998,984245.85,1146591.6000000001,1307596.5,1222100.25,1011286.5,11865717.674999999,6000000,{"$f":"R$2*12-SUM($Q16:Q16)-SUMPRODUCT(--($D16:$O16<=R$2),R$2-$D16:$O16)","v":5865717.6750000045},{"$f":"S$2*12-SUM($Q16:R16)-SUMPRODUCT(--($D16:$O16<=S$2),S$2-$D16:$O16)","v":0}]
[13,"Spokane Industries","0070121063",532618.80000000005,527129.4,577367.69999999995,774896.4,863699.1,941076,872875.8,859198.8,875872.8,863790,720480,896113.2,9305118,6000000,{"$f":"R$2*12-SUM($Q17:Q17)-SUMPRODUCT(--($D17:$O17<=R$2),R$2-$D17:$O17)","v":3305117.9999999925},{"$f":"S$2*12-SUM($Q17:R17)-SUMPRODUCT(--($D17:$O17<=S$2),S$2-$D17:$O17)","v":0}]
[null,null,null,null,null,null,null,null,null,null,null,null,null,null,null,0,{"$f":"Q$2*12-SUMPRODUCT(--($D18:$O18<=Q$2),Q$2-$D18:$O18)","v":0},{"$f":"R$2*12-SUM($Q18:Q18)-SUMPRODUCT(--($D18:$O18<=R$2),R$2-$D18:$O18)","v":0},{"$f":"S$2*12-SUM($Q18:R18)-SUMPRODUCT(--($D18:$O18<=S$2),S$2-$D18:$O18)","v":0}]
[14,"Vaagen Brothers Lumber","2470070232",2080783.6,2194726.7999999998,2375410.7999999998,2265866.4,2154124,2215161.2000000002,2035479.6,1818572,1707647.2,1593020.8,1721078.8,1662900.4,23824771.599999998,6000000,{"$f":"R$2*12-SUM($Q19:Q19)-SUMPRODUCT(--($D19:$O19<=R$2),R$2-$D19:$O19)","v":17824771.599999994},{"$f":"S$2*12-SUM($Q19:R19)-SUMPRODUCT(--($D19:$O19<=S$2),S$2-$D19:$O19)","v":0}]
[15,"WSU - MP-A South Campus Feeder ","3730460787",2119429.2000000002,2110371.2000000002,2175661.6,2177000,2071521.2,2213257.2000000002,2102864.4,2137346.4,2145421.6,2178472.7999999998,2250592.4,2226266,25908204,6000000,{"$f":"R$2*12-SUM($Q20:Q20)-SUMPRODUCT(--($D20:$O20<=R$2),R$2-$D20:$O20)","v":19908203.999999993},{"$f":"S$2*12-SUM($Q20:R20)-SUMPRODUCT(--($D20:$O20<=S$2),S$2-$D20:$O20)","v":0}]
[16,"WSU - MP-B East Campus EA ","6030021572",3925595.48,3903967.98,4071661.93,3705349.37,3432820.27,3553735.59,3322993.19,3643222.21,4681372.18,5246385.99,5272778.24,4403257.2799999993,49163139.710000008,6000000,{"$f":"R$2*12-SUM($Q21:Q21)-SUMPRODUCT(--($D21:$O21<=R$2),R$2-$D21:$O21)","v":43163139.710000001},{"$f":"S$2*12-SUM($Q21:R21)-SUMPRODUCT(--($D21:$O21<=S$2),S$2-$D21:$O21)","v":0}]
[17,"WSU - MP-C East Campus EB ","6100609210",2912242.2,2990796.9,3143271.6,3099198.9,2927685.6,3034063.2,2611944.2999999998,2740319.4,2751098.7,2812162.5,2843326.5,2835726.6,34701836.399999999,6000000,{"$f":"R$2*12-SUM($Q22:Q22)-SUMPRODUCT(--($D22:$O22<=R$2),R$2-$D22:$O22)","v":28701836.399999999},{"$f":"S$2*12-SUM($Q22:R22)-SUMPRODUCT(--($D22:$O22<=S$2),S$2-$D22:$O22)","v":0}]
[18,"WSU - MP-D Casp East (no PVD)","5030019646",2169680,2202376,2303120,2565732,2548396,2578436,2568960,2396772,2242924,2364692,2552876,2135364,28629328,6000000,{"$f":"R$2*12-SUM($Q23:Q23)-SUMPRODUCT(--($D23:$O23<=R$2),R$2-$D23:$O23)","v":22629328},{"$f":"S$2*12-SUM($Q23:R23)-SUMPRODUCT(--($D23:$O23<=S$2),S$2-$D23:$O23)","v":0}]
[19,"WSU - MP-E Casp West (no PVD)","7030024549",2053567.6,1556279.2,1602062,1632859.2,1615776.4,1618803.2,1825381.6,1894648,2566603.2000000002,3180343.6,2686943,2714675.6,24947942.600000001,6000000,{"$f":"R$2*12-SUM($Q24:Q24)-SUMPRODUCT(--($D24:$O24<=R$2),R$2-$D24:$O24)","v":18947942.600000009},{"$f":"S$2*12-SUM($Q24:R24)-SUMPRODUCT(--($D24:$O24<=S$2),S$2-$D24:$O24)","v":0}]
[20,"Goodrich - South 2311155858 (No PVD)",2311155858,1098339.2,457528.4,268716,1068314.8,1275747.2,1496706.4,1457517.6,1753113.6000000001,1824138.4,1883439.6,2028602.8,2428722.7999999998,{"$f":"SUM(D25:O25)","v":17040886.800000001},{"$f":"Q$2*12-SUMPRODUCT(--($D25:$O25<=Q$2),Q$2-$D25:$O25)","v":5726244.4000000004},{"$f":"R$2*12-SUM($Q25:Q25)-SUMPRODUCT(--($D25:$O25<=R$2),R$2-$D25:$O25)","v":11314642.399999999},{"$f":"S$2*12-SUM($Q25:R25)-SUMPRODUCT(--($D25:$O25<=S$2),S$2-$D25:$O25)","v":0}]
[21,"Boise Cascade LLC Inland Region",7600951015,777054.6,787443.3,856989,891842.7,853939.8,874538.70200000005,773734.5,686616,747684,708966.3,713080.2,734229.3,{"$f":"SUM(D26:O26)","v":9406118.4020000007},{"$f":"Q$2*12-SUMPRODUCT(--($D26:$O26<=Q$2),Q$2-$D26:$O26)","v":6000000},{"$f":"R$2*12-SUM($Q26:Q26)-SUMPRODUCT(--($D26:$O26<=R$2),R$2-$D26:$O26)","v":3406118.4019999951},{"$f":"S$2*12-SUM($Q26:R26)-SUMPRODUCT(--($D26:$O26<=S$2),S$2-$D26:$O26)","v":0}]
[null,"Schedule 25 Total",null,{"$f":"SUM(D4:D26)","v":46502880.903000012},{"$f":"SUM(E4:E26)","v":42255652.629999995},42815898.530000001,44276643.969999999,43435762.32,47283196.741999999,45010901.365000002,46803956.860000007,50018213.030000009,51436945.190000005,51574495.840000004,50077167.879999995,{"$f":"IF(ROUND(SUM(P4:P26),0)<>ROUND(SUM(D27:O27),0),#VALUE!,SUM(P4:P26))","v":561491715.25999999},{"$f":"SUM(Q4:Q26)","v":125726244.40000001},{"$f":"SUM(R4:R26)","v":435765470.8599999},{"$f":"SUM(S4:S26)","v":0}]
[null,null,null,null,null,null,null,null,null,null,null,null,null,null,null,null,null,null,{"$f":"SUM(Q27:S27)","v":561491715.25999987}]
[null,"Revenue Run Total",null,86063755.541999996,86495234.502999991,81011134.030000001,83424071.430000007,84550821.569999993,79534755.620000005,88913578.342000008,83737853.36500001,81398172.859999999,87645833.030000001,89295175.189999998,91978388.568000004,{"$f":"SUM(D29:O29)","v":1024048774.0499998}]
[null,"Booked Unbilled Reversal",null,-85477326,-86330392,-80668735,-83626479,-83625209,-79439138,-88665576,-84356951,-80807475,-87774134,-89259226,-92631840,{"$f":"SUM(D30:O30)","v":-1022662481}]
[null,"Gross Booked Unbilled",null,86330392,80668735,83626479,83625209,79439138,88665576,84356951,80807475,87774134,89259226,92631840,88547307,1025732462]
[null,"Gross Unbilled True-up",null,{"$f":"D27-D29-D30-D31-D33-D34-D35","v":164842.50300001353},342399.02999999374,-202407.5700000003,925612.5700000003,95617.619999997318,248002.34200000018,-619097.63499999791,590697.86000000685,-128300.96999999136,35949.190000005066,-733148.15999999642,-245197.12000000477,{"$f":"SUM(D32:O32)","v":474969.66000002623}]
[null,"Unbilled Reversal True-up",null,{"$f":"-(D29+D30)","v":-586429.54199999571},-164842.50299999118,-342399.03000000119,202407.56999999285,-925612.56999999285,-95617.620000004768,-248002.34200000763,619097.63499999046,-590697.8599999994,128300.96999999881,-35949.189999997616,653451.4319999963,-1386293.0500000119]
[null,"Less Customer Closing (Cust 15)",null,-919707.6,-800339.4,-766308.9,-838521.6,-806805.3,-845913.59999999998,null,null,null,null,null,null,-4977596.3999999994]
[null,"Less transfer from 25 to 25I (Cust 9)",null,-39072646,-37955142,-39841864,-39435656,-35292188,-40784468,-38726952,-34594216,-37627620,-37858230,-40324196,-38224942,-459738120]
[null,"Adj Revenue Runs, Sch 25",null,{"$f":"SUM(D29:D35)","v":46502880.903000027},{"$f":"SUM(E29:E35)","v":42255652.629999995},42815898.530000001,{"$f":"SUM(G29:G35)","v":44276643.969999999},43435762.320000008,47283196.742000014,45010901.36500001,{"$f":"SUM(K29:K35)","v":46803956.860000014},{"$f":"SUM(L29:L35)","v":50018213.030000016},{"$f":"SUM(M29:M35)","v":51436945.189999998},{"$f":"SUM(N29:N35)","v":51574495.840000004},{"$f":"SUM(O29:O35)","v":50077167.879999995},{"$f":"IF(ROUND(SUM(P29:P35),0)<>ROUND(SUM(D36:O36),0),#VALUE!,SUM(P29:P35))","v":561491715.25999987}]
[null,null,null,{"$f":"D36-D27","v":0},{"$f":"E36-E27","v":0},0,{"$f":"G36-G27","v":0},0,0,0,0,0,0,0,0,0]
[]
["Schedule 25I KWH"]
[1,"Inland Empire Paper","0160126924",39072646,37955142,39841864,39435656,35292188,40784468,38726952,34594216,37627620,37858230,40324196,38224942,{"$f":"SUM(D40:O40)","v":459738120},{"$f":"Q$2*12-SUMPRODUCT(--($D40:$O40<=Q$2),Q$2-$D40:$O40)","v":6000000},{"$f":"R$2*12-SUM($Q40:Q40)-SUMPRODUCT(--($D40:$O40<=R$2),R$2-$D40:$O40)","v":66000000},{"$f":"S$2*12-SUM($Q40:R40)-SUMPRODUCT(--($D40:$O40<=S$2),S$2-$D40:$O40)","v":387738120}]
[null,null,null,null,null,null,null,null,null,null,null,null,null,null,null,{"$f":"SUM(D41:O41)","v":0},0,{"$f":"R$2*12-SUM($Q41:Q41)-SUMPRODUCT(--($D41:$O41<=R$2),R$2-$D41:$O41)","v":0},{"$f":"S$2*12-SUM($Q41:R41)-SUMPRODUCT(--($D41:$O41<=S$2),S$2-$D41:$O41)","v":0}]
[null,"Schedule 25I Total",null,null,null,null,null,null,null,null,null,null,null,null,null,{"$f":"SUM(P40:P41)","v":459738120},{"$f":"SUM(Q40:Q41)","v":6000000},{"$f":"SUM(R40:R41)","v":66000000},{"$f":"SUM(S40:S41)","v":387738120}]
[null,null,null,null,null,null,null,null,null,null,null,null,null,null,null,{"$f":"'REVRUNS 12ME0921'!P339","v":0}]
[null,"Revenue Run Total"]
[]
[null,"KVA",null,{"$f":"D$3","v":"2020-10-31"},{"$f":"E$3","v":"2020-11-30"},"2020-12-31","2021-01-31","2021-02-28","2021-03-31","2021-04-30","2021-05-31","2021-06-30","2021-07-31","2021-08-31","2021-09-30","Total","Peak","Month"]
[1,{"$f":"B4","v":"Goodrich - North 2311008572"},"2311008572",5260.1039999999994,3141.6590000000001,2525.2620000000002,3380.2170000000001,4143.0740000000005,4652.8510000000006,4035.625,4345.8959999999997,5453.5770000000002,5576.2489999999998,5202.8559999999998,6112.1819999999998,{"$f":"SUM(D47:O47)","v":53829.551999999996},{"$f":"MAX(D47:O47)","v":6112.1819999999998},{"$f":"INDEX($D$46:$O$46,MATCH(Q47,$D47:$O47,0))","v":"2021-09-30"}]
[2,"Boise Cascade Plywood","8920023327",5283.4009999999998,5252.7649999999994,5340.2629999999999,5293.4079999999994,5236.9960000000001,5209.2260000000006,5240.2890000000007,5236.9670000000006,5179.634,5125.0339999999997,5329.0249999999996,5453.5609999999997,63180.569000000003,{"$f":"MAX(D48:O48)","v":5453.5609999999997},{"$f":"INDEX($D$46:$O$46,MATCH(Q48,$D48:$O48,0))","v":"2021-09-30"}]
[3,"Boise Cascade Sawmill","9920023116",2800.8209999999999,2732.2649999999999,2982.6779999999999,2978.114,2898.47,2861.596,2750.0309999999999,2696.4690000000001,2667.03,2554.2420000000002,2481.9119999999998,2602.556,33006.184000000001,{"$f":"MAX(D49:O49)","v":2982.6779999999999},"2020-12-31"]
[4,"City of Spokane","8970099313",2698.4349999999999,2852.623,2766.6509999999998,2681.3679999999999,2838.569,3476.18,3425.1329999999998,3513.3609999999999,3796.1040000000003,3482.692,3366.4119999999998,3646.8890000000001,38544.416999999994,3796.1040000000003,"2021-06-30"]
[5,"Empire Health Services","0080095044",2629.3220000000001,2623.116,2669.6689999999999,2699.529,2745.877,2631.96,3270.2710000000002,3582.7780000000002,4008.44,3845.4780000000001,3862.64,3436.373,38005.453000000001,4008.44,"2021-06-30"]
[6,"Gonzaga University","1420028876",4533.9780000000001,4186.8609999999999,3923.1239999999998,4276.12,4344.3230000000003,3915.3540000000003,4170.6000000000004,4208.982,5115.6399999999994,4863.8060000000005,4732.2629999999999,5091.6540000000005,53362.705000000002,5115.6399999999994,"2021-06-30"]
[7,"Honeywell Electronics","0170122152",3063.7330000000002,3184.9720000000002,3021.739,3048.9209999999998,3097.51,3008.3209999999999,3030.3490000000002,3044.38,3866.43,3713.7919999999999,3633.1080000000002,3443.0720000000001,39156.327000000005,3866.43,"2021-06-30"]
[8,"Huntwood Industries","8640841982",4226.21,4182.5969999999998,4286.3320000000003,4212.0470000000005,4246.95,4260.0689999999995,4246.7209999999995,4176.8969999999999,4739.3940000000002,4743.5479999999998,4479.652,4338.5410000000002,52138.957999999999,4743.5479999999998,"2021-07-31"]
[null,0,0,null,null,null,null,null,null,null,null,null,null,null,null,0,0,{"$error":"#N/A"}]
[9,{"$f":"B13","v":"Simplot - Othello"},"4250473907",8544.5299999999988,8419.1409999999996,8590.273000000001,8548.5429999999997,8751.5519999999997,8758.1280000000006,8617.2560000000012,8602.57,8715.5460000000003,8855.8169999999991,8849.3109999999997,8603.9629999999997,103856.63,8855.8169999999991,"2021-07-31"]
[10,"McCaine Foods Inc","9060132009",11775.164000000001,8587.0570000000007,8656.4939999999988,8364.0849999999991,8288.2749999999996,8087.875,8680.1810000000005,8421.2330000000002,8627,9036.3090000000011,9743.6350000000002,11806.96,110074.26800000001,11806.96,"2021-09-30"]
[11,"Sacred Heart Medical Center","0030019644",6616.0680000000002,4813.0889999999999,4716.3590000000004,4746.5839999999998,4720.1890000000003,5199.5640000000003,6127.9400000000005,6347.4670000000006,8158.8959999999997,7256.43,7214.4279999999999,6230.4430000000002,72147.456999999995,8158.8959999999997,"2021-06-30"]
[12,"Spokane County Combined Master","1080099801",2320.7820000000002,1677.018,1653.1859999999999,1712.644,1687.595,1955.6310000000001,2101.7570000000001,2296.9090000000001,2801.7689999999998,2649.069,2660.2330000000002,2406.3209999999999,25922.913999999997,2801.7689999999998,"2021-06-30"]
[13,"Spokane Industries","0070121063",5936.924,4183.7569999999996,5325.4760000000006,5994.7269999999999,5891.4780000000001,6147.6,5688.1399999999994,6045.3760000000002,5808.8130000000001,5867.0689999999995,6243.78,5716.5820000000003,68849.721999999994,6243.78,"2021-08-31"]
[null,0,0,null,null,null,null,null,null,null,null,null,null,null,null,0,0]
[14,{"$f":"B19","v":"Vaagen Brothers Lumber"},"2470070232",4530.009,4614.009,4789.8339999999998,4799.1220000000003,4953.3450000000003,4711.3310000000001,4352.598,4040.5969999999998,4140.6270000000004,3937.6759999999999,3948.3969999999999,4225.2730000000001,53042.817999999999,4953.3450000000003,"2021-02-28"]
[15,"WSU - MP-A South Campus Feeder ","3730460787",3739.0639999999999,3415.7660000000001,3694.4549999999999,3504.41,3547.4880000000003,3591.2939999999999,3536.1680000000001,3506.4589999999998,3790.509,3772.8959999999997,3840.4769999999999,4052.5320000000002,43991.517999999996,4052.5320000000002,"2021-09-30"]
[16,"WSU - MP-B East Campus EA ","6030021572",8239,6913.38,6926.1900000000005,6587.5300000000007,6657.21,6082.3,6718.87,8354.08,10613.439999999999,10208.209999999999,10897.51,9374.42,97572.139999999985,10897.51,"2021-08-31"]
[17,"WSU - MP-C East Campus EB ","6100609210",5242.9629999999997,5501.9439999999995,5510.3760000000002,5019.0439999999999,5648.68,5222.7759999999998,4847.5810000000001,4558.1360000000004,4561.2870000000003,4468.5810000000001,4669.0119999999997,5106.5320000000002,60356.911999999997,5648.68,"2021-02-28"]
[18,"WSU - MP-D Casp East (no PVD)","5030019646",4112.3810000000003,4321.8739999999998,4276.7089999999998,4651.3310000000001,4844.857,4697.5529999999999,4683.308,4565.5619999999999,4275.991,4322.6139999999996,8442.491,3952.6480000000001,57147.319000000003,8442.491,"2021-08-31"]
[19,"WSU - MP-E Casp West (no PVD)","7030024549",5296.9989999999998,2720.43,2861.732,3107.011,3080.7640000000001,2825.6480000000001,4208.4960000000001,4049.3580000000002,5421,5303.3890000000001,5836.9520000000002,6618.6620000000003,51330.441000000006,6618.6620000000003,"2021-09-30"]
[20,{"$f":"B25","v":"Goodrich - South 2311155858 (No PVD)"},null,4145.3999999999996,1621.652,1261.182,3374.25,4130.7359999999999,4188.8789999999999,3688.7039999999997,4110.9490000000005,8565.2479999999996,4370.0169999999998,5719.1790000000001,5962.2359999999999,51138.431999999993,{"$f":"MAX(D68:O68)","v":8565.2479999999996},{"$f":"INDEX($D$46:$O$46,MATCH(Q68,$D68:$O68,0))","v":"2021-06-30"}]
[21,{"$f":"B26","v":"Boise Cascade LLC Inland Region"},null,3565.1350000000002,3777.6309999999999,3766.1660000000002,4033.002,4033.8130000000001,3769.1040000000003,3776.136,3671.8670000000002,3653.614,3484.6869999999999,3639.2290000000003,3619.6350000000002,44790.019,4033.8130000000001,"2021-02-28"]
[null,"Schedule 25 Total",null,{"$f":"SUM(D47:D69)","v":104560.423},88723.605999999985,89544.150000000009,93012.006999999983,95787.751000000004,95253.24,97196.15400000001,99376.293000000005,113959.989,107437.60500000001,114792.50200000001,111801.035,{"$f":"IF(ROUND(SUM(P47:P69),0)<>ROUND(SUM(D70:O70),0),#VALUE!,SUM(P47:P69))","v":1211444.7550000001}]
[]
[null,null,null,null,null,null,null,null,null,null,null,null,null,null,null,{"$f":"P$2","v":"12-mo Ended"}]
[null,"KVA in excess of 3,000",null,{"$f":"D$3","v":"2020-10-31"},{"$f":"E$3","v":"2020-11-30"},"2020-12-31","2021-01-31","2021-02-28","2021-03-31","2021-04-30","2021-05-31","2021-06-30","2021-07-31","2021-08-31","2021-09-30","Total"]
[1,{"$f":"B4","v":"Goodrich - North 2311008572"},"2311008572",{"$f":"IF(D47>3000,D47-3000,0)","v":2260.1039999999994},141.65900000000011,0,{"$f":"MAX(0,G47-3000)","v":380.2170000000001},1143.0740000000005,1652.8510000000006,1035.625,1345.8959999999997,2453.5770000000002,2576.2489999999998,2202.8559999999998,3112.1819999999998,{"$f":"SUM(D74:O74)","v":18304.29}]
[2,"Boise Cascade Plywood","8920023327",2283.4009999999998,2252.7649999999994,2340.2629999999999,{"$f":"MAX(0,G48-3000)","v":2293.4079999999994},2236.9960000000001,2209.2260000000006,2240.2890000000007,2236.9670000000006,2179.634,2125.0339999999997,2329.0249999999996,2453.5609999999997,27180.569000000003]
[3,"Boise Cascade Sawmill","9920023116",0,0,0,{"$f":"MAX(0,G49-3000)","v":0},0,0,0,0,0,0,0,0,0]
[4,"City of Spokane","8970099313",0,0,0,{"$f":"MAX(0,G50-3000)","v":0},0,476.17999999999984,425.13299999999981,513.36099999999988,796.10400000000027,482.69200000000001,366.41199999999981,646.88900000000012,3706.7709999999997]
[5,"Empire Health Services","0080095044",0,0,0,{"$f":"MAX(0,G51-3000)","v":0},0,0,270.27100000000019,582.77800000000025,1008.44,845.47800000000007,862.63999999999987,436.37300000000005,4005.9800000000005]
[6,"Gonzaga University","1420028876",1533.9780000000001,1186.8609999999999,923.1239999999998,{"$f":"MAX(0,G52-3000)","v":1276.1199999999999},1344.3230000000003,915.35400000000027,1170.6000000000004,1208.982,2115.6399999999994,1863.8060000000005,1732.2629999999999,2091.6540000000005,17362.705000000002]
[7,"Honeywell Electronics","0170122152",63.733000000000175,184.97200000000021,21.739000000000033,{"$f":"MAX(0,G53-3000)","v":48.920999999999822},97.510000000000218,8.3209999999999127,30.34900000000016,44.380000000000109,866.42999999999984,713.79199999999992,633.10800000000017,443.07200000000012,3156.3270000000007]
[8,{"$f":"B11","v":"Huntwood Industries"},610074869,1226.21,1182.5969999999998,1286.3320000000003,{"$f":"MAX(0,G54-3000)","v":1212.0470000000005},1246.9499999999998,1260.0689999999995,1246.7209999999995,1176.8969999999999,1739.3940000000002,1743.5479999999998,1479.652,1338.5410000000002,16138.957999999999]
[null,0,{"$f":"C12","v":0},{"$f":"MAX(0,D55-3000)","v":0},{"$f":"MAX(0,E55-3000)","v":0},{"$f":"MAX(0,F55-3000)","v":0},{"$f":"MAX(0,G55-3000)","v":0},0,0,0,0,0,0,0,0,0]
[9,"Simplot - Othello","4250473907",{"$f":"IF(D56>3000,D56-3000,0)","v":5544.5299999999988},5419.1409999999996,5590.273000000001,{"$f":"MAX(0,G56-3000)","v":5548.5429999999997},5751.5519999999997,5758.1280000000006,5617.2560000000012,5602.57,5715.5460000000003,5855.8169999999991,5849.3109999999997,5603.9629999999997,67856.63]
[10,"McCaine Foods Inc","9060132009",8775.1640000000007,5587.0570000000007,5656.4939999999988,{"$f":"MAX(0,G57-3000)","v":5364.0849999999991},5288.2749999999996,5087.875,5680.1810000000005,5421.2330000000002,5627,6036.3090000000011,6743.6350000000002,8806.9599999999991,74074.267999999996]
[11,"Sacred Heart Medical Center","0030019644",3616.0680000000002,1813.0889999999999,1716.3590000000004,{"$f":"MAX(0,G58-3000)","v":1746.5839999999998},1720.1890000000003,2199.5640000000003,3127.9400000000005,3347.4670000000006,5158.8959999999997,4256.43,4214.4279999999999,3230.4430000000002,36147.457000000002]
[12,"Spokane County Combined Master","1080099801",0,0,0,{"$f":"MAX(0,G59-3000)","v":0},0,0,0,0,0,0,0,0,0]
[13,"Spokane Industries","0070121063",2936.924,1183.7569999999996,2325.4760000000006,{"$f":"MAX(0,G60-3000)","v":2994.7269999999999},2891.4780000000001,3147.6000000000004,2688.1399999999994,3045.3760000000002,2808.8130000000001,2867.0689999999995,3243.7799999999997,2716.5820000000003,32849.721999999994]
[null,0,0,0,0,0,{"$f":"MAX(0,G61-3000)","v":0},0,0,0,0,0,0,0,0,0]
[14,"Vaagen Brothers Lumber","2470070232",1530.009,1614.009,1789.8339999999998,{"$f":"MAX(0,G62-3000)","v":1799.1220000000003},1953.3450000000003,1711.3310000000001,1352.598,1040.5969999999998,1140.6270000000004,937.67599999999993,948.39699999999993,1225.2730000000001,17042.817999999999]
[15,"WSU - MP-A South Campus Feeder ","3730460787",739.06399999999985,415.76600000000008,694.45499999999993,{"$f":"MAX(0,G63-3000)","v":504.40999999999985},547.48800000000028,591.29399999999987,536.16800000000012,506.45899999999983,790.50900000000001,772.89599999999973,840.47699999999986,1052.5320000000002,7991.5179999999991]
[16,"WSU - MP-B East Campus EA ","6030021572",5239,3913.38,3926.1900000000005,{"$f":"MAX(0,G64-3000)","v":3587.5300000000007},3657.21,3082.3,3718.87,5354.08,7613.4399999999987,7208.2099999999991,7897.51,6374.42,61572.14]
[17,"WSU - MP-C East Campus EB ","6100609210",2242.9629999999997,2501.9439999999995,2510.3760000000002,{"$f":"MAX(0,G65-3000)","v":2019.0439999999999},2648.6800000000003,2222.7759999999998,1847.5810000000001,1558.1360000000004,1561.2870000000003,1468.5810000000001,1669.0119999999997,2106.5320000000002,24356.912]
[18,"WSU - MP-D Casp East (no PVD)","5030019646",1112.3810000000003,1321.8739999999998,1276.7089999999998,{"$f":"MAX(0,G66-3000)","v":1651.3310000000001},1844.857,1697.5529999999999,1683.308,1565.5619999999999,1275.991,1322.6139999999996,5442.491,952.64800000000014,21147.319]
[19,"WSU - MP-E Casp West (no PVD)","7030024549",2296.9989999999998,0,0,{"$f":"MAX(0,G67-3000)","v":107.01099999999997},80.764000000000124,0,1208.4960000000001,1049.3580000000002,2421,2303.3890000000001,2836.9520000000002,3618.6620000000003,15922.631000000001]
[20,"Goodrich - South 2311155858 (No PVD)",null,1145.3999999999996,0,0,{"$f":"MAX(0,G68-3000)","v":374.25},1130.7359999999999,1188.8789999999999,688.70399999999972,1110.9490000000005,5565.2479999999996,1370.0169999999998,2719.1790000000001,2962.2359999999999,{"$f":"SUM(D95:O95)","v":18255.597999999998}]
[21,"Boise Cascade LLC Inland Region",null,565.13500000000022,777.63099999999986,766.16600000000017,{"$f":"MAX(0,G69-3000)","v":1033.002},1033.8130000000001,769.10400000000027,776.13599999999997,671.86700000000019,653.61400000000003,484.6869999999999,639.22900000000027,619.63500000000022,8790.0190000000002]
[null,"Schedule 25 Total",null,{"$f":"SUM(D74:D96)","v":43111.063000000009},29496.502,30823.790000000005,31940.351999999999,34617.24,33978.404999999999,35344.366000000002,37382.914999999994,51491.19,45234.293999999994,52650.356999999996,49792.157999999996,{"$f":"IF(ROUND(SUM(P74:P96),0)<>ROUND(SUM(D97:O97),0),#VALUE!,SUM(P74:P96))","v":475862.63199999998}]
[]
["Schedule 25I kVA"]
[null,"Customer Total",null,61982.28,60622.5,61249.43,64327.03,59202.77,60056.83,62541.79,60383.79,62411.86,62805.35,62232.46,62015.22,{"$f":"SUM(D100:O100)","v":739831.30999999994}]
[null,"in excess of 3,000 kVA",null,{"$f":"MAX(0,D100-3000)","v":58982.28},57622.5,58249.43,61327.03,56202.77,57056.83,59541.79,57383.79,59411.86,59805.35,59232.46,59015.22,{"$f":"SUM(D101:O101)","v":703831.30999999994}]
[]
[]
["Sch 25 Present Primary Voltage Discount"]
[null,">11 and <60",-0.2,{"$f":"(D70-D66-D67-D55-D68)*$C105","v":-18201.128600000004},-16011.93,-16228.905400000001,-16375.882999999996,-16746.2788,-16708.232,-16923.129200000003,-17330.084800000001,-19139.55,-18688.317000000006,-18958.776000000002,-19053.497800000001,{"$f":"SUM(D105:O105)","v":-210365.71260000006}]
[null,">60 and <115",{"$f":"-1.52","v":-1.52},0,0,0,0,0,0,0,0,0,0,0,0,{"$f":"SUM(D106:O106)","v":0}]
[null,">115",-1.93,0,0,0,0,0,0,0,0,0,0,0,0,{"$f":"SUM(D107:O107)","v":0}]
[null,null,null,{"$f":"SUM(D105:D107)","v":-18201.128600000004},-16011.93,-16228.905400000001,-16375.882999999996,-16746.2788,-16708.232,-16923.129200000003,-17330.084800000001,-19139.55,-18688.317000000006,-18958.776000000002,-19053.497800000001,-210365.71260000006]
["Sch 25 Proposed Primary Voltage Discount"]
[null,">11 and <60",-0.2,{"$f":"(D70-D66-D67-D55-D68)*$C110","v":-18201.128600000004},-16011.93,-16228.905400000001,-16375.882999999996,-16746.2788,-16708.232,-16923.129200000003,-17330.084800000001,-19139.55,-18688.317000000006,-18958.776000000002,-19053.497800000001,{"$f":"SUM(D110:O110)","v":-210365.71260000006}]
[null,">60 and <115",-1.52,0,0,0,0,0,0,0,0,0,0,0,0,{"$f":"SUM(D111:O111)","v":0}]
[null,">115",-1.93,0,0,0,0,0,0,0,0,0,0,0,0,{"$f":"SUM(D112:O112)","v":0}]
[null,null,null,{"$f":"SUM(D110:D112)","v":-18201.128600000004},-16011.93,-16228.905400000001,-16375.882999999996,-16746.2788,-16708.232,-16923.129200000003,-17330.084800000001,-19139.55,-18688.317000000006,-18958.776000000002,-19053.497800000001,-210365.71260000006]
[]
["Sch 25I Present Primary Voltage Discount"]
[null,">11 and <60",-0.2,0,0,0,0,0,0,0,0,0,0,0,0,{"$f":"SUM(D116:O116)","v":0}]
[null,">60 and <115",{"$f":"-1.52","v":-1.52},{"$f":"$C117*D$127","v":-13465.349999999999},-13565.82,-16362.37,-13516.279999999999,-14817.9,-13962.51,-18562.98,-14632.25,-14450.339999999998,-15074.340000000002,-15103.119999999999,-18142.142400000001,{"$f":"SUM(D117:O117)","v":-181655.40239999999}]
[null,">115",-1.93,{"$f":"$C118*D$129","v":-100907.54},-102233.01,-99857.33,-109461.32,-97401.45,-98184.25,-101391.78,-98322.92,-101995.13,-102171.52,-101587.46,-98104.679199999999,{"$f":"SUM(D118:O118)","v":-1211618.3892000001}]
[null,null,null,{"$f":"SUM(D116:D118)","v":-114372.88999999998},-115798.82999999999,-116219.7,-122977.60000000001,-112219.34999999999,-112146.76,-119954.76,-112955.17,-116445.47,-117245.86,-116690.58,-116246.8216,-1393273.7916000001]
["Sch 25I Proposed Primary Voltage Discount"]
[null,">11 and <60",-0.2,0,0,0,0,0,0,0,0,0,0,0,0,{"$f":"SUM(D121:O121)","v":0}]
[null,">60 and <115",-1.52,{"$f":"$C122*D$127","v":-13465.349999999999},-13565.82,-16362.37,-13516.279999999999,-14817.9,-13962.51,-18562.98,-14632.25,-14450.339999999998,-15074.340000000002,-15103.119999999999,-18142.142400000001,{"$f":"SUM(D122:O122)","v":-181655.40239999999}]
[null,">115",-1.93,{"$f":"$C123*D$129","v":-100907.54},-102233.01,-99857.33,-109461.32,-97401.45,-98184.25,-101391.78,-98322.92,-101995.13,-102171.52,-101587.46,-98104.679199999999,{"$f":"SUM(D123:O123)","v":-1211618.3892000001}]
[null,null,null,{"$f":"SUM(D121:D123)","v":-114372.88999999998},-115798.82999999999,-116219.7,-122977.60000000001,-112219.34999999999,-112146.76,-119954.76,-112955.17,-116445.47,-117245.86,-116690.58,-116246.8216,-1393273.7916000001]
[]
["25I KVA"]
[null,"60 KV",null,{"$f":"'REVRUNS 12ME0921'!E462/'REVRUNS 12ME0921'!E466","v":8858.7828947368416},{"$f":"'REVRUNS 12ME0921'!F462/'REVRUNS 12ME0921'!F466","v":8924.8815789473683},{"$f":"'REVRUNS 12ME0921'!G462/'REVRUNS 12ME0921'!G466","v":10764.717105263158},{"$f":"'REVRUNS 12ME0921'!H462/'REVRUNS 12ME0921'!H466","v":8892.28947368421},{"$f":"'REVRUNS 12ME0921'!I462/'REVRUNS 12ME0921'!I466","v":9748.6184210526317},{"$f":"'REVRUNS 12ME0921'!J462/'REVRUNS 12ME0921'!J466","v":9185.8618421052633},{"$f":"'REVRUNS 12ME0921'!K462/'REVRUNS 12ME0921'!K466","v":12212.486842105263},{"$f":"'REVRUNS 12ME0921'!L462/'REVRUNS 12ME0921'!L466","v":9626.480263157895},{"$f":"'REVRUNS 12ME0921'!M462/'REVRUNS 12ME0921'!M466","v":9506.8026315789466},{"$f":"'REVRUNS 12ME0921'!N462/'REVRUNS 12ME0921'!N466","v":9917.3289473684217},{"$f":"'REVRUNS 12ME0921'!O462/'REVRUNS 12ME0921'!O466","v":9936.2631578947367},11935.62,{"$f":"SUM(D127:O127)","v":119510.13315789473},null,null,null,{"$f":"24000","v":24000}]
[null,"4.16 KV",null,0,0,0,0,0,0,0,0,0,0,0,0,{"$f":"SUM(D128:O128)","v":0},null,null,null,0]
[null,"115 KV",null,{"$f":"'REVRUNS 12ME0921'!E463/'REVRUNS 12ME0921'!E467","v":52283.699481865282},{"$f":"'REVRUNS 12ME0921'!F463/'REVRUNS 12ME0921'!F467","v":52970.47150259067},{"$f":"'REVRUNS 12ME0921'!G463/'REVRUNS 12ME0921'!G467","v":51739.549222797927},{"$f":"'REVRUNS 12ME0921'!H463/'REVRUNS 12ME0921'!H467","v":56715.709844559591},{"$f":"'REVRUNS 12ME0921'!I463/'REVRUNS 12ME0921'!I467","v":50467.072538860106},{"$f":"'REVRUNS 12ME0921'!J463/'REVRUNS 12ME0921'!J467","v":50872.668393782384},{"$f":"'REVRUNS 12ME0921'!K463/'REVRUNS 12ME0921'!K467","v":52534.601036269429},{"$f":"'REVRUNS 12ME0921'!L463/'REVRUNS 12ME0921'!L467","v":50944.518134715028},{"$f":"'REVRUNS 12ME0921'!M463/'REVRUNS 12ME0921'!M467","v":52847.217616580318},{"$f":"'REVRUNS 12ME0921'!N463/'REVRUNS 12ME0921'!N467","v":52938.611398963738},{"$f":"'REVRUNS 12ME0921'!O463/'REVRUNS 12ME0921'!O467","v":52635.989637305705},50831.44,{"$f":"SUM(D129:O129)","v":627781.54880829016},null,null,null,{"$f":"L101*6.5","v":386177.09}]
["*","Total",null,{"$f":"SUM(D127:D129)","v":61142.482376602122},61895.353081538036,62504.266328061087,65607.999318243805,60215.690959912739,60058.530235887651,64747.087878374688,60570.998397872921,62354.020248159264,62855.940346332158,62572.252795200446,62767.060000000005,747291.68196618487,null,null,null,{"$f":"500000*0.05762","v":28810}]
[null,null,null,{"$f":"D100","v":61982.28},60622.5,61249.43,64327.03,59202.77,60056.83,62541.79,60383.79,62411.86,62805.35,62232.46,62015.22,{"$f":"SUM(D131:O131)","v":739831.30999999994},null,null,null,{"$f":"MIN(5500000,L40-500000)*0.0521","v":286550}]
[null,null,null,null,null,null,null,null,null,null,null,null,null,null,null,null,null,null,null,{"$f":"MAX(0,L40-6000000)*0.04416","v":1396675.6991999999}]
[null,"Calc Revenue for 25I",null,{"$f":"500000*0.05317+MIN(5500000,D40-500000)*0.04765+MAX(0,D40-6000000)*0.03954+30650+D101*8.3-D127*1.52-D129*1.93","v":2002182.4568399996},1945284.23468,2024667.8715599999,2027392.58724,1831786.7545200002,2056112.7937200004,{"$f":"500000*0.05471+MIN(5500000,J40-500000)*0.04919+MAX(0,J40-6000000)*0.04108+30650+J101*8.3-J127*1.52-J129*1.93","v":2047215.2851600002},{"$f":"500000*0.05471+MIN(5500000,K40-500000)*0.04919+MAX(0,K40-6000000)*0.04108+30650+K101*8.3-K127*1.52-K129*1.93","v":1866530.68028},{"$f":"500000*0.05471+MIN(5500000,L40-500000)*0.04919+MAX(0,L40-6000000)*0.04108+30650+L101*8.3-L127*1.52-L129*1.93","v":2004485.5976},{"$f":"500000*0.05486+MIN(5500000,M40-500000)*0.04934+MAX(0,M40-6000000)*0.04123+30650+M101*8.3-M127*1.52-M129*1.93","v":2022103.3679000004},{"$f":"500000*0.05463+MIN(5500000,N40-500000)*0.04911+MAX(0,N40-6000000)*0.041+30650+N101*8.3-N127*1.52-N129*1.93","v":2110300.8739999998},{"$f":"500000*0.05463+MIN(5500000,O40-500000)*0.04911+MAX(0,O40-6000000)*0.041+30650+O101*8.3-O127*1.52-O129*1.93","v":2022872.1264000002},{"$f":"SUM(D133:O133)","v":23960934.629900001},null,null,null,{"$f":"-L127*1.1","v":-10457.482894736842}]
[null,"Revenue for 25I per Bill (less city tax)",null,null,null,null,null,null,null,null,null,null,null,{"$f":"2241466.9-14475.44-101587.46-15103.12","v":2110300.88},{"$f":"2153023.22-13904.27-98104.68-18142.14","v":2022872.1300000004},{"$f":"SUM(D134:O134)","v":4133173.0100000002},null,null,null,{"$f":"-L129*1.4","v":-73986.104663212434}]
[null,null,null,{"$f":"D133-D134","v":2002182.4568399996},1945284.23468,2024667.8715599999,2027392.58724,1831786.7545200002,2056112.7937200004,2047215.2851600002,1866530.68028,{"$f":"L133-L134","v":2004485.5976},{"$f":"M133-M134","v":2022103.3679000004},-6.0000000521540642E-3,{"$f":"O133-O134","v":-3.6000001709908247E-3},null,null,null,null,{"$f":"SUM(T127:T134)","v":2037769.2016420509}]
[]
[null,"Base Revenues",null,null,null,null,null,null,null,null,null,null,null,null,null,null,null,null,null,"Annual Minimum"]
[1,{"$f":"B4","v":"Goodrich - North 2311008572"},770037736,{"$f":"500000*('Rate Design'!$I$5/100)+MIN(5500000,D4-500000)*('Rate Design'!$I$6/100)+MAX(0,D4-6000000)*('Rate Design'!$I$7/100)+'Rate Design'!$I$9+D74*'Rate Design'!$I$10-0.2*D47","v":181919.04305699997},{"$f":"500000*('Rate Design'!$I$5/100)+MIN(5500000,E4-500000)*('Rate Design'!$I$6/100)+MAX(0,E4-6000000)*('Rate Design'!$I$7/100)+'Rate Design'!$I$9+E74*'Rate Design'!$I$10-0.2*E47","v":116224.60254599999},{"$f":"500000*('Rate Design'!$I$5/100)+MIN(5500000,F4-500000)*('Rate Design'!$I$6/100)+MAX(0,F4-6000000)*('Rate Design'!$I$7/100)+'Rate Design'!$I$9+F74*'Rate Design'!$I$10-0.2*F47","v":96317.390975999995},{"$f":"500000*('Rate Design'!$I$5/100)+MIN(5500000,G4-500000)*('Rate Design'!$I$6/100)+MAX(0,G4-6000000)*('Rate Design'!$I$7/100)+'Rate Design'!$I$9+G74*'Rate Design'!$I$10-0.2*G47","v":116411.25118799999},{"$f":"500000*('Rate Design'!$I$5/100)+MIN(5500000,H4-500000)*('Rate Design'!$I$6/100)+MAX(0,H4-6000000)*('Rate Design'!$I$7/100)+'Rate Design'!$I$9+H74*'Rate Design'!$I$10-0.2*H47","v":142269.63862799999},{"$f":"500000*('Rate Design'!$I$5/100)+MIN(5500000,I4-500000)*('Rate Design'!$I$6/100)+MAX(0,I4-6000000)*('Rate Design'!$I$7/100)+'Rate Design'!$I$9+I74*'Rate Design'!$I$10-0.2*I47","v":166565.42893200001},{"$f":"500000*('Rate Design'!$I$5/100)+MIN(5500000,J4-500000)*('Rate Design'!$I$6/100)+MAX(0,J4-6000000)*('Rate Design'!$I$7/100)+'Rate Design'!$I$9+J74*'Rate Design'!$I$10-0.2*J47","v":137009.90833499999},{"$f":"500000*('Rate Design'!$I$5/100)+MIN(5500000,K4-500000)*('Rate Design'!$I$6/100)+MAX(0,K4-6000000)*('Rate Design'!$I$7/100)+'Rate Design'!$I$9+K74*'Rate Design'!$I$10-0.2*K47","v":166640.474793},{"$f":"500000*('Rate Design'!$I$5/100)+MIN(5500000,L4-500000)*('Rate Design'!$I$6/100)+MAX(0,L4-6000000)*('Rate Design'!$I$7/100)+'Rate Design'!$I$9+L74*'Rate Design'!$I$10-0.2*L47","v":196095.820098},{"$f":"500000*('Rate Design'!$I$5/100)+MIN(5500000,M4-500000)*('Rate Design'!$I$6/100)+MAX(0,M4-6000000)*('Rate Design'!$I$7/100)+'Rate Design'!$I$9+M74*'Rate Design'!$I$10-0.2*M47","v":194532.321711},{"$f":"500000*('Rate Design'!$I$5/100)+MIN(5500000,N4-500000)*('Rate Design'!$I$6/100)+MAX(0,N4-6000000)*('Rate Design'!$I$7/100)+'Rate Design'!$I$9+N74*'Rate Design'!$I$10-0.2*N47","v":182519.40595799999},{"$f":"500000*('Rate Design'!$I$5/100)+MIN(5500000,O4-500000)*('Rate Design'!$I$6/100)+MAX(0,O4-6000000)*('Rate Design'!$I$7/100)+'Rate Design'!$I$9+O74*'Rate Design'!$I$10-0.2*O47","v":226469.39853899996},{"$f":"SUM(D138:O138)","v":1922974.6847610001},null,null,null,{"$f":"IF(P138<945750,945750-P138,0)","v":0}]
[2,"Boise Cascade Plywood",500017,{"$f":"500000*('Rate Design'!$I$5/100)+MIN(5500000,D5-500000)*('Rate Design'!$I$6/100)+MAX(0,D5-6000000)*('Rate Design'!$I$7/100)+'Rate Design'!$I$9+D75*'Rate Design'!$I$10-0.2*D48","v":212177.34169499998},{"$f":"500000*('Rate Design'!$I$5/100)+MIN(5500000,E5-500000)*('Rate Design'!$I$6/100)+MAX(0,E5-6000000)*('Rate Design'!$I$7/100)+'Rate Design'!$I$9+E75*'Rate Design'!$I$10-0.2*E48","v":202361.69377199997},{"$f":"500000*('Rate Design'!$I$5/100)+MIN(5500000,F5-500000)*('Rate Design'!$I$6/100)+MAX(0,F5-6000000)*('Rate Design'!$I$7/100)+'Rate Design'!$I$9+F75*'Rate Design'!$I$10-0.2*F48","v":183391.070259},{"$f":"500000*('Rate Design'!$I$5/100)+MIN(5500000,G5-500000)*('Rate Design'!$I$6/100)+MAX(0,G5-6000000)*('Rate Design'!$I$7/100)+'Rate Design'!$I$9+G75*'Rate Design'!$I$10-0.2*G48","v":204906.63027899998},{"$f":"500000*('Rate Design'!$I$5/100)+MIN(5500000,H5-500000)*('Rate Design'!$I$6/100)+MAX(0,H5-6000000)*('Rate Design'!$I$7/100)+'Rate Design'!$I$9+H75*'Rate Design'!$I$10-0.2*H48","v":196970.06230499997},{"$f":"500000*('Rate Design'!$I$5/100)+MIN(5500000,I5-500000)*('Rate Design'!$I$6/100)+MAX(0,I5-6000000)*('Rate Design'!$I$7/100)+'Rate Design'!$I$9+I75*'Rate Design'!$I$10-0.2*I48","v":209281.69073100001},{"$f":"500000*('Rate Design'!$I$5/100)+MIN(5500000,J5-500000)*('Rate Design'!$I$6/100)+MAX(0,J5-6000000)*('Rate Design'!$I$7/100)+'Rate Design'!$I$9+J75*'Rate Design'!$I$10-0.2*J48","v":205799.17586699998},{"$f":"500000*('Rate Design'!$I$5/100)+MIN(5500000,K5-500000)*('Rate Design'!$I$6/100)+MAX(0,K5-6000000)*('Rate Design'!$I$7/100)+'Rate Design'!$I$9+K75*'Rate Design'!$I$10-0.2*K48","v":205306.89668399998},{"$f":"500000*('Rate Design'!$I$5/100)+MIN(5500000,L5-500000)*('Rate Design'!$I$6/100)+MAX(0,L5-6000000)*('Rate Design'!$I$7/100)+'Rate Design'!$I$9+L75*'Rate Design'!$I$10-0.2*L48","v":197395.671072},{"$f":"500000*('Rate Design'!$I$5/100)+MIN(5500000,M5-500000)*('Rate Design'!$I$6/100)+MAX(0,M5-6000000)*('Rate Design'!$I$7/100)+'Rate Design'!$I$9+M75*'Rate Design'!$I$10-0.2*M48","v":199971.23757599998},{"$f":"500000*('Rate Design'!$I$5/100)+MIN(5500000,N5-500000)*('Rate Design'!$I$6/100)+MAX(0,N5-6000000)*('Rate Design'!$I$7/100)+'Rate Design'!$I$9+N75*'Rate Design'!$I$10-0.2*N48","v":180182.58126599999},{"$f":"500000*('Rate Design'!$I$5/100)+MIN(5500000,O5-500000)*('Rate Design'!$I$6/100)+MAX(0,O5-6000000)*('Rate Design'!$I$7/100)+'Rate Design'!$I$9+O75*'Rate Design'!$I$10-0.2*O48","v":203275.63619399996},{"$f":"SUM(D139:O139)","v":2401019.6876999997},null,null,null,{"$f":"IF(P139<945750,945750-P139,0)","v":0}]
[3,"Boise Cascade Sawmill",500018,{"$f":"500000*('Rate Design'!$I$5/100)+MIN(5500000,D6-500000)*('Rate Design'!$I$6/100)+MAX(0,D6-6000000)*('Rate Design'!$I$7/100)+'Rate Design'!$I$9+D76*'Rate Design'!$I$10-0.2*D49","v":101136.49444499999},{"$f":"500000*('Rate Design'!$I$5/100)+MIN(5500000,E6-500000)*('Rate Design'!$I$6/100)+MAX(0,E6-6000000)*('Rate Design'!$I$7/100)+'Rate Design'!$I$9+E76*'Rate Design'!$I$10-0.2*E49","v":98476.395890999993},{"$f":"500000*('Rate Design'!$I$5/100)+MIN(5500000,F6-500000)*('Rate Design'!$I$6/100)+MAX(0,F6-6000000)*('Rate Design'!$I$7/100)+'Rate Design'!$I$9+F76*'Rate Design'!$I$10-0.2*F49","v":105891.439575},{"$f":"500000*('Rate Design'!$I$5/100)+MIN(5500000,G6-500000)*('Rate Design'!$I$6/100)+MAX(0,G6-6000000)*('Rate Design'!$I$7/100)+'Rate Design'!$I$9+G76*'Rate Design'!$I$10-0.2*G49","v":106232.575643},{"$f":"500000*('Rate Design'!$I$5/100)+MIN(5500000,H6-500000)*('Rate Design'!$I$6/100)+MAX(0,H6-6000000)*('Rate Design'!$I$7/100)+'Rate Design'!$I$9+H76*'Rate Design'!$I$10-0.2*H49","v":100855.065623},{"$f":"500000*('Rate Design'!$I$5/100)+MIN(5500000,I6-500000)*('Rate Design'!$I$6/100)+MAX(0,I6-6000000)*('Rate Design'!$I$7/100)+'Rate Design'!$I$9+I76*'Rate Design'!$I$10-0.2*I49","v":105320.41402},{"$f":"500000*('Rate Design'!$I$5/100)+MIN(5500000,J6-500000)*('Rate Design'!$I$6/100)+MAX(0,J6-6000000)*('Rate Design'!$I$7/100)+'Rate Design'!$I$9+J76*'Rate Design'!$I$10-0.2*J49","v":99299.784575999991},{"$f":"500000*('Rate Design'!$I$5/100)+MIN(5500000,K6-500000)*('Rate Design'!$I$6/100)+MAX(0,K6-6000000)*('Rate Design'!$I$7/100)+'Rate Design'!$I$9+K76*'Rate Design'!$I$10-0.2*K49","v":97044.821255999996},{"$f":"500000*('Rate Design'!$I$5/100)+MIN(5500000,L6-500000)*('Rate Design'!$I$6/100)+MAX(0,L6-6000000)*('Rate Design'!$I$7/100)+'Rate Design'!$I$9+L76*'Rate Design'!$I$10-0.2*L49","v":99177.104480999988},{"$f":"500000*('Rate Design'!$I$5/100)+MIN(5500000,M6-500000)*('Rate Design'!$I$6/100)+MAX(0,M6-6000000)*('Rate Design'!$I$7/100)+'Rate Design'!$I$9+M76*'Rate Design'!$I$10-0.2*M49","v":94719.411074999996},{"$f":"500000*('Rate Design'!$I$5/100)+MIN(5500000,N6-500000)*('Rate Design'!$I$6/100)+MAX(0,N6-6000000)*('Rate Design'!$I$7/100)+'Rate Design'!$I$9+N76*'Rate Design'!$I$10-0.2*N49","v":93848.694083999988},{"$f":"500000*('Rate Design'!$I$5/100)+MIN(5500000,O6-500000)*('Rate Design'!$I$6/100)+MAX(0,O6-6000000)*('Rate Design'!$I$7/100)+'Rate Design'!$I$9+O76*'Rate Design'!$I$10-0.2*O49","v":91928.605295000001},1193930.8059639998,null,null,null,0]
[4,"City of Spokane",1900002,{"$f":"500000*('Rate Design'!$I$5/100)+MIN(5500000,D7-500000)*('Rate Design'!$I$6/100)+MAX(0,D7-6000000)*('Rate Design'!$I$7/100)+'Rate Design'!$I$9+D77*'Rate Design'!$I$10-0.2*D50","v":100738.98199599999},{"$f":"500000*('Rate Design'!$I$5/100)+MIN(5500000,E7-500000)*('Rate Design'!$I$6/100)+MAX(0,E7-6000000)*('Rate Design'!$I$7/100)+'Rate Design'!$I$9+E77*'Rate Design'!$I$10-0.2*E50","v":102720.69816999999},{"$f":"500000*('Rate Design'!$I$5/100)+MIN(5500000,F7-500000)*('Rate Design'!$I$6/100)+MAX(0,F7-6000000)*('Rate Design'!$I$7/100)+'Rate Design'!$I$9+F77*'Rate Design'!$I$10-0.2*F50","v":108908.4931215},{"$f":"500000*('Rate Design'!$I$5/100)+MIN(5500000,G7-500000)*('Rate Design'!$I$6/100)+MAX(0,G7-6000000)*('Rate Design'!$I$7/100)+'Rate Design'!$I$9+G77*'Rate Design'!$I$10-0.2*G50","v":111750.68965449999},{"$f":"500000*('Rate Design'!$I$5/100)+MIN(5500000,H7-500000)*('Rate Design'!$I$6/100)+MAX(0,H7-6000000)*('Rate Design'!$I$7/100)+'Rate Design'!$I$9+H77*'Rate Design'!$I$10-0.2*H50","v":107410.85805949999},{"$f":"500000*('Rate Design'!$I$5/100)+MIN(5500000,I7-500000)*('Rate Design'!$I$6/100)+MAX(0,I7-6000000)*('Rate Design'!$I$7/100)+'Rate Design'!$I$9+I77*'Rate Design'!$I$10-0.2*I50","v":124144.62595949997},{"$f":"500000*('Rate Design'!$I$5/100)+MIN(5500000,J7-500000)*('Rate Design'!$I$6/100)+MAX(0,J7-6000000)*('Rate Design'!$I$7/100)+'Rate Design'!$I$9+J77*'Rate Design'!$I$10-0.2*J50","v":121445.9070735},{"$f":"500000*('Rate Design'!$I$5/100)+MIN(5500000,K7-500000)*('Rate Design'!$I$6/100)+MAX(0,K7-6000000)*('Rate Design'!$I$7/100)+'Rate Design'!$I$9+K77*'Rate Design'!$I$10-0.2*K50","v":125116.62472199998},{"$f":"500000*('Rate Design'!$I$5/100)+MIN(5500000,L7-500000)*('Rate Design'!$I$6/100)+MAX(0,L7-6000000)*('Rate Design'!$I$7/100)+'Rate Design'!$I$9+L77*'Rate Design'!$I$10-0.2*L50","v":131523.55200299999},{"$f":"500000*('Rate Design'!$I$5/100)+MIN(5500000,M7-500000)*('Rate Design'!$I$6/100)+MAX(0,M7-6000000)*('Rate Design'!$I$7/100)+'Rate Design'!$I$9+M77*'Rate Design'!$I$10-0.2*M50","v":132947.76461700001},{"$f":"500000*('Rate Design'!$I$5/100)+MIN(5500000,N7-500000)*('Rate Design'!$I$6/100)+MAX(0,N7-6000000)*('Rate Design'!$I$7/100)+'Rate Design'!$I$9+N77*'Rate Design'!$I$10-0.2*N50","v":121817.273403},{"$f":"500000*('Rate Design'!$I$5/100)+MIN(5500000,O7-500000)*('Rate Design'!$I$6/100)+MAX(0,O7-6000000)*('Rate Design'!$I$7/100)+'Rate Design'!$I$9+O77*'Rate Design'!$I$10-0.2*O50","v":112202.59597499999},1400728.0647545001,null,null,null,0]
[5,"Empire Health Services",1900011,{"$f":"500000*('Rate Design'!$I$5/100)+MIN(5500000,D8-500000)*('Rate Design'!$I$6/100)+MAX(0,D8-6000000)*('Rate Design'!$I$7/100)+'Rate Design'!$I$9+D78*'Rate Design'!$I$10-0.2*D51","v":116250.18272299999},{"$f":"500000*('Rate Design'!$I$5/100)+MIN(5500000,E8-500000)*('Rate Design'!$I$6/100)+MAX(0,E8-6000000)*('Rate Design'!$I$7/100)+'Rate Design'!$I$9+E78*'Rate Design'!$I$10-0.2*E51","v":112890.00836549999},{"$f":"500000*('Rate Design'!$I$5/100)+MIN(5500000,F8-500000)*('Rate Design'!$I$6/100)+MAX(0,F8-6000000)*('Rate Design'!$I$7/100)+'Rate Design'!$I$9+F78*'Rate Design'!$I$10-0.2*F51","v":117001.032869},{"$f":"500000*('Rate Design'!$I$5/100)+MIN(5500000,G8-500000)*('Rate Design'!$I$6/100)+MAX(0,G8-6000000)*('Rate Design'!$I$7/100)+'Rate Design'!$I$9+G78*'Rate Design'!$I$10-0.2*G51","v":116149.89539400001},{"$f":"500000*('Rate Design'!$I$5/100)+MIN(5500000,H8-500000)*('Rate Design'!$I$6/100)+MAX(0,H8-6000000)*('Rate Design'!$I$7/100)+'Rate Design'!$I$9+H78*'Rate Design'!$I$10-0.2*H51","v":110785.568086},{"$f":"500000*('Rate Design'!$I$5/100)+MIN(5500000,I8-500000)*('Rate Design'!$I$6/100)+MAX(0,I8-6000000)*('Rate Design'!$I$7/100)+'Rate Design'!$I$9+I78*'Rate Design'!$I$10-0.2*I51","v":117733.35287699998},{"$f":"500000*('Rate Design'!$I$5/100)+MIN(5500000,J8-500000)*('Rate Design'!$I$6/100)+MAX(0,J8-6000000)*('Rate Design'!$I$7/100)+'Rate Design'!$I$9+J78*'Rate Design'!$I$10-0.2*J51","v":121544.12435249999},{"$f":"500000*('Rate Design'!$I$5/100)+MIN(5500000,K8-500000)*('Rate Design'!$I$6/100)+MAX(0,K8-6000000)*('Rate Design'!$I$7/100)+'Rate Design'!$I$9+K78*'Rate Design'!$I$10-0.2*K51","v":132620.30504400001},{"$f":"500000*('Rate Design'!$I$5/100)+MIN(5500000,L8-500000)*('Rate Design'!$I$6/100)+MAX(0,L8-6000000)*('Rate Design'!$I$7/100)+'Rate Design'!$I$9+L78*'Rate Design'!$I$10-0.2*L51","v":147399.1306185},{"$f":"500000*('Rate Design'!$I$5/100)+MIN(5500000,M8-500000)*('Rate Design'!$I$6/100)+MAX(0,M8-6000000)*('Rate Design'!$I$7/100)+'Rate Design'!$I$9+M78*'Rate Design'!$I$10-0.2*M51","v":157457.57610449998},{"$f":"500000*('Rate Design'!$I$5/100)+MIN(5500000,N8-500000)*('Rate Design'!$I$6/100)+MAX(0,N8-6000000)*('Rate Design'!$I$7/100)+'Rate Design'!$I$9+N78*'Rate Design'!$I$10-0.2*N51","v":152546.06910000002},{"$f":"500000*('Rate Design'!$I$5/100)+MIN(5500000,O8-500000)*('Rate Design'!$I$6/100)+MAX(0,O8-6000000)*('Rate Design'!$I$7/100)+'Rate Design'!$I$9+O78*'Rate Design'!$I$10-0.2*O51","v":132584.51902799998},1534961.7645620001,null,null,null,0]
[6,"Gonzaga University",622922,{"$f":"500000*('Rate Design'!$I$5/100)+MIN(5500000,D9-500000)*('Rate Design'!$I$6/100)+MAX(0,D9-6000000)*('Rate Design'!$I$7/100)+'Rate Design'!$I$9+D79*'Rate Design'!$I$10-0.2*D52","v":148685.63622599997},{"$f":"500000*('Rate Design'!$I$5/100)+MIN(5500000,E9-500000)*('Rate Design'!$I$6/100)+MAX(0,E9-6000000)*('Rate Design'!$I$7/100)+'Rate Design'!$I$9+E79*'Rate Design'!$I$10-0.2*E52","v":148654.12734899999},{"$f":"500000*('Rate Design'!$I$5/100)+MIN(5500000,F9-500000)*('Rate Design'!$I$6/100)+MAX(0,F9-6000000)*('Rate Design'!$I$7/100)+'Rate Design'!$I$9+F79*'Rate Design'!$I$10-0.2*F52","v":146712.701298},{"$f":"500000*('Rate Design'!$I$5/100)+MIN(5500000,G9-500000)*('Rate Design'!$I$6/100)+MAX(0,G9-6000000)*('Rate Design'!$I$7/100)+'Rate Design'!$I$9+G79*'Rate Design'!$I$10-0.2*G52","v":156508.38792600002},{"$f":"500000*('Rate Design'!$I$5/100)+MIN(5500000,H9-500000)*('Rate Design'!$I$6/100)+MAX(0,H9-6000000)*('Rate Design'!$I$7/100)+'Rate Design'!$I$9+H79*'Rate Design'!$I$10-0.2*H52","v":155453.06529600002},{"$f":"500000*('Rate Design'!$I$5/100)+MIN(5500000,I9-500000)*('Rate Design'!$I$6/100)+MAX(0,I9-6000000)*('Rate Design'!$I$7/100)+'Rate Design'!$I$9+I79*'Rate Design'!$I$10-0.2*I52","v":147585.04356600001},{"$f":"500000*('Rate Design'!$I$5/100)+MIN(5500000,J9-500000)*('Rate Design'!$I$6/100)+MAX(0,J9-6000000)*('Rate Design'!$I$7/100)+'Rate Design'!$I$9+J79*'Rate Design'!$I$10-0.2*J52","v":137178.637575},{"$f":"500000*('Rate Design'!$I$5/100)+MIN(5500000,K9-500000)*('Rate Design'!$I$6/100)+MAX(0,K9-6000000)*('Rate Design'!$I$7/100)+'Rate Design'!$I$9+K79*'Rate Design'!$I$10-0.2*K52","v":119237.19313199999},{"$f":"500000*('Rate Design'!$I$5/100)+MIN(5500000,L9-500000)*('Rate Design'!$I$6/100)+MAX(0,L9-6000000)*('Rate Design'!$I$7/100)+'Rate Design'!$I$9+L79*'Rate Design'!$I$10-0.2*L52","v":140688.26428800001},{"$f":"500000*('Rate Design'!$I$5/100)+MIN(5500000,M9-500000)*('Rate Design'!$I$6/100)+MAX(0,M9-6000000)*('Rate Design'!$I$7/100)+'Rate Design'!$I$9+M79*'Rate Design'!$I$10-0.2*M52","v":147487.96576799999},{"$f":"500000*('Rate Design'!$I$5/100)+MIN(5500000,N9-500000)*('Rate Design'!$I$6/100)+MAX(0,N9-6000000)*('Rate Design'!$I$7/100)+'Rate Design'!$I$9+N79*'Rate Design'!$I$10-0.2*N52","v":143354.43311400001},{"$f":"500000*('Rate Design'!$I$5/100)+MIN(5500000,O9-500000)*('Rate Design'!$I$6/100)+MAX(0,O9-6000000)*('Rate Design'!$I$7/100)+'Rate Design'!$I$9+O79*'Rate Design'!$I$10-0.2*O52","v":153044.08063800001},1744589.5361760005,null,null,null,0]
[7,"Honeywell Electronics",2304636,{"$f":"500000*('Rate Design'!$I$5/100)+MIN(5500000,D10-500000)*('Rate Design'!$I$6/100)+MAX(0,D10-6000000)*('Rate Design'!$I$7/100)+'Rate Design'!$I$9+D80*'Rate Design'!$I$10-0.2*D53","v":103316.727228},{"$f":"500000*('Rate Design'!$I$5/100)+MIN(5500000,E10-500000)*('Rate Design'!$I$6/100)+MAX(0,E10-6000000)*('Rate Design'!$I$7/100)+'Rate Design'!$I$9+E80*'Rate Design'!$I$10-0.2*E53","v":101792.08972800001},{"$f":"500000*('Rate Design'!$I$5/100)+MIN(5500000,F10-500000)*('Rate Design'!$I$6/100)+MAX(0,F10-6000000)*('Rate Design'!$I$7/100)+'Rate Design'!$I$9+F80*'Rate Design'!$I$10-0.2*F53","v":102834.61778099998},{"$f":"500000*('Rate Design'!$I$5/100)+MIN(5500000,G10-500000)*('Rate Design'!$I$6/100)+MAX(0,G10-6000000)*('Rate Design'!$I$7/100)+'Rate Design'!$I$9+G80*'Rate Design'!$I$10-0.2*G53","v":103147.509144},{"$f":"500000*('Rate Design'!$I$5/100)+MIN(5500000,H10-500000)*('Rate Design'!$I$6/100)+MAX(0,H10-6000000)*('Rate Design'!$I$7/100)+'Rate Design'!$I$9+H80*'Rate Design'!$I$10-0.2*H53","v":98906.151668999999},{"$f":"500000*('Rate Design'!$I$5/100)+MIN(5500000,I10-500000)*('Rate Design'!$I$6/100)+MAX(0,I10-6000000)*('Rate Design'!$I$7/100)+'Rate Design'!$I$9+I80*'Rate Design'!$I$10-0.2*I53","v":102827.537793},{"$f":"500000*('Rate Design'!$I$5/100)+MIN(5500000,J10-500000)*('Rate Design'!$I$6/100)+MAX(0,J10-6000000)*('Rate Design'!$I$7/100)+'Rate Design'!$I$9+J80*'Rate Design'!$I$10-0.2*J53","v":102097.35127199999},{"$f":"500000*('Rate Design'!$I$5/100)+MIN(5500000,K10-500000)*('Rate Design'!$I$6/100)+MAX(0,K10-6000000)*('Rate Design'!$I$7/100)+'Rate Design'!$I$9+K80*'Rate Design'!$I$10-0.2*K53","v":106222.98149699999},{"$f":"500000*('Rate Design'!$I$5/100)+MIN(5500000,L10-500000)*('Rate Design'!$I$6/100)+MAX(0,L10-6000000)*('Rate Design'!$I$7/100)+'Rate Design'!$I$9+L80*'Rate Design'!$I$10-0.2*L53","v":119983.95176699999},{"$f":"500000*('Rate Design'!$I$5/100)+MIN(5500000,M10-500000)*('Rate Design'!$I$6/100)+MAX(0,M10-6000000)*('Rate Design'!$I$7/100)+'Rate Design'!$I$9+M80*'Rate Design'!$I$10-0.2*M53","v":123640.80383699998},{"$f":"500000*('Rate Design'!$I$5/100)+MIN(5500000,N10-500000)*('Rate Design'!$I$6/100)+MAX(0,N10-6000000)*('Rate Design'!$I$7/100)+'Rate Design'!$I$9+N80*'Rate Design'!$I$10-0.2*N53","v":120899.50946099999},{"$f":"500000*('Rate Design'!$I$5/100)+MIN(5500000,O10-500000)*('Rate Design'!$I$6/100)+MAX(0,O10-6000000)*('Rate Design'!$I$7/100)+'Rate Design'!$I$9+O80*'Rate Design'!$I$10-0.2*O53","v":112012.16884499999},1297681.4000220001,null,null,null,0]
[8,"Huntwood Industries",610074869,{"$f":"500000*('Rate Design'!$I$5/100)+MIN(5500000,D11-500000)*('Rate Design'!$I$6/100)+MAX(0,D11-6000000)*('Rate Design'!$I$7/100)+'Rate Design'!$I$9+D81*'Rate Design'!$I$10-0.2*D54","v":95197.941057000004},{"$f":"500000*('Rate Design'!$I$5/100)+MIN(5500000,E11-500000)*('Rate Design'!$I$6/100)+MAX(0,E11-6000000)*('Rate Design'!$I$7/100)+'Rate Design'!$I$9+E81*'Rate Design'!$I$10-0.2*E54","v":88962.993488999986},{"$f":"500000*('Rate Design'!$I$5/100)+MIN(5500000,F11-500000)*('Rate Design'!$I$6/100)+MAX(0,F11-6000000)*('Rate Design'!$I$7/100)+'Rate Design'!$I$9+F81*'Rate Design'!$I$10-0.2*F54","v":95155.515372000009},{"$f":"500000*('Rate Design'!$I$5/100)+MIN(5500000,G11-500000)*('Rate Design'!$I$6/100)+MAX(0,G11-6000000)*('Rate Design'!$I$7/100)+'Rate Design'!$I$9+G81*'Rate Design'!$I$10-0.2*G54","v":93598.184127},{"$f":"500000*('Rate Design'!$I$5/100)+MIN(5500000,H11-500000)*('Rate Design'!$I$6/100)+MAX(0,H11-6000000)*('Rate Design'!$I$7/100)+'Rate Design'!$I$9+H81*'Rate Design'!$I$10-0.2*H54","v":91716.94009199999},{"$f":"500000*('Rate Design'!$I$5/100)+MIN(5500000,I11-500000)*('Rate Design'!$I$6/100)+MAX(0,I11-6000000)*('Rate Design'!$I$7/100)+'Rate Design'!$I$9+I81*'Rate Design'!$I$10-0.2*I54","v":100213.716738},{"$f":"500000*('Rate Design'!$I$5/100)+MIN(5500000,J11-500000)*('Rate Design'!$I$6/100)+MAX(0,J11-6000000)*('Rate Design'!$I$7/100)+'Rate Design'!$I$9+J81*'Rate Design'!$I$10-0.2*J54","v":101574.01019099998},{"$f":"500000*('Rate Design'!$I$5/100)+MIN(5500000,K11-500000)*('Rate Design'!$I$6/100)+MAX(0,K11-6000000)*('Rate Design'!$I$7/100)+'Rate Design'!$I$9+K81*'Rate Design'!$I$10-0.2*K54","v":99050.218067999987},{"$f":"500000*('Rate Design'!$I$5/100)+MIN(5500000,L11-500000)*('Rate Design'!$I$6/100)+MAX(0,L11-6000000)*('Rate Design'!$I$7/100)+'Rate Design'!$I$9+L81*'Rate Design'!$I$10-0.2*L54","v":111068.222862},{"$f":"500000*('Rate Design'!$I$5/100)+MIN(5500000,M11-500000)*('Rate Design'!$I$6/100)+MAX(0,M11-6000000)*('Rate Design'!$I$7/100)+'Rate Design'!$I$9+M81*'Rate Design'!$I$10-0.2*M54","v":116736.41833499998},{"$f":"500000*('Rate Design'!$I$5/100)+MIN(5500000,N11-500000)*('Rate Design'!$I$6/100)+MAX(0,N11-6000000)*('Rate Design'!$I$7/100)+'Rate Design'!$I$9+N81*'Rate Design'!$I$10-0.2*N54","v":108267.20455800001},{"$f":"500000*('Rate Design'!$I$5/100)+MIN(5500000,O11-500000)*('Rate Design'!$I$6/100)+MAX(0,O11-6000000)*('Rate Design'!$I$7/100)+'Rate Design'!$I$9+O81*'Rate Design'!$I$10-0.2*O54","v":100771.46198399999},1202312.8268729998,null,null,null,0]
[null,0,2500004,0,0,0,0,0,0,0,0,0,0,0,0,0,null,null,null,0]
[9,"Simplot - Othello",290048778,{"$f":"500000*('Rate Design'!$I$5/100)+MIN(5500000,D13-500000)*('Rate Design'!$I$6/100)+MAX(0,D13-6000000)*('Rate Design'!$I$7/100)+'Rate Design'!$I$9+D83*'Rate Design'!$I$10-0.2*D56","v":379792.91573399992},{"$f":"500000*('Rate Design'!$I$5/100)+MIN(5500000,E13-500000)*('Rate Design'!$I$6/100)+MAX(0,E13-6000000)*('Rate Design'!$I$7/100)+'Rate Design'!$I$9+E83*'Rate Design'!$I$10-0.2*E56","v":304189.93332299998},{"$f":"500000*('Rate Design'!$I$5/100)+MIN(5500000,F13-500000)*('Rate Design'!$I$6/100)+MAX(0,F13-6000000)*('Rate Design'!$I$7/100)+'Rate Design'!$I$9+F83*'Rate Design'!$I$10-0.2*F56","v":337231.59408300003},{"$f":"500000*('Rate Design'!$I$5/100)+MIN(5500000,G13-500000)*('Rate Design'!$I$6/100)+MAX(0,G13-6000000)*('Rate Design'!$I$7/100)+'Rate Design'!$I$9+G83*'Rate Design'!$I$10-0.2*G56","v":351577.03417499998},{"$f":"500000*('Rate Design'!$I$5/100)+MIN(5500000,H13-500000)*('Rate Design'!$I$6/100)+MAX(0,H13-6000000)*('Rate Design'!$I$7/100)+'Rate Design'!$I$9+H83*'Rate Design'!$I$10-0.2*H56","v":327175.58280899998},{"$f":"500000*('Rate Design'!$I$5/100)+MIN(5500000,I13-500000)*('Rate Design'!$I$6/100)+MAX(0,I13-6000000)*('Rate Design'!$I$7/100)+'Rate Design'!$I$9+I83*'Rate Design'!$I$10-0.2*I56","v":376674.20852699998},{"$f":"500000*('Rate Design'!$I$5/100)+MIN(5500000,J13-500000)*('Rate Design'!$I$6/100)+MAX(0,J13-6000000)*('Rate Design'!$I$7/100)+'Rate Design'!$I$9+J83*'Rate Design'!$I$10-0.2*J56","v":372541.87319700001},{"$f":"500000*('Rate Design'!$I$5/100)+MIN(5500000,K13-500000)*('Rate Design'!$I$6/100)+MAX(0,K13-6000000)*('Rate Design'!$I$7/100)+'Rate Design'!$I$9+K83*'Rate Design'!$I$10-0.2*K56","v":378317.09504099999},{"$f":"500000*('Rate Design'!$I$5/100)+MIN(5500000,L13-500000)*('Rate Design'!$I$6/100)+MAX(0,L13-6000000)*('Rate Design'!$I$7/100)+'Rate Design'!$I$9+L83*'Rate Design'!$I$10-0.2*L56","v":382001.88879299996},{"$f":"500000*('Rate Design'!$I$5/100)+MIN(5500000,M13-500000)*('Rate Design'!$I$6/100)+MAX(0,M13-6000000)*('Rate Design'!$I$7/100)+'Rate Design'!$I$9+M83*'Rate Design'!$I$10-0.2*M56","v":388945.34697000001},{"$f":"500000*('Rate Design'!$I$5/100)+MIN(5500000,N13-500000)*('Rate Design'!$I$6/100)+MAX(0,N13-6000000)*('Rate Design'!$I$7/100)+'Rate Design'!$I$9+N83*'Rate Design'!$I$10-0.2*N56","v":390831.89868300001},{"$f":"500000*('Rate Design'!$I$5/100)+MIN(5500000,O13-500000)*('Rate Design'!$I$6/100)+MAX(0,O13-6000000)*('Rate Design'!$I$7/100)+'Rate Design'!$I$9+O83*'Rate Design'!$I$10-0.2*O56","v":365361.81057299994},4354641.1819079993,null,null,null,0]
[10,"McCaine Foods Inc",2500003,{"$f":"500000*('Rate Design'!$I$5/100)+MIN(5500000,D14-500000)*('Rate Design'!$I$6/100)+MAX(0,D14-6000000)*('Rate Design'!$I$7/100)+'Rate Design'!$I$9+D84*'Rate Design'!$I$10-0.2*D57","v":375516.89291799004},{"$f":"500000*('Rate Design'!$I$5/100)+MIN(5500000,E14-500000)*('Rate Design'!$I$6/100)+MAX(0,E14-6000000)*('Rate Design'!$I$7/100)+'Rate Design'!$I$9+E84*'Rate Design'!$I$10-0.2*E57","v":338707.01953499997},{"$f":"500000*('Rate Design'!$I$5/100)+MIN(5500000,F14-500000)*('Rate Design'!$I$6/100)+MAX(0,F14-6000000)*('Rate Design'!$I$7/100)+'Rate Design'!$I$9+F84*'Rate Design'!$I$10-0.2*F57","v":308248.334562},{"$f":"500000*('Rate Design'!$I$5/100)+MIN(5500000,G14-500000)*('Rate Design'!$I$6/100)+MAX(0,G14-6000000)*('Rate Design'!$I$7/100)+'Rate Design'!$I$9+G84*'Rate Design'!$I$10-0.2*G57","v":281031.10130399995},{"$f":"500000*('Rate Design'!$I$5/100)+MIN(5500000,H14-500000)*('Rate Design'!$I$6/100)+MAX(0,H14-6000000)*('Rate Design'!$I$7/100)+'Rate Design'!$I$9+H84*'Rate Design'!$I$10-0.2*H57","v":314315.40950099996},{"$f":"500000*('Rate Design'!$I$5/100)+MIN(5500000,I14-500000)*('Rate Design'!$I$6/100)+MAX(0,I14-6000000)*('Rate Design'!$I$7/100)+'Rate Design'!$I$9+I84*'Rate Design'!$I$10-0.2*I57","v":341474.65631099994},{"$f":"500000*('Rate Design'!$I$5/100)+MIN(5500000,J14-500000)*('Rate Design'!$I$6/100)+MAX(0,J14-6000000)*('Rate Design'!$I$7/100)+'Rate Design'!$I$9+J84*'Rate Design'!$I$10-0.2*J57","v":324047.66274900001},{"$f":"500000*('Rate Design'!$I$5/100)+MIN(5500000,K14-500000)*('Rate Design'!$I$6/100)+MAX(0,K14-6000000)*('Rate Design'!$I$7/100)+'Rate Design'!$I$9+K84*'Rate Design'!$I$10-0.2*K57","v":355551.95492099994},{"$f":"500000*('Rate Design'!$I$5/100)+MIN(5500000,L14-500000)*('Rate Design'!$I$6/100)+MAX(0,L14-6000000)*('Rate Design'!$I$7/100)+'Rate Design'!$I$9+L84*'Rate Design'!$I$10-0.2*L57","v":344027.87531399995},{"$f":"500000*('Rate Design'!$I$5/100)+MIN(5500000,M14-500000)*('Rate Design'!$I$6/100)+MAX(0,M14-6000000)*('Rate Design'!$I$7/100)+'Rate Design'!$I$9+M84*'Rate Design'!$I$10-0.2*M57","v":292534.41803100007},{"$f":"500000*('Rate Design'!$I$5/100)+MIN(5500000,N14-500000)*('Rate Design'!$I$6/100)+MAX(0,N14-6000000)*('Rate Design'!$I$7/100)+'Rate Design'!$I$9+N84*'Rate Design'!$I$10-0.2*N57","v":382059.13545},{"$f":"500000*('Rate Design'!$I$5/100)+MIN(5500000,O14-500000)*('Rate Design'!$I$6/100)+MAX(0,O14-6000000)*('Rate Design'!$I$7/100)+'Rate Design'!$I$9+O84*'Rate Design'!$I$10-0.2*O57","v":403636.46479499998},4061150.92539099,null,null,null,0]
[11,"Sacred Heart Medical Center",500020,{"$f":"500000*('Rate Design'!$I$5/100)+MIN(5500000,D15-500000)*('Rate Design'!$I$6/100)+MAX(0,D15-6000000)*('Rate Design'!$I$7/100)+'Rate Design'!$I$9+D85*'Rate Design'!$I$10-0.2*D58","v":233478.77380500003},{"$f":"500000*('Rate Design'!$I$5/100)+MIN(5500000,E15-500000)*('Rate Design'!$I$6/100)+MAX(0,E15-6000000)*('Rate Design'!$I$7/100)+'Rate Design'!$I$9+E85*'Rate Design'!$I$10-0.2*E58","v":203314.05967349999},{"$f":"500000*('Rate Design'!$I$5/100)+MIN(5500000,F15-500000)*('Rate Design'!$I$6/100)+MAX(0,F15-6000000)*('Rate Design'!$I$7/100)+'Rate Design'!$I$9+F85*'Rate Design'!$I$10-0.2*F58","v":208247.937699},{"$f":"500000*('Rate Design'!$I$5/100)+MIN(5500000,G15-500000)*('Rate Design'!$I$6/100)+MAX(0,G15-6000000)*('Rate Design'!$I$7/100)+'Rate Design'!$I$9+G85*'Rate Design'!$I$10-0.2*G58","v":206536.16028449999},{"$f":"500000*('Rate Design'!$I$5/100)+MIN(5500000,H15-500000)*('Rate Design'!$I$6/100)+MAX(0,H15-6000000)*('Rate Design'!$I$7/100)+'Rate Design'!$I$9+H85*'Rate Design'!$I$10-0.2*H58","v":192036.8885835},{"$f":"500000*('Rate Design'!$I$5/100)+MIN(5500000,I15-500000)*('Rate Design'!$I$6/100)+MAX(0,I15-6000000)*('Rate Design'!$I$7/100)+'Rate Design'!$I$9+I85*'Rate Design'!$I$10-0.2*I58","v":210886.00515750001},{"$f":"500000*('Rate Design'!$I$5/100)+MIN(5500000,J15-500000)*('Rate Design'!$I$6/100)+MAX(0,J15-6000000)*('Rate Design'!$I$7/100)+'Rate Design'!$I$9+J85*'Rate Design'!$I$10-0.2*J58","v":219058.05072899998},{"$f":"500000*('Rate Design'!$I$5/100)+MIN(5500000,K15-500000)*('Rate Design'!$I$6/100)+MAX(0,K15-6000000)*('Rate Design'!$I$7/100)+'Rate Design'!$I$9+K85*'Rate Design'!$I$10-0.2*K58","v":233899.96727999998},{"$f":"500000*('Rate Design'!$I$5/100)+MIN(5500000,L15-500000)*('Rate Design'!$I$6/100)+MAX(0,L15-6000000)*('Rate Design'!$I$7/100)+'Rate Design'!$I$9+L85*'Rate Design'!$I$10-0.2*L58","v":276163.76406899997},{"$f":"500000*('Rate Design'!$I$5/100)+MIN(5500000,M15-500000)*('Rate Design'!$I$6/100)+MAX(0,M15-6000000)*('Rate Design'!$I$7/100)+'Rate Design'!$I$9+M85*'Rate Design'!$I$10-0.2*M58","v":285530.77313849999},{"$f":"500000*('Rate Design'!$I$5/100)+MIN(5500000,N15-500000)*('Rate Design'!$I$6/100)+MAX(0,N15-6000000)*('Rate Design'!$I$7/100)+'Rate Design'!$I$9+N85*'Rate Design'!$I$10-0.2*N58","v":271553.3238675},{"$f":"500000*('Rate Design'!$I$5/100)+MIN(5500000,O15-500000)*('Rate Design'!$I$6/100)+MAX(0,O15-6000000)*('Rate Design'!$I$7/100)+'Rate Design'!$I$9+O85*'Rate Design'!$I$10-0.2*O58","v":232374.12474000003},2773079.8290269999,null,null,null,0]
[12,"Spokane County Combined Master",1900012,{"$f":"500000*('Rate Design'!$I$5/100)+MIN(5500000,D16-500000)*('Rate Design'!$I$6/100)+MAX(0,D16-6000000)*('Rate Design'!$I$7/100)+'Rate Design'!$I$9+D86*'Rate Design'!$I$10-0.2*D59","v":85162.605863999983},{"$f":"500000*('Rate Design'!$I$5/100)+MIN(5500000,E16-500000)*('Rate Design'!$I$6/100)+MAX(0,E16-6000000)*('Rate Design'!$I$7/100)+'Rate Design'!$I$9+E86*'Rate Design'!$I$10-0.2*E59","v":78376.343056499987},{"$f":"500000*('Rate Design'!$I$5/100)+MIN(5500000,F16-500000)*('Rate Design'!$I$6/100)+MAX(0,F16-6000000)*('Rate Design'!$I$7/100)+'Rate Design'!$I$9+F86*'Rate Design'!$I$10-0.2*F59","v":80464.735231500003},{"$f":"500000*('Rate Design'!$I$5/100)+MIN(5500000,G16-500000)*('Rate Design'!$I$6/100)+MAX(0,G16-6000000)*('Rate Design'!$I$7/100)+'Rate Design'!$I$9+G86*'Rate Design'!$I$10-0.2*G59","v":79921.030927},{"$f":"500000*('Rate Design'!$I$5/100)+MIN(5500000,H16-500000)*('Rate Design'!$I$6/100)+MAX(0,H16-6000000)*('Rate Design'!$I$7/100)+'Rate Design'!$I$9+H86*'Rate Design'!$I$10-0.2*H59","v":76183.268655499996},{"$f":"500000*('Rate Design'!$I$5/100)+MIN(5500000,I16-500000)*('Rate Design'!$I$6/100)+MAX(0,I16-6000000)*('Rate Design'!$I$7/100)+'Rate Design'!$I$9+I86*'Rate Design'!$I$10-0.2*I59","v":80162.467540499987},{"$f":"500000*('Rate Design'!$I$5/100)+MIN(5500000,J16-500000)*('Rate Design'!$I$6/100)+MAX(0,J16-6000000)*('Rate Design'!$I$7/100)+'Rate Design'!$I$9+J86*'Rate Design'!$I$10-0.2*J59","v":81494.572406749998},{"$f":"500000*('Rate Design'!$I$5/100)+MIN(5500000,K16-500000)*('Rate Design'!$I$6/100)+MAX(0,K16-6000000)*('Rate Design'!$I$7/100)+'Rate Design'!$I$9+K86*'Rate Design'!$I$10-0.2*K59","v":85448.600210499993},{"$f":"500000*('Rate Design'!$I$5/100)+MIN(5500000,L16-500000)*('Rate Design'!$I$6/100)+MAX(0,L16-6000000)*('Rate Design'!$I$7/100)+'Rate Design'!$I$9+L86*'Rate Design'!$I$10-0.2*L59","v":93973.057908000002},{"$f":"500000*('Rate Design'!$I$5/100)+MIN(5500000,M16-500000)*('Rate Design'!$I$6/100)+MAX(0,M16-6000000)*('Rate Design'!$I$7/100)+'Rate Design'!$I$9+M86*'Rate Design'!$I$10-0.2*M59","v":102557.78824499999},{"$f":"500000*('Rate Design'!$I$5/100)+MIN(5500000,N16-500000)*('Rate Design'!$I$6/100)+MAX(0,N16-6000000)*('Rate Design'!$I$7/100)+'Rate Design'!$I$9+N86*'Rate Design'!$I$10-0.2*N59","v":98013.139682499997},{"$f":"500000*('Rate Design'!$I$5/100)+MIN(5500000,O16-500000)*('Rate Design'!$I$6/100)+MAX(0,O16-6000000)*('Rate Design'!$I$7/100)+'Rate Design'!$I$9+O86*'Rate Design'!$I$10-0.2*O59","v":86863.38754499999},1028620.9972727499,null,null,null,0]
[13,"Spokane Industries",2400169,{"$f":"500000*('Rate Design'!$I$5/100)+MIN(5500000,D17-500000)*('Rate Design'!$I$6/100)+MAX(0,D17-6000000)*('Rate Design'!$I$7/100)+'Rate Design'!$I$9+D87*'Rate Design'!$I$10-0.2*D60","v":85102.121244000009},{"$f":"500000*('Rate Design'!$I$5/100)+MIN(5500000,E17-500000)*('Rate Design'!$I$6/100)+MAX(0,E17-6000000)*('Rate Design'!$I$7/100)+'Rate Design'!$I$9+E87*'Rate Design'!$I$10-0.2*E60","v":70609.816722000003},{"$f":"500000*('Rate Design'!$I$5/100)+MIN(5500000,F17-500000)*('Rate Design'!$I$6/100)+MAX(0,F17-6000000)*('Rate Design'!$I$7/100)+'Rate Design'!$I$9+F87*'Rate Design'!$I$10-0.2*F60","v":82526.901501},{"$f":"500000*('Rate Design'!$I$5/100)+MIN(5500000,G17-500000)*('Rate Design'!$I$6/100)+MAX(0,G17-6000000)*('Rate Design'!$I$7/100)+'Rate Design'!$I$9+G87*'Rate Design'!$I$10-0.2*G60","v":98442.534432},{"$f":"500000*('Rate Design'!$I$5/100)+MIN(5500000,H17-500000)*('Rate Design'!$I$6/100)+MAX(0,H17-6000000)*('Rate Design'!$I$7/100)+'Rate Design'!$I$9+H87*'Rate Design'!$I$10-0.2*H60","v":102324.30498299999},{"$f":"500000*('Rate Design'!$I$5/100)+MIN(5500000,I17-500000)*('Rate Design'!$I$6/100)+MAX(0,I17-6000000)*('Rate Design'!$I$7/100)+'Rate Design'!$I$9+I87*'Rate Design'!$I$10-0.2*I60","v":108509.92787999999},{"$f":"500000*('Rate Design'!$I$5/100)+MIN(5500000,J17-500000)*('Rate Design'!$I$6/100)+MAX(0,J17-6000000)*('Rate Design'!$I$7/100)+'Rate Design'!$I$9+J87*'Rate Design'!$I$10-0.2*J60","v":101164.825254},{"$f":"500000*('Rate Design'!$I$5/100)+MIN(5500000,K17-500000)*('Rate Design'!$I$6/100)+MAX(0,K17-6000000)*('Rate Design'!$I$7/100)+'Rate Design'!$I$9+K87*'Rate Design'!$I$10-0.2*K60","v":103331.777844},{"$f":"500000*('Rate Design'!$I$5/100)+MIN(5500000,L17-500000)*('Rate Design'!$I$6/100)+MAX(0,L17-6000000)*('Rate Design'!$I$7/100)+'Rate Design'!$I$9+L87*'Rate Design'!$I$10-0.2*L60","v":102301.507164},{"$f":"500000*('Rate Design'!$I$5/100)+MIN(5500000,M17-500000)*('Rate Design'!$I$6/100)+MAX(0,M17-6000000)*('Rate Design'!$I$7/100)+'Rate Design'!$I$9+M87*'Rate Design'!$I$10-0.2*M60","v":102131.42159999999},{"$f":"500000*('Rate Design'!$I$5/100)+MIN(5500000,N17-500000)*('Rate Design'!$I$6/100)+MAX(0,N17-6000000)*('Rate Design'!$I$7/100)+'Rate Design'!$I$9+N87*'Rate Design'!$I$10-0.2*N60","v":97568.720400000006},{"$f":"500000*('Rate Design'!$I$5/100)+MIN(5500000,O17-500000)*('Rate Design'!$I$6/100)+MAX(0,O17-6000000)*('Rate Design'!$I$7/100)+'Rate Design'!$I$9+O87*'Rate Design'!$I$10-0.2*O60","v":102629.808516},1156643.6675400001,null,null,null,0]
[null,0,610018682,0,0,0,0,0,0,0,0,0,0,0,0,0,null,null,null,0]
[14,"Vaagen Brothers Lumber",690067830,{"$f":"500000*('Rate Design'!$I$5/100)+MIN(5500000,D19-500000)*('Rate Design'!$I$6/100)+MAX(0,D19-6000000)*('Rate Design'!$I$7/100)+'Rate Design'!$I$9+D89*'Rate Design'!$I$10-0.2*D62","v":155960.105568},{"$f":"500000*('Rate Design'!$I$5/100)+MIN(5500000,E19-500000)*('Rate Design'!$I$6/100)+MAX(0,E19-6000000)*('Rate Design'!$I$7/100)+'Rate Design'!$I$9+E89*'Rate Design'!$I$10-0.2*E62","v":162694.307784},{"$f":"500000*('Rate Design'!$I$5/100)+MIN(5500000,F19-500000)*('Rate Design'!$I$6/100)+MAX(0,F19-6000000)*('Rate Design'!$I$7/100)+'Rate Design'!$I$9+F89*'Rate Design'!$I$10-0.2*F62","v":173718.23120399998},{"$f":"500000*('Rate Design'!$I$5/100)+MIN(5500000,G19-500000)*('Rate Design'!$I$6/100)+MAX(0,G19-6000000)*('Rate Design'!$I$7/100)+'Rate Design'!$I$9+G89*'Rate Design'!$I$10-0.2*G62","v":167973.37003199998},{"$f":"500000*('Rate Design'!$I$5/100)+MIN(5500000,H19-500000)*('Rate Design'!$I$6/100)+MAX(0,H19-6000000)*('Rate Design'!$I$7/100)+'Rate Design'!$I$9+H89*'Rate Design'!$I$10-0.2*H62","v":163285.70262},{"$f":"500000*('Rate Design'!$I$5/100)+MIN(5500000,I19-500000)*('Rate Design'!$I$6/100)+MAX(0,I19-6000000)*('Rate Design'!$I$7/100)+'Rate Design'!$I$9+I89*'Rate Design'!$I$10-0.2*I62","v":164568.295656},{"$f":"500000*('Rate Design'!$I$5/100)+MIN(5500000,J19-500000)*('Rate Design'!$I$6/100)+MAX(0,J19-6000000)*('Rate Design'!$I$7/100)+'Rate Design'!$I$9+J89*'Rate Design'!$I$10-0.2*J62","v":152116.07494799999},{"$f":"500000*('Rate Design'!$I$5/100)+MIN(5500000,K19-500000)*('Rate Design'!$I$6/100)+MAX(0,K19-6000000)*('Rate Design'!$I$7/100)+'Rate Design'!$I$9+K89*'Rate Design'!$I$10-0.2*K62","v":138064.56606000001},{"$f":"500000*('Rate Design'!$I$5/100)+MIN(5500000,L19-500000)*('Rate Design'!$I$6/100)+MAX(0,L19-6000000)*('Rate Design'!$I$7/100)+'Rate Design'!$I$9+L89*'Rate Design'!$I$10-0.2*L62","v":132981.37443600001},{"$f":"500000*('Rate Design'!$I$5/100)+MIN(5500000,M19-500000)*('Rate Design'!$I$6/100)+MAX(0,M19-6000000)*('Rate Design'!$I$7/100)+'Rate Design'!$I$9+M89*'Rate Design'!$I$10-0.2*M62","v":125247.370704},{"$f":"500000*('Rate Design'!$I$5/100)+MIN(5500000,N19-500000)*('Rate Design'!$I$6/100)+MAX(0,N19-6000000)*('Rate Design'!$I$7/100)+'Rate Design'!$I$9+N89*'Rate Design'!$I$10-0.2*N62","v":132137.932344},{"$f":"500000*('Rate Design'!$I$5/100)+MIN(5500000,O19-500000)*('Rate Design'!$I$6/100)+MAX(0,O19-6000000)*('Rate Design'!$I$7/100)+'Rate Design'!$I$9+O89*'Rate Design'!$I$10-0.2*O62","v":131289.60955199998},1800036.9409079999,null,null,null,0]
[15,"WSU - MP-A South Campus Feeder ",1300001,{"$f":"500000*('Rate Design'!$I$5/100)+MIN(5500000,D20-500000)*('Rate Design'!$I$6/100)+MAX(0,D20-6000000)*('Rate Design'!$I$7/100)+'Rate Design'!$I$9+D90*'Rate Design'!$I$10-0.2*D63","v":151606.691796},{"$f":"500000*('Rate Design'!$I$5/100)+MIN(5500000,E20-500000)*('Rate Design'!$I$6/100)+MAX(0,E20-6000000)*('Rate Design'!$I$7/100)+'Rate Design'!$I$9+E90*'Rate Design'!$I$10-0.2*E63","v":148506.726456},{"$f":"500000*('Rate Design'!$I$5/100)+MIN(5500000,F20-500000)*('Rate Design'!$I$6/100)+MAX(0,F20-6000000)*('Rate Design'!$I$7/100)+'Rate Design'!$I$9+F90*'Rate Design'!$I$10-0.2*F63","v":154232.98630799999},{"$f":"500000*('Rate Design'!$I$5/100)+MIN(5500000,G20-500000)*('Rate Design'!$I$6/100)+MAX(0,G20-6000000)*('Rate Design'!$I$7/100)+'Rate Design'!$I$9+G90*'Rate Design'!$I$10-0.2*G63","v":152764.731},{"$f":"500000*('Rate Design'!$I$5/100)+MIN(5500000,H20-500000)*('Rate Design'!$I$6/100)+MAX(0,H20-6000000)*('Rate Design'!$I$7/100)+'Rate Design'!$I$9+H90*'Rate Design'!$I$10-0.2*H63","v":147509.57415600002},{"$f":"500000*('Rate Design'!$I$5/100)+MIN(5500000,I20-500000)*('Rate Design'!$I$6/100)+MAX(0,I20-6000000)*('Rate Design'!$I$7/100)+'Rate Design'!$I$9+I90*'Rate Design'!$I$10-0.2*I63","v":155394.83643600001},{"$f":"500000*('Rate Design'!$I$5/100)+MIN(5500000,J20-500000)*('Rate Design'!$I$6/100)+MAX(0,J20-6000000)*('Rate Design'!$I$7/100)+'Rate Design'!$I$9+J90*'Rate Design'!$I$10-0.2*J63","v":149083.14637199999},{"$f":"500000*('Rate Design'!$I$5/100)+MIN(5500000,K20-500000)*('Rate Design'!$I$6/100)+MAX(0,K20-6000000)*('Rate Design'!$I$7/100)+'Rate Design'!$I$9+K90*'Rate Design'!$I$10-0.2*K63","v":150674.53213199999},{"$f":"500000*('Rate Design'!$I$5/100)+MIN(5500000,L20-500000)*('Rate Design'!$I$6/100)+MAX(0,L20-6000000)*('Rate Design'!$I$7/100)+'Rate Design'!$I$9+L90*'Rate Design'!$I$10-0.2*L63","v":153404.37250799997},{"$f":"500000*('Rate Design'!$I$5/100)+MIN(5500000,M20-500000)*('Rate Design'!$I$6/100)+MAX(0,M20-6000000)*('Rate Design'!$I$7/100)+'Rate Design'!$I$9+M90*'Rate Design'!$I$10-0.2*M63","v":155017.71746399996},{"$f":"500000*('Rate Design'!$I$5/100)+MIN(5500000,N20-500000)*('Rate Design'!$I$6/100)+MAX(0,N20-6000000)*('Rate Design'!$I$7/100)+'Rate Design'!$I$9+N90*'Rate Design'!$I$10-0.2*N63","v":159396.83791199999},{"$f":"500000*('Rate Design'!$I$5/100)+MIN(5500000,O20-500000)*('Rate Design'!$I$6/100)+MAX(0,O20-6000000)*('Rate Design'!$I$7/100)+'Rate Design'!$I$9+O90*'Rate Design'!$I$10-0.2*O63","v":159822.02177999998},1837414.17432,null,null,null,0]
[16,"WSU - MP-B East Campus EA ",290081951,{"$f":"500000*('Rate Design'!$I$5/100)+MIN(5500000,D21-500000)*('Rate Design'!$I$6/100)+MAX(0,D21-6000000)*('Rate Design'!$I$7/100)+'Rate Design'!$I$9+D91*'Rate Design'!$I$10-0.2*D64","v":284017.78785239998},{"$f":"500000*('Rate Design'!$I$5/100)+MIN(5500000,E21-500000)*('Rate Design'!$I$6/100)+MAX(0,E21-6000000)*('Rate Design'!$I$7/100)+'Rate Design'!$I$9+E91*'Rate Design'!$I$10-0.2*E64","v":272131.19677739998},{"$f":"500000*('Rate Design'!$I$5/100)+MIN(5500000,F21-500000)*('Rate Design'!$I$6/100)+MAX(0,F21-6000000)*('Rate Design'!$I$7/100)+'Rate Design'!$I$9+F91*'Rate Design'!$I$10-0.2*F64","v":281144.53734089999},{"$f":"500000*('Rate Design'!$I$5/100)+MIN(5500000,G21-500000)*('Rate Design'!$I$6/100)+MAX(0,G21-6000000)*('Rate Design'!$I$7/100)+'Rate Design'!$I$9+G91*'Rate Design'!$I$10-0.2*G64","v":258939.20502810003},{"$f":"500000*('Rate Design'!$I$5/100)+MIN(5500000,H21-500000)*('Rate Design'!$I$6/100)+MAX(0,H21-6000000)*('Rate Design'!$I$7/100)+'Rate Design'!$I$9+H91*'Rate Design'!$I$10-0.2*H64","v":245024.14194509998},{"$f":"500000*('Rate Design'!$I$5/100)+MIN(5500000,I21-500000)*('Rate Design'!$I$6/100)+MAX(0,I21-6000000)*('Rate Design'!$I$7/100)+'Rate Design'!$I$9+I91*'Rate Design'!$I$10-0.2*I64","v":246791.60189669998},{"$f":"500000*('Rate Design'!$I$5/100)+MIN(5500000,J21-500000)*('Rate Design'!$I$6/100)+MAX(0,J21-6000000)*('Rate Design'!$I$7/100)+'Rate Design'!$I$9+J91*'Rate Design'!$I$10-0.2*J64","v":239688.47518469999},{"$f":"500000*('Rate Design'!$I$5/100)+MIN(5500000,K21-500000)*('Rate Design'!$I$6/100)+MAX(0,K21-6000000)*('Rate Design'!$I$7/100)+'Rate Design'!$I$9+K91*'Rate Design'!$I$10-0.2*K64","v":269947.44401730003},{"$f":"500000*('Rate Design'!$I$5/100)+MIN(5500000,L21-500000)*('Rate Design'!$I$6/100)+MAX(0,L21-6000000)*('Rate Design'!$I$7/100)+'Rate Design'!$I$9+L91*'Rate Design'!$I$10-0.2*L64","v":343405.1679234},{"$f":"500000*('Rate Design'!$I$5/100)+MIN(5500000,M21-500000)*('Rate Design'!$I$6/100)+MAX(0,M21-6000000)*('Rate Design'!$I$7/100)+'Rate Design'!$I$9+M91*'Rate Design'!$I$10-0.2*M64","v":370141.98864869995},{"$f":"500000*('Rate Design'!$I$5/100)+MIN(5500000,N21-500000)*('Rate Design'!$I$6/100)+MAX(0,N21-6000000)*('Rate Design'!$I$7/100)+'Rate Design'!$I$9+N91*'Rate Design'!$I$10-0.2*N64","v":377127.53889119998},{"$f":"500000*('Rate Design'!$I$5/100)+MIN(5500000,O21-500000)*('Rate Design'!$I$6/100)+MAX(0,O21-6000000)*('Rate Design'!$I$7/100)+'Rate Design'!$I$9+O91*'Rate Design'!$I$10-0.2*O64","v":318592.86128639994},3506951.9467922999,null,null,null,0]
[17,"WSU - MP-C East Campus EB ",500033,{"$f":"500000*('Rate Design'!$I$5/100)+MIN(5500000,D22-500000)*('Rate Design'!$I$6/100)+MAX(0,D22-6000000)*('Rate Design'!$I$7/100)+'Rate Design'!$I$9+D92*'Rate Design'!$I$10-0.2*D65","v":205910.42838599999},{"$f":"500000*('Rate Design'!$I$5/100)+MIN(5500000,E22-500000)*('Rate Design'!$I$6/100)+MAX(0,E22-6000000)*('Rate Design'!$I$7/100)+'Rate Design'!$I$9+E92*'Rate Design'!$I$10-0.2*E65","v":212181.78569699998},{"$f":"500000*('Rate Design'!$I$5/100)+MIN(5500000,F22-500000)*('Rate Design'!$I$6/100)+MAX(0,F22-6000000)*('Rate Design'!$I$7/100)+'Rate Design'!$I$9+F92*'Rate Design'!$I$10-0.2*F65","v":220351.06570800001},{"$f":"500000*('Rate Design'!$I$5/100)+MIN(5500000,G22-500000)*('Rate Design'!$I$6/100)+MAX(0,G22-6000000)*('Rate Design'!$I$7/100)+'Rate Design'!$I$9+G92*'Rate Design'!$I$10-0.2*G65","v":214029.69395700001},{"$f":"500000*('Rate Design'!$I$5/100)+MIN(5500000,H22-500000)*('Rate Design'!$I$6/100)+MAX(0,H22-6000000)*('Rate Design'!$I$7/100)+'Rate Design'!$I$9+H92*'Rate Design'!$I$10-0.2*H65","v":210017.24392799998},{"$f":"500000*('Rate Design'!$I$5/100)+MIN(5500000,I22-500000)*('Rate Design'!$I$6/100)+MAX(0,I22-6000000)*('Rate Design'!$I$7/100)+'Rate Design'!$I$9+I92*'Rate Design'!$I$10-0.2*I65","v":212219.26341599997},{"$f":"500000*('Rate Design'!$I$5/100)+MIN(5500000,J22-500000)*('Rate Design'!$I$6/100)+MAX(0,J22-6000000)*('Rate Design'!$I$7/100)+'Rate Design'!$I$9+J92*'Rate Design'!$I$10-0.2*J65","v":186753.00675899998},{"$f":"500000*('Rate Design'!$I$5/100)+MIN(5500000,K22-500000)*('Rate Design'!$I$6/100)+MAX(0,K22-6000000)*('Rate Design'!$I$7/100)+'Rate Design'!$I$9+K92*'Rate Design'!$I$10-0.2*K65","v":191229.071322},{"$f":"500000*('Rate Design'!$I$5/100)+MIN(5500000,L22-500000)*('Rate Design'!$I$6/100)+MAX(0,L22-6000000)*('Rate Design'!$I$7/100)+'Rate Design'!$I$9+L92*'Rate Design'!$I$10-0.2*L65","v":191827.29863100001},{"$f":"500000*('Rate Design'!$I$5/100)+MIN(5500000,M22-500000)*('Rate Design'!$I$6/100)+MAX(0,M22-6000000)*('Rate Design'!$I$7/100)+'Rate Design'!$I$9+M92*'Rate Design'!$I$10-0.2*M65","v":194320.69972499998},{"$f":"500000*('Rate Design'!$I$5/100)+MIN(5500000,N22-500000)*('Rate Design'!$I$6/100)+MAX(0,N22-6000000)*('Rate Design'!$I$7/100)+'Rate Design'!$I$9+N92*'Rate Design'!$I$10-0.2*N65","v":197599.93414500001},{"$f":"500000*('Rate Design'!$I$5/100)+MIN(5500000,O22-500000)*('Rate Design'!$I$6/100)+MAX(0,O22-6000000)*('Rate Design'!$I$7/100)+'Rate Design'!$I$9+O92*'Rate Design'!$I$10-0.2*O65","v":200740.06345799999},2437179.5551319998,null,null,null,0]
[18,"WSU - MP-D Casp East (no PVD)",410031282,{"$f":"500000*('Rate Design'!$I$5/100)+MIN(5500000,D23-500000)*('Rate Design'!$I$6/100)+MAX(0,D23-6000000)*('Rate Design'!$I$7/100)+'Rate Design'!$I$9+D93*'Rate Design'!$I$10","v":158122.86069999999},{"$f":"500000*('Rate Design'!$I$5/100)+MIN(5500000,E23-500000)*('Rate Design'!$I$6/100)+MAX(0,E23-6000000)*('Rate Design'!$I$7/100)+'Rate Design'!$I$9+E93*'Rate Design'!$I$10","v":161598.79108},{"$f":"500000*('Rate Design'!$I$5/100)+MIN(5500000,F23-500000)*('Rate Design'!$I$6/100)+MAX(0,F23-6000000)*('Rate Design'!$I$7/100)+'Rate Design'!$I$9+F93*'Rate Design'!$I$10","v":166576.4503},{"$f":"500000*('Rate Design'!$I$5/100)+MIN(5500000,G23-500000)*('Rate Design'!$I$6/100)+MAX(0,G23-6000000)*('Rate Design'!$I$7/100)+'Rate Design'!$I$9+G93*'Rate Design'!$I$10","v":183638.38845999999},{"$f":"500000*('Rate Design'!$I$5/100)+MIN(5500000,H23-500000)*('Rate Design'!$I$6/100)+MAX(0,H23-6000000)*('Rate Design'!$I$7/100)+'Rate Design'!$I$9+H93*'Rate Design'!$I$10","v":184323.59258},{"$f":"500000*('Rate Design'!$I$5/100)+MIN(5500000,I23-500000)*('Rate Design'!$I$6/100)+MAX(0,I23-6000000)*('Rate Design'!$I$7/100)+'Rate Design'!$I$9+I93*'Rate Design'!$I$10","v":184696.99457999997},{"$f":"500000*('Rate Design'!$I$5/100)+MIN(5500000,J23-500000)*('Rate Design'!$I$6/100)+MAX(0,J23-6000000)*('Rate Design'!$I$7/100)+'Rate Design'!$I$9+J93*'Rate Design'!$I$10","v":184075.30119999999},{"$f":"500000*('Rate Design'!$I$5/100)+MIN(5500000,K23-500000)*('Rate Design'!$I$6/100)+MAX(0,K23-6000000)*('Rate Design'!$I$7/100)+'Rate Design'!$I$9+K93*'Rate Design'!$I$10","v":173949.66095999998},{"$f":"500000*('Rate Design'!$I$5/100)+MIN(5500000,L23-500000)*('Rate Design'!$I$6/100)+MAX(0,L23-6000000)*('Rate Design'!$I$7/100)+'Rate Design'!$I$9+L93*'Rate Design'!$I$10","v":163372.27742},{"$f":"500000*('Rate Design'!$I$5/100)+MIN(5500000,M23-500000)*('Rate Design'!$I$6/100)+MAX(0,M23-6000000)*('Rate Design'!$I$7/100)+'Rate Design'!$I$9+M93*'Rate Design'!$I$10","v":170228.78216},{"$f":"500000*('Rate Design'!$I$5/100)+MIN(5500000,N23-500000)*('Rate Design'!$I$6/100)+MAX(0,N23-6000000)*('Rate Design'!$I$7/100)+'Rate Design'!$I$9+N93*'Rate Design'!$I$10","v":214421.97717999999},{"$f":"500000*('Rate Design'!$I$5/100)+MIN(5500000,O23-500000)*('Rate Design'!$I$6/100)+MAX(0,O23-6000000)*('Rate Design'!$I$7/100)+'Rate Design'!$I$9+O93*'Rate Design'!$I$10","v":154973.86771999998},2099978.9443399999,null,null,null,0]
[19,"WSU - MP-E Casp West (no PVD)",500032,{"$f":"500000*('Rate Design'!$I$5/100)+MIN(5500000,D24-500000)*('Rate Design'!$I$6/100)+MAX(0,D24-6000000)*('Rate Design'!$I$7/100)+'Rate Design'!$I$9+D94*'Rate Design'!$I$10","v":161786.13828799999},{"$f":"500000*('Rate Design'!$I$5/100)+MIN(5500000,E24-500000)*('Rate Design'!$I$6/100)+MAX(0,E24-6000000)*('Rate Design'!$I$7/100)+'Rate Design'!$I$9+E94*'Rate Design'!$I$10","v":116300.113896},{"$f":"500000*('Rate Design'!$I$5/100)+MIN(5500000,F24-500000)*('Rate Design'!$I$6/100)+MAX(0,F24-6000000)*('Rate Design'!$I$7/100)+'Rate Design'!$I$9+F94*'Rate Design'!$I$10","v":118732.55405999999},{"$f":"500000*('Rate Design'!$I$5/100)+MIN(5500000,G24-500000)*('Rate Design'!$I$6/100)+MAX(0,G24-6000000)*('Rate Design'!$I$7/100)+'Rate Design'!$I$9+G94*'Rate Design'!$I$10","v":121257.000596},{"$f":"500000*('Rate Design'!$I$5/100)+MIN(5500000,H24-500000)*('Rate Design'!$I$6/100)+MAX(0,H24-6000000)*('Rate Design'!$I$7/100)+'Rate Design'!$I$9+H94*'Rate Design'!$I$10","v":120131.54133199998},{"$f":"500000*('Rate Design'!$I$5/100)+MIN(5500000,I24-500000)*('Rate Design'!$I$6/100)+MAX(0,I24-6000000)*('Rate Design'!$I$7/100)+'Rate Design'!$I$9+I94*'Rate Design'!$I$10","v":119622.01401599999},{"$f":"500000*('Rate Design'!$I$5/100)+MIN(5500000,J24-500000)*('Rate Design'!$I$6/100)+MAX(0,J24-6000000)*('Rate Design'!$I$7/100)+'Rate Design'!$I$9+J94*'Rate Design'!$I$10","v":140628.04120800001},{"$f":"500000*('Rate Design'!$I$5/100)+MIN(5500000,K24-500000)*('Rate Design'!$I$6/100)+MAX(0,K24-6000000)*('Rate Design'!$I$7/100)+'Rate Design'!$I$9+K94*'Rate Design'!$I$10","v":142987.31964},{"$f":"500000*('Rate Design'!$I$5/100)+MIN(5500000,L24-500000)*('Rate Design'!$I$6/100)+MAX(0,L24-6000000)*('Rate Design'!$I$7/100)+'Rate Design'!$I$9+L94*'Rate Design'!$I$10","v":190072.92801600002},{"$f":"500000*('Rate Design'!$I$5/100)+MIN(5500000,M24-500000)*('Rate Design'!$I$6/100)+MAX(0,M24-6000000)*('Rate Design'!$I$7/100)+'Rate Design'!$I$9+M94*'Rate Design'!$I$10","v":221704.78416799998},{"$f":"500000*('Rate Design'!$I$5/100)+MIN(5500000,N24-500000)*('Rate Design'!$I$6/100)+MAX(0,N24-6000000)*('Rate Design'!$I$7/100)+'Rate Design'!$I$9+N94*'Rate Design'!$I$10","v":199918.98319},{"$f":"500000*('Rate Design'!$I$5/100)+MIN(5500000,O24-500000)*('Rate Design'!$I$6/100)+MAX(0,O24-6000000)*('Rate Design'!$I$7/100)+'Rate Design'!$I$9+O94*'Rate Design'!$I$10","v":207880.60922799999},1861022.027638,null,null,null,0]
[20,"Goodrich - South 2311155858 (No PVD)",null,{"$f":"500000*('Rate Design'!$I$5/100)+MIN(5500000,D25-500000)*('Rate Design'!$I$6/100)+MAX(0,D25-6000000)*('Rate Design'!$I$7/100)+'Rate Design'!$I$9+D95*'Rate Design'!$I$10","v":101476.58169599998},{"$f":"500000*('Rate Design'!$I$5/100)+MIN(5500000,E25-500000)*('Rate Design'!$I$6/100)+MAX(0,E25-6000000)*('Rate Design'!$I$7/100)+'Rate Design'!$I$9+E95*'Rate Design'!$I$10","v":57923.483891999997},{"$f":"500000*('Rate Design'!$I$5/100)+MIN(5500000,F25-500000)*('Rate Design'!$I$6/100)+MAX(0,F25-6000000)*('Rate Design'!$I$7/100)+'Rate Design'!$I$9+F95*'Rate Design'!$I$10","v":47891.881079999999},{"$f":"500000*('Rate Design'!$I$5/100)+MIN(5500000,G25-500000)*('Rate Design'!$I$6/100)+MAX(0,G25-6000000)*('Rate Design'!$I$7/100)+'Rate Design'!$I$9+G95*'Rate Design'!$I$10","v":93480.84032399999},{"$f":"500000*('Rate Design'!$I$5/100)+MIN(5500000,H25-500000)*('Rate Design'!$I$6/100)+MAX(0,H25-6000000)*('Rate Design'!$I$7/100)+'Rate Design'!$I$9+H95*'Rate Design'!$I$10","v":110780.55753599999},{"$f":"500000*('Rate Design'!$I$5/100)+MIN(5500000,I25-500000)*('Rate Design'!$I$6/100)+MAX(0,I25-6000000)*('Rate Design'!$I$7/100)+'Rate Design'!$I$9+I95*'Rate Design'!$I$10","v":123002.70673199999},{"$f":"500000*('Rate Design'!$I$5/100)+MIN(5500000,J25-500000)*('Rate Design'!$I$6/100)+MAX(0,J25-6000000)*('Rate Design'!$I$7/100)+'Rate Design'!$I$9+J95*'Rate Design'!$I$10","v":116769.153288},{"$f":"500000*('Rate Design'!$I$5/100)+MIN(5500000,K25-500000)*('Rate Design'!$I$6/100)+MAX(0,K25-6000000)*('Rate Design'!$I$7/100)+'Rate Design'!$I$9+K95*'Rate Design'!$I$10","v":135978.802268},{"$f":"500000*('Rate Design'!$I$5/100)+MIN(5500000,L25-500000)*('Rate Design'!$I$6/100)+MAX(0,L25-6000000)*('Rate Design'!$I$7/100)+'Rate Design'!$I$9+L95*'Rate Design'!$I$10","v":176723.03159199998},{"$f":"500000*('Rate Design'!$I$5/100)+MIN(5500000,M25-500000)*('Rate Design'!$I$6/100)+MAX(0,M25-6000000)*('Rate Design'!$I$7/100)+'Rate Design'!$I$9+M95*'Rate Design'!$I$10","v":145053.28704800003},{"$f":"500000*('Rate Design'!$I$5/100)+MIN(5500000,N25-500000)*('Rate Design'!$I$6/100)+MAX(0,N25-6000000)*('Rate Design'!$I$7/100)+'Rate Design'!$I$9+N95*'Rate Design'!$I$10","v":163963.852464},{"$f":"500000*('Rate Design'!$I$5/100)+MIN(5500000,O25-500000)*('Rate Design'!$I$6/100)+MAX(0,O25-6000000)*('Rate Design'!$I$7/100)+'Rate Design'!$I$9+O95*'Rate Design'!$I$10","v":187239.60116399996},{"$f":"SUM(D159:O159)","v":1460283.7790839998},null,null,null,0]
[21,"Boise Cascade LLC Inland Region",null,{"$f":"500000*('Rate Design'!$I$5/100)+MIN(5500000,D26-500000)*('Rate Design'!$I$6/100)+MAX(0,D26-6000000)*('Rate Design'!$I$7/100)+'Rate Design'!$I$9+D96*'Rate Design'!$I$10-0.2*D69","v":78877.504398000005},{"$f":"500000*('Rate Design'!$I$5/100)+MIN(5500000,E26-500000)*('Rate Design'!$I$6/100)+MAX(0,E26-6000000)*('Rate Design'!$I$7/100)+'Rate Design'!$I$9+E96*'Rate Design'!$I$10-0.2*E69","v":81150.673629000012},{"$f":"500000*('Rate Design'!$I$5/100)+MIN(5500000,F26-500000)*('Rate Design'!$I$6/100)+MAX(0,F26-6000000)*('Rate Design'!$I$7/100)+'Rate Design'!$I$9+F96*'Rate Design'!$I$10-0.2*F69","v":84752.770169999989},{"$f":"500000*('Rate Design'!$I$5/100)+MIN(5500000,G26-500000)*('Rate Design'!$I$6/100)+MAX(0,G26-6000000)*('Rate Design'!$I$7/100)+'Rate Design'!$I$9+G96*'Rate Design'!$I$10-0.2*G69","v":88765.918850999995},{"$f":"500000*('Rate Design'!$I$5/100)+MIN(5500000,H26-500000)*('Rate Design'!$I$6/100)+MAX(0,H26-6000000)*('Rate Design'!$I$7/100)+'Rate Design'!$I$9+H96*'Rate Design'!$I$10-0.2*H69","v":86758.706873999996},{"$f":"500000*('Rate Design'!$I$5/100)+MIN(5500000,I26-500000)*('Rate Design'!$I$6/100)+MAX(0,I26-6000000)*('Rate Design'!$I$7/100)+'Rate Design'!$I$9+I96*'Rate Design'!$I$10-0.2*I69","v":85708.983637259997},{"$f":"500000*('Rate Design'!$I$5/100)+MIN(5500000,J26-500000)*('Rate Design'!$I$6/100)+MAX(0,J26-6000000)*('Rate Design'!$I$7/100)+'Rate Design'!$I$9+J96*'Rate Design'!$I$10-0.2*J69","v":80410.215584999998},{"$f":"500000*('Rate Design'!$I$5/100)+MIN(5500000,K26-500000)*('Rate Design'!$I$6/100)+MAX(0,K26-6000000)*('Rate Design'!$I$7/100)+'Rate Design'!$I$9+K96*'Rate Design'!$I$10-0.2*K69","v":74937.030780000001},{"$f":"500000*('Rate Design'!$I$5/100)+MIN(5500000,L26-500000)*('Rate Design'!$I$6/100)+MAX(0,L26-6000000)*('Rate Design'!$I$7/100)+'Rate Design'!$I$9+L96*'Rate Design'!$I$10-0.2*L69","v":78033.724319999994},{"$f":"500000*('Rate Design'!$I$5/100)+MIN(5500000,M26-500000)*('Rate Design'!$I$6/100)+MAX(0,M26-6000000)*('Rate Design'!$I$7/100)+'Rate Design'!$I$9+M96*'Rate Design'!$I$10-0.2*M69","v":74608.344218999991},{"$f":"500000*('Rate Design'!$I$5/100)+MIN(5500000,N26-500000)*('Rate Design'!$I$6/100)+MAX(0,N26-6000000)*('Rate Design'!$I$7/100)+'Rate Design'!$I$9+N96*'Rate Design'!$I$10-0.2*N69","v":76078.70592600001},{"$f":"500000*('Rate Design'!$I$5/100)+MIN(5500000,O26-500000)*('Rate Design'!$I$6/100)+MAX(0,O26-6000000)*('Rate Design'!$I$7/100)+'Rate Design'!$I$9+O96*'Rate Design'!$I$10-0.2*O69","v":77043.646208999999},{"$f":"SUM(D160:O160)","v":967126.22459826013},null,null,null,{"$f":"IF(P160<945750,945750-P160,0)","v":0}]
[null,"Schedule 25 Total",null,null,null,null,null,null,null,null,null,null,null,null,null,{"$f":"SUM(P138:P160)","v":42042328.964763798},{"$f":"P161-'Pres & Prop Rev'!I152","v":1623.3717637956142},null,null,{"$f":"SUM(T138:T160)","v":0}]
[]
[null,null,null,24,24,24,24,24,24,24,24,24,24,24,24]
[null,null,null,31,30,31,31,28,31,30,31,30,31,31,30,{"$f":"SUM(D164:O164)","v":365}]
[null,null,null,{"$f":"D163*D164","v":744},{"$f":"E163*E164","v":720},{"$f":"F163*F164","v":744},744,672,744,720,744,720,744,744,720,{"$f":"SUM(D165:O165)","v":8760}]
[null,"Load Factor",null,{"$f":"D3","v":"2020-10-31"},"2020-11-30","2020-12-31","2021-01-31","2021-02-28","2021-03-31","2021-04-30","2021-05-31","2021-06-30","2021-07-31","2021-08-31","2021-09-30","Monthly Average","Annual Peak"]
[1,{"$f":"B4","v":"Goodrich - North 2311008572"},null,{"$f":"(D4/D$165)/D47","v":0.62809709625267807},0.68282845676970882,0.63321184354400173,0.60110093905309214,0.67600470085738262,0.65333581357932724,0.61930359816220126,0.71439173358482466,0.68645175450901308,0.63809290427218002,0.64018204616848906,0.71957397265548262,{"$f":"AVERAGE(D167:O167)","v":0.65771457161736524},{"$f":"(P4/8760)/Q47","v":0.48455835736943276}]
[2,"Boise Cascade Plywood",null,{"$f":"(D5/D$165)/D48","v":0.76930720718376966},0.7519728498546322,0.62256667097940976,0.73271755811586181,0.77995870628887243,0.76911687629453163,0.77141523110652854,0.74475636683008151,0.7405162861571557,0.73915984846904625,0.60908027871103343,0.72087042454156713,{"$f":"AVERAGE(D168:O168)","v":0.72928652537770755},0.70312987125946069]
[3,"Boise Cascade Sawmill",null,{"$f":"(D6/D$165)/D49","v":0.61493897874099923},0.6257988132353357,0.61808382496592673,0.62192112730709181,0.65535761108446877,0.63897439021433666,0.62961674088603203,0.60015324621047517,0.64784594973934795,0.61025800992425383,0.61902002400022715,0.59095830534802452,0.62274391847137667,0.57423660103850582]
[4,"City of Spokane",null,{"$f":"(D7/D$165)/D50","v":0.63435275536351809},0.63851029970194673,0.69353800713127245,0.74225103957527316,0.73375605366647767,0.63513017580106002,0.64864105277079753,0.63323910655499438,0.63395885623786907,0.69750490656782627,0.64503166537835466,0.53006651696829821,0.65549836964314068,0.55145052520177218]
[5,"Empire Health Services",null,{"$f":"(D8/D$165)/D51","v":0.80013528447699189},0.79526354978836888,0.79523435302279055,0.77851782722575058,0.79275901651821989,0.81359442539817006,0.69016929330933119,0.66998335171847812,0.69269378070604348,0.7736113543097598,0.73709615619736601,0.73056097228094852,0.75580161374601806,0.59280191057143405]
[6,"Gonzaga University",null,{"$f":"(D9/D$165)/D52","v":0.57607444742072889},0.66198735228558536,0.68495672359332072,0.66944990278092531,0.71917515494742601,0.69235908527772827,0.59346560180522911,0.45937869695490896,0.46264918302825592,0.51688403195233901,0.51485057642259813,0.52926280056648689,0.59004112975296097,0.50727204055651143]
[7,"Honeywell Electronics",null,{"$f":"(D10/D$165)/D53","v":0.57623743139777583},0.55220509875056289,0.58305709757452306,0.57862828701821767,0.58866469895711937,0.58651214450694222,0.59381884176817035,0.60535345155999409,0.54055603834372623,0.57795132162050433,0.5762490037707102,0.57253316708644675,0.57764721519622442,0.48676336082308869]
[8,"Huntwood Industries",null,{"$f":"(D11/D$165)/D54","v":0.3127719444501903},0.28980708636285069,0.30526024913458599,0.30490433059454031,0.32052708414273773,0.33844314001305104,0.359862840844344,0.34221576447779301,0.35281040149858817,0.3711803261078811,0.3572895985036626,0.3429298005942551,0.3331668805603733,0.30592749279133313]
[null,0,null,0,0,0,0,0,0,0,0,0,0,0,0,0,0]
[9,"Simplot - Othello",null,{"$f":"(D13/D$165)/D56","v":0.89374788843403807},0.70570130016827126,0.76255589391066048,0.80973169459139638,0.79233553374304355,0.85794465585604895,0.89196138345354159,0.88199538232516939,0.90788856869475909,0.88127467607613352,0.88746644029778865,0.87185148479446817,0.84537124186210999,{"$f":"(P13/8760)/Q56","v":0.82705012090335051}]
[10,"McCaine Foods Inc",null,{"$f":"(D14/D$165)/D57","v":0.58313221372278279},0.7928404309208873,0.67045311728937551,0.61873461648598538,0.80584608478040776,0.83592452793816041,0.73791460812984322,0.83701182947733976,0.80431233337197172,0.58966689067215339,0.76442445242072032,0.66263546388457883,0.7252413807578505,{"$f":"(P14/8760)/Q57","v":0.55775583519880689}]
[11,"Sacred Heart Medical Center",null,{"$f":"(D15/D$165)/D58","v":0.65452182279516691},0.84518110406850988,0.86535973563915602,0.84942118204070205,0.86092255786791594,0.77873251612089256,0.68556283460129608,0.69256861857066809,0.64516852729421559,0.76014737963433809,0.71675269134072328,0.72667117463932074,0.75675084538440884,{"$f":"(P15/8760)/Q58","v":0.54883824280093996}]
[12,"Spokane County Combined Master",null,{"$f":"(D16/D$165)/D59","v":0.56696267645713738},0.70296738516422208,0.7219828717436827,0.6890621431898809,0.71209602274242334,0.60719810820568254,0.60074702776454814,0.57595276465444534,0.56838673471415146,0.66344899941049285,0.61746766651764173,0.58369792863601044,0.63416419410002656,{"$f":"(P16/8760)/Q59","v":0.48345669509669914}]
[13,"Spokane Industries",null,{"$f":"(D17/D$165)/D60","v":0.12058188446929215},0.17499203865489005,0.14572065573832452,0.17374059224962851,0.21815688997856614,0.20575299251320736,0.2131325002549164,0.19102816711056411,0.2094214429006408,0.19788553100638992,0.15509628730900088,0.21771780176802619,0.18526889866278726,{"$f":"(P17/8760)/Q60","v":0.17012580234918287}]
[null,0,null,0,0,0,0,0,0,0,0,0,0,0,0,0,0]
[14,"Vaagen Brothers Lumber",null,{"$f":"(D19/D$165)/D62","v":0.61738335410318934},0.66064710031269258,0.66656933238456761,0.63459927770927882,0.6471468606904357,0.63195882528760461,0.64950978702834494,0.60493961766072579,0.57279542982795162,0.54376159675080216,0.58587775165193556,0.54661175476445867,0.613483390680999,{"$f":"(P19/8760)/Q62","v":0.54906790974344155}]
[15,"WSU - MP-A South Campus Feeder ",null,{"$f":"(D20/D$165)/D63","v":0.76187387038315546},0.85810067525442646,0.79153118500185327,0.83496944387705896,0.86895877683964906,0.82833877274211731,0.82593502344911207,0.81928162267257043,0.78610873163003236,0.77607621273146077,0.78765991436642802,0.76298869721722395,0.80848524384709064,0.72980485638276893]
[16,"WSU - MP-B East Campus EA ",null,{"$f":"(D21/D$165)/D64","v":0.64041000251883584},0.78430199844359771,0.79014059452723684,0.75602058632154279,0.76734300059992244,0.78531580662663147,0.68691138829065668,0.58615718854726373,0.61261059614559987,0.69077674465754979,0.65033824487261038,0.65237477210441919,0.7002250769713223,0.5150011847203888]
[17,"WSU - MP-C East Campus EB ",null,{"$f":"(D22/D$165)/D65","v":0.74658242529235186},0.75498488958326981,0.76670401790274179,0.8299568442426164,0.77127311159421319,0.78081884719617911,0.74835271791573288,0.80805509094068273,0.83769568033466579,0.84585874273099504,0.81851907924541778,0.77126887027569135,0.79000585977121318,0.7012960283314098]
[18,"WSU - MP-D Casp East (no PVD)",null,{"$f":"(D23/D$165)/D66","v":0.70913579241315061},0.70776139136762328,0.72382558594691904,0.74141455771026232,0.78273846934614422,0.73775427013728989,0.76185465487215442,0.7056015758707217,0.72852637487361938,0.73528412723541636,0.40643039432752243,0.7503282187873378,0.70755461774068007,0.38711182847027986]
[19,"WSU - MP-E Casp West (no PVD)",null,{"$f":"(D24/D$165)/D67","v":0.52108212695081579},0.79454310123358773,0.75244961435415547,0.70637124419786457,0.78046522442701427,0.77002186850172838,0.60241288627153788,0.62888237900257726,0.65757732275717895,0.80602335154824323,0.61872746715781113,0.56965936284067353,0.68401799577026567,0.43028918125265148]
[20,"Goodrich - South 2311155858 (No PVD)",null,{"$f":"(D25/D$165)/D68","v":0.35612060732170547},0.39185726105916135,0.28638009371751161,0.42554848907084891,0.45958718575414481,0.48024833148382523,0.54879166232909993,0.57318528735602592,0.29579126670419298,0.57928947157635258,0.47674966401063279,0.56576527851482405,{"$f":"AVERAGE(D188:O188)","v":0.45327621657486056},0.22711621570429336]
[21,"Boise Cascade LLC Inland Region",null,{"$f":"(D26/D$165)/D69","v":0.29295615055431323},0.28951246164593636,0.30584603426505125,0.29722606298028437,0.3150229695823778,0.31186596194311855,0.28458489048063945,0.25133561965668566,0.28422542720714339,0.27345689686000124,0.26336378640427904,0.28173086973318212,0.28759392760941771,0.26618928751716769]

{"sheet":"Lighting summary","index":10,"n_rows":55,"n_cols":17,"rows_kept":55,"cut":false,"hidden":false,"merged":[[6,2,6,3],[6,5,6,6]]}
[null,"AVISTA UTILITIES"]
[null,"WASHINGTON ELECTRIC"]
[null,"STREET & AREA LIGHT REVENUE UNDER PRESENT & PROPOSED RATES"]
[null,"12 MONTHS ENDED SEPTEMBER 30, 2021"]
[]
[]
[null,null,{"$f":"\"Present \"&IF(Base1_Billing2=2,\"Billing \",\"\")&\"Rates(1)\"","v":"Present Rates(1)"},{"$f":"\"Present \"&IF(Base1_Billing2=2,\"Billing\",\"\")&\" Rates\"","v":"Present  Rates"},null,{"$f":"\"Proposed \"&IF(Base1_Billing2=2,\"Billing \",\"\")&\"Rates(2)\"","v":"Proposed Rates(2)"},{"$f":"\"Proposed \"&IF(Base1_Billing2=2,\"Billing \",\"\")&\"Rates\"","v":"Proposed Rates"},null,"% Revenue Change"]
[null,null,"Monthly ","Annual",null,"Monthly ","Annual",null,null,null,null,"Target Base",null,"Annual","Present","Proposed"]
[null,null,"Revenue","Revenue",null,"Revenue","Revenue",null,"Base Rates","Billing Rates",null,"% Change",null,"kWh's","kWh Rate","kWh Rate"]
[]
[null,"Schedule 41",{"$f":"'St Lts'!Y$106*IF(Base1_Billing2=2,(1+$I$39),1)","v":194.43},{"$f":"C11*12","v":2333.16},null,{"$f":"'St Lts'!AQ$106*IF(Base1_Billing2=2,1+$D$39,1)","v":199.04},{"$f":"F11*12","v":2388.48},null,{"$f":"G11/D11-1","v":2.3710332767577169E-2},0,null,2.3800000000000002E-2,null,{"$f":"'REVRUNS 12ME0921'!P258","v":14833.298000000001}]
[null,"Schedule 42",{"$f":"'St Lts'!Z$106*IF(Base1_Billing2=2,1+$I$39,1)","v":379269.46},{"$f":"C12*12","v":4551233.5200000005},null,{"$f":"'St Lts'!AR$106*IF(Base1_Billing2=2,1+$D$39,1)","v":388507.18},{"$f":"F12*12","v":4662086.16},null,{"$f":"G12/D12-1","v":2.4356614423950651E-2},0,null,2.2499999999999999E-2,null,{"$f":"'REVRUNS 12ME0921'!P267","v":8956623.8769499995}]
[null,"Schedule 44",{"$f":"'St Lts'!AA$106*IF(Base1_Billing2=2,1+$I$39,1)","v":2045.34},24544.079999999998,null,{"$f":"'St Lts'!AS$106*IF(Base1_Billing2=2,1+$D$39,1)","v":2094.1999999999998},25130.399999999998,null,{"$f":"G13/D13-1","v":2.3888448864247458E-2},0,null,{"$f":"L11","v":2.3800000000000002E-2},null,{"$f":"'REVRUNS 12ME0921'!P276","v":159335.68799999999}]
[null,"Schedule 45",{"$f":"'St Lts'!AB$106*IF(Base1_Billing2=2,1+$I$39,1)","v":2919.2},35030.399999999994,null,{"$f":"'St Lts'!AT$106*IF(Base1_Billing2=2,1+$D$39,1)","v":2989.14},35869.68,null,2.3958618799671427E-2,0,null,{"$f":"L11","v":2.3800000000000002E-2},null,{"$f":"'REVRUNS 12ME0921'!P285","v":421051.22900000005}]
[null,"Schedule 46",{"$f":"'St Lts'!AC$106*IF(Base1_Billing2=2,1+$I$39,1)","v":8347.69},100172.28,null,{"$f":"'St Lts'!AU$106*IF(Base1_Billing2=2,1+$D$39,1)","v":8544.81},102537.72,null,2.3613718286136676E-2,0,null,{"$f":"L11","v":2.3800000000000002E-2},null,{"$f":"'REVRUNS 12ME0921'!P294","v":772407.87600000005},{"$f":"D15/N15","v":0.12968832026772342},{"$f":"G15/N15","v":0.13275074372752771}]
[null,"Schedule 47",{"$f":"'Area Lts'!S55*IF(Base1_Billing2=2,1+$I$39,1)","v":129012.28999999998},1548147.4799999997,null,{"$f":"IF(Base1_Billing2=1,'Area Lts'!AG55,'Area Lts'!AG64)","v":132081.26999999999},1584975.2399999998,null,2.3788276295227284E-2,0,null,{"$f":"L11","v":2.3800000000000002E-2},null,{"$f":"'REVRUNS 12ME0921'!P303","v":4370876.38729}]
[null,"Schedule 48",{"$f":"'Area Lts'!T55*IF(Base1_Billing2=2,1+$I$39,1)","v":75170.130193999998},902041.56232799997,null,{"$f":"IF(Base1_Billing2=1,'Area Lts'!AH55,'Area Lts'!AH64)","v":76959.080193999995},923508.96232799999,null,2.3798681675594624E-2,0,null,{"$f":"L11","v":2.3800000000000002E-2},null,{"$f":"'REVRUNS 12ME0921'!P313","v":2284668.1255500005}]
[]
[null,"Total",{"$f":"SUM(C11:C17)","v":596958.540194},{"$f":"SUM(D11:D17)","v":7163502.4823280005},null,{"$f":"SUM(F11:F17)","v":611374.72019400005},{"$f":"SUM(G11:G17)","v":7336496.6423279997},null,{"$f":"G19/D19-1","v":2.4149382292637966E-2},0,null,{"$f":"L11","v":2.3800000000000002E-2},null,{"$f":"SUM(N11:N18)","v":16979796.48079}]
[null,null,{"$f":"ROUND(C19-CHOOSE(Base1_Billing2,'St Lts'!AC108+'Area Lts'!T56,'St Lts'!AC114+'Area Lts'!T65+G52),0)","v":0},null,null,{"$f":"ROUND(F19-CHOOSE(Base1_Billing2,'St Lts'!AU107+'Area Lts'!AH56,'St Lts'!AU113+'Area Lts'!AH65),0)","v":0},null,null,null,null,null,{"$f":"I19-L19","v":3.4938229263796472E-4}]
[null,"Sch 46 Per kWh Rate",null,{"$f":"D15/N15","v":0.12968832026772342},null,null,{"$f":"G15/N15","v":0.13275074372752771}]
[null,null,null,null,null,null,null,null,null,null,null,null,null,null,null,"Reconciliation"]
[null,"(1) from JDM-E-12/14",null,null,null,null,7479,null,null,null,null,{"$f":"G19-('Rate Spread GRC'!H31*1000)","v":10949.581834031269},null,null,null,7610000,"Rate Year 1 Final"]
[null,"(2) from JDM-E-13/14",null,null,null,null,null,null,null,null,null,null,null,null,null,-445000,"Colstrip Schedule 99"]
[null,null,null,null,null,null,null,null,null,null,null,null,null,null,null,{"$f":"SUM(P23:P24)","v":7165000},"Rate Year 1 Revised"]
[null,null,"Billed",{"$f":"D19*(1+I39)+'Area Lts'!T63*12","v":7163502.4823280005},null,"b4 Sch 91/92",{"$f":"G19*(1+J39)+'Area Lts'!AH63*12","v":7336496.6423279997},null,{"$f":"G26/D26-1","v":2.4149382292637966E-2},null,{"$f":"G26-D26","v":172994.15999999922}]
[null,null,"Diff",{"$f":"D26-D19","v":0},null,"b4 Sch 91/92",{"$f":"G26-G19","v":0},null,null,null,null,null,null,null,null,7610000,"Rate Year 1 Final"]
[null,null,"Pres 91/92",{"$f":"D$19*(I36+I37)","v":0},null,"91/92 b4 Sch 91/92",{"$f":"G$19*(J36+J37)","v":0},null,null,null,null,null,null,null,null,-445000,"Colstrip Schedule 99"]
[null,null,"Pres 93",{"$f":"D$19*I38","v":0},null,"93 b4 Sch 93",{"$f":"G$19*J38","v":0},null,null,null,null,null,null,null,null,172000,"Rate Year 2 Stip Increase"]
[null,null,"add'l 91/92",{"$f":"D28*($L$36+L37)","v":0},null,null,null,null,null,null,null,null,null,null,null,{"$f":"SUM(P27:P29)","v":7337000},"Rate Year 2 Revised"]
[null,null,"Billed",{"$f":"D26","v":7163502.4823280005},null,"w/Sch 91/92/93/98",{"$f":"G19*(1+D39)+'Area Lts'!AH63*12","v":7336496.6423279997},null,{"$f":"G31/D31-1","v":2.4149382292637966E-2},null,{"$f":"G31-D26","v":172994.15999999922},{"$f":"K31-J$19","v":172994.15999999922}]
[null,null,null,null,null,null,null,null,null,null,null,null,null,null,null,7782000,"Rate Year 2 Stip"]
[null,null,null,null,null,null,null,null,null,null,null,null,null,null,null,{"$f":"P28","v":-445000},"Colstrip"]
[null,null,null,null,null,null,null,null,null,"Revised",null,null,null,null,null,{"$f":"SUM(P32:P33)","v":7337000},"Rate Year 2 Revised"]
[null,null,null,"Proposed",null,null,null,null,"Present","Present","Proposed"]
[null,null,null,{"$f":"K36","v":0},null,null,"Sch 91-DSM",null,0,{"$f":"(L19+(1+I36))/(1+L19)-1","v":0},{"$f":"J36*(1+L36)","v":0},0]
[null,null,null,{"$f":"K37","v":0},null,null,"Sch 92-LIRAP",null,0,{"$f":"(L19+(1+I37))/(1+L19)-1","v":0},{"$f":"J37*(1+L37)","v":0},0,"Reflects additional LIRAP funding"]
[null,null,null,{"$f":"K38","v":0},null,null,null,null,0,{"$f":"(L19+(1+I38))/(1+L19)-1","v":0},{"$f":"J38*(1+$L$38)","v":0},0]
[null,null,null,{"$f":"D36+D37+D38","v":0},null,null,"Total adder",null,{"$f":"I36+I37+I38","v":0},{"$f":"J36+J37+J38","v":0},{"$f":"K36+K37+K38","v":0}]
[]
[null,null,"Schedule 98","Schedule 91","Schedule 59",null,"Total Revenue"]
[null,"copy of Total above",488916.65005000005,488917.65005,5866999.8006000007,null,556466.54005000007,6677598.4805999994]
[null,"diff from curr Total above",{"$f":"C19-C42","v":108041.89014399995},{"$f":"D19-D42","v":6674584.8322780002},{"$f":"D19-E42","v":1296502.6817279998},null,{"$f":"F19-G42","v":54908.180143999984},{"$f":"G19-H42","v":658898.16172800027}]
[null,"% diff",{"$f":"C43/C42","v":0.22098222699707776},{"$f":"D43/D42","v":13.651756756164177},{"$f":"E43/E42","v":0.22098222699707784},null,{"$f":"G43/G42","v":9.8672923153773684E-2},{"$f":"H43/H42","v":9.8672923153773781E-2}]
[null,"Schedule 41",null,null,null,null,{"$f":"C45+D45+F45","v":0}]
[null,"Schedule 42",null,null,null,null,{"$f":"C46+D46+F46","v":0}]
[null,"Schedule 44",null,null,null,null,0]
[null,"Schedule 45",null,null,null,null,0]
[null,"Schedule 46",null,null,null,null,0]
[null,"Schedule 47",null,null,null,null,0]
[null,"Schedule 48",null,null,null,null,0]
[null,"Total",{"$f":"C45+C46+C47+C48+C49+C50+C51","v":0},{"$f":"D45+D46+D47+D48+D49+D50+D51","v":0},null,{"$f":"E45+E46+E47+E48+E49+E50+F51","v":0},{"$f":"C52+F52+D52","v":0}]
[]
[]
[null,null,null,null,null,"Total Billed",{"$f":"D31+G52","v":7163502.4823280005}]

{"sheet":"St Lts","index":11,"n_rows":160,"n_cols":75,"rows_kept":160,"cut":false,"hidden":false,"merged":[]}
["Street Light Summary",null,null,null,null,null,null,null,"WASHINGTON Street Lights (Schedule 41 - 46 Rates)",null,null,null,null,null,null,null,null,null,null,null,null,null,null,null,null,null,null,null,null,null,null,null,null,null,null,"% rate increase -->",{"$f":"'Lighting summary'!L11","v":2.3800000000000002E-2},{"$f":"'Lighting summary'!L12","v":2.2499999999999999E-2},{"$f":"'Lighting summary'!L13","v":2.3800000000000002E-2},{"$f":"'Lighting summary'!L14","v":2.3800000000000002E-2},{"$f":"'Lighting summary'!L15","v":2.3800000000000002E-2},null,null,null,null,null,null,null,null,null,null,null,null,null,null,null,{"$f":"-0.00789-0.00045-0.00339","v":-1.1730000000000001E-2},"compare input Present Billing Rates to calculated Present Billing Rates",null,null,null,null,null,null,{"$f":"BF2","v":1.0150999999999999}]
["MDM-10069 Report as of 9/30/21",null,null,null,null,null,null,null,null,null,null,null,"Number of Lights(1)",null,null,null,null,null,"Present Rates",null,null,null,null,null,"Monthly Revenue at Present Rates",null,null,null,null,null,"Number of Lights",null,null,null,null,null,"Proposed Rates",null,null,null,null,null,"Monthly Revenue at Proposed Rates",null,null,null,null,null,null,null,"Present Billing Rates",null,null,null,null,null,1.3939999999999999E-2,{"$f":"1+0.0151","v":1.0150999999999999},"Sch 91 & 92",null,null,null,null,null,"New Billing Rates",null,null,null,null,null,"Increase"]
[null,null,null,null,null,null,null,null,"Fixture Type","Pole Facility","Size","Sched","041","042","044","045","046",null,"041","042","044","045","046",null,"041","042","044","045","046",null,"041","042","044","045","046",null,"041","042","044","045","046",null,"041","042","044","045","046",null,null,"kwh","041","042","044","045","046",null,"Sch 93/94","041","042","044","045","046",null,null,"041","042","044","045","046",null,"041","042","044","045","046"]
[null,null,null,null,null,null,null,null,"LED (Dusk to Dawn)","Dusk to Dawn","5W","005L",{"$f":"SUMIF($G:$G,TEXT(M$3,\"000\")&TEXT($L4,\"000\"),$E:$E)","v":0},0,0,0,0,{"$f":"IF(SUM(M4:Q4)>0,0,1)","v":1},0,null,0,0,0.23,null,{"$f":"IF(AND(M4<>0,S4=0),#VALUE!,M4*S4)","v":0},{"$f":"IF(AND(N4<>0,T4=0),#VALUE!,N4*T4)","v":0},{"$f":"IF(AND(O4<>0,U4=0),#VALUE!,O4*U4)","v":0},{"$f":"IF(AND(P4<>0,V4=0),#VALUE!,P4*V4)","v":0},{"$f":"IF(AND(Q4<>0,W4=0),#VALUE!,Q4*W4)","v":0},null,{"$f":"SUMIF($G:$G,TEXT(AE$3,\"000\")&TEXT($L4,\"000\"),$E:$E)","v":0},0,0,0,0,null,{"$f":"ROUND(S4*(1+AK$1),2)","v":0},null,{"$f":"ROUND(U4*(1+AM$1),2)","v":0},{"$f":"ROUND(V4*(1+AN$1),2)","v":0},{"$f":"ROUND(W4*(1+AO$1),2)","v":0.24},null,{"$f":"IF(AND(AE4<>0,AK4=0),#VALUE!,AE4*AK4)","v":0},{"$f":"IF(AND(AF4<>0,AL4=0),#VALUE!,AF4*AL4)","v":0},{"$f":"IF(AND(AG4<>0,AM4=0),#VALUE!,AG4*AM4)","v":0},{"$f":"IF(AND(AH4<>0,AN4=0),#VALUE!,AH4*AN4)","v":0},{"$f":"IF(AND(AI4<>0,AO4=0),#VALUE!,AI4*AO4)","v":0},null,null,2,null,null,null,null,0.23347299999999999,null,{"$f":"ROUND(AX4*$BE$2,2)+ROUND(AX4*$BE$1,2)","v":9.9999999999999985E-3},null,null,null,null,{"$f":"ROUND((W4*$BF$2)+$BE4-BC4,2)","v":0.01},null,null,{"$f":"AK4*$BM$1","v":0},{"$f":"AL4*$BM$1","v":0},{"$f":"AM4*$BM$1","v":0},{"$f":"AN4*$BM$1","v":0},{"$f":"AO4*$BM$1","v":0.24362399999999995},null,{"$f":"BM4-AY4","v":0},{"$f":"BN4-AZ4","v":0},{"$f":"BO4-BA4","v":0},{"$f":"BP4-BB4","v":0},{"$f":"BQ4-BC4","v":1.0150999999999966E-2}]
[null,"State","Sched","Rate Sub","# of Lights",null,null,null,"LED (Dusk to Dawn)","Dusk to Dawn","5W","015L",0,0,0,0,42,{"$f":"IF(SUM(M5:Q5)>0,0,1)","v":0},0,null,0,0,0.56000000000000005,null,{"$f":"IF(AND(M5<>0,S5=0),#VALUE!,M5*S5)","v":0},{"$f":"IF(AND(N5<>0,T5=0),#VALUE!,N5*T5)","v":0},{"$f":"IF(AND(O5<>0,U5=0),#VALUE!,O5*U5)","v":0},{"$f":"IF(AND(P5<>0,V5=0),#VALUE!,P5*V5)","v":0},{"$f":"IF(AND(Q5<>0,W5=0),#VALUE!,Q5*W5)","v":23.520000000000003},null,0,0,0,0,42,null,{"$f":"ROUND(S5*(1+AK$1),2)","v":0},null,{"$f":"ROUND(U5*(1+AM$1),2)","v":0},{"$f":"ROUND(V5*(1+AN$1),2)","v":0},{"$f":"ROUND(W5*(1+AO$1),2)","v":0.56999999999999995},null,{"$f":"IF(AND(AE5<>0,AK5=0),#VALUE!,AE5*AK5)","v":0},{"$f":"IF(AND(AF5<>0,AL5=0),#VALUE!,AF5*AL5)","v":0},{"$f":"IF(AND(AG5<>0,AM5=0),#VALUE!,AG5*AM5)","v":0},{"$f":"IF(AND(AH5<>0,AN5=0),#VALUE!,AH5*AN5)","v":0},{"$f":"IF(AND(AI5<>0,AO5=0),#VALUE!,AI5*AO5)","v":23.939999999999998},null,null,5,null,null,null,null,0.56845599999999996,null,{"$f":"ROUND(AX5*$BE$2,2)+ROUND(AX5*$BE$1,2)","v":1.0000000000000009E-2},null,null,null,null,{"$f":"ROUND((W5*$BF$2)+$BE5-BC5,2)","v":0.01},null,null,{"$f":"AK5*$BM$1","v":0},{"$f":"AL5*$BM$1","v":0},{"$f":"AM5*$BM$1","v":0},{"$f":"AN5*$BM$1","v":0},{"$f":"AO5*$BM$1","v":0.57860699999999987},null,{"$f":"BM5-AY5","v":0},{"$f":"BN5-AZ5","v":0},{"$f":"BO5-BA5","v":0},{"$f":"BP5-BB5","v":0},{"$f":"BQ5-BC5","v":1.015099999999991E-2}]
[null,null,null,null,null,null,null,null,"LED (Dusk to Dawn)","Dusk to Dawn","5W","025L",0,0,0,0,45,0,0,null,0,0,1.02,null,0,0,0,0,{"$f":"IF(AND(Q6<>0,W6=0),#VALUE!,Q6*W6)","v":45.9},null,0,0,0,0,45,null,0,null,0,0,1.04,null,0,{"$f":"IF(AND(AF6<>0,AL6=0),#VALUE!,AF6*AL6)","v":0},0,0,{"$f":"IF(AND(AI6<>0,AO6=0),#VALUE!,AI6*AO6)","v":46.800000000000004},null,null,9,null,null,null,null,1.0252509999999999,null,2.0000000000000004E-2,null,null,null,null,{"$f":"ROUND((W6*$BF$2)+$BE6-BC6,2)","v":0.03},null,null,0,0,0,0,1.055704,null,0,0,0,0,3.0453000000000063E-2]
[null,2,"041",214,0,null,{"$f":"IF(OR(ISBLANK(C7),ISBLANK(D7)),\"\",TEXT(C7,\"000\")&TEXT(D7,\"000\"))","v":"041214"},null,"LED (Dusk to Dawn)","Dusk to Dawn","5W","035L",0,0,0,0,0,1,0,null,0,0,1.46,null,0,0,0,0,0,null,0,0,0,0,0,null,0,null,0,0,1.49,null,0,0,0,0,0,null,null,13,null,null,null,null,1.4820459999999998,null,0.03,null,null,null,null,0.03,null,null,0,0,0,0,1.5124989999999998,null,0,0,0,0,3.0453000000000063E-2]
[null,2,"041",411,1,null,{"$f":"IF(OR(ISBLANK(C8),ISBLANK(D8)),\"\",TEXT(C8,\"000\")&TEXT(D8,\"000\"))","v":"041411"},null,"LED (Dusk to Dawn)","Dusk to Dawn","5W","045L",0,0,0,0,0,1,0,null,0,0,1.81,null,0,0,0,0,0,null,0,0,0,0,0,null,0,null,0,0,1.85,null,0,0,0,0,0,null,null,16,null,null,null,null,1.8271799999999998,null,0.03,null,null,null,null,0.04,null,null,0,0,0,0,1.8779349999999999,null,0,0,0,0,5.0755000000000106E-2]
[null,2,"041",511,0,null,{"$f":"IF(OR(ISBLANK(C9),ISBLANK(D9)),\"\",TEXT(C9,\"000\")&TEXT(D9,\"000\"))","v":"041511"},null,"LED (Dusk to Dawn)","Dusk to Dawn","5W","055L",0,0,0,0,0,1,0,null,0,0,2.25,null,0,0,0,0,0,null,0,0,0,0,0,null,0,null,0,0,2.2999999999999998,null,0,0,0,0,0,null,null,20,null,null,null,null,2.2738239999999998,null,5.0000000000000017E-2,null,null,null,null,0.06,null,null,0,0,0,0,2.3347299999999995,null,0,0,0,0,6.0905999999999683E-2]
[null,2,"041",611,6,null,{"$f":"IF(OR(ISBLANK(C10),ISBLANK(D10)),\"\",TEXT(C10,\"000\")&TEXT(D10,\"000\"))","v":"041611"},null,"LED (Dusk to Dawn)","Dusk to Dawn","5W","065L",0,0,0,0,3,0,0,null,0,0,2.6,null,0,0,0,0,7.8000000000000007,null,0,0,0,0,3,null,0,null,0,0,2.66,null,0,0,0,0,7.98,null,null,23,null,null,null,null,2.6189579999999997,null,4.9999999999999989E-2,null,null,null,null,7.0000000000000007E-2,null,null,0,0,0,0,2.7001659999999998,null,0,0,0,0,8.1208000000000169E-2]
[null,null,null,null,{"$f":"SUM(E7:E10)","v":7},null,null,null,"LED (Dusk to Dawn)","Dusk to Dawn","5W","075L",0,0,0,0,0,1,0,null,0,0,3.04,null,0,0,0,0,0,null,0,0,0,0,0,null,0,null,0,0,3.11,null,0,0,0,0,0,null,null,27,null,null,null,null,3.0757529999999993,null,0.06,null,null,null,null,7.0000000000000007E-2,null,null,0,0,0,0,3.1569609999999995,null,0,0,0,0,8.1208000000000169E-2]
[null,null,null,null,null,null,{"$f":"IF(OR(ISBLANK(C12),ISBLANK(D12)),\"\",TEXT(C12,\"000\")&TEXT(D12,\"000\"))","v":""},null,"LED (Dusk to Dawn)","Dusk to Dawn","5W","085L",0,0,0,0,0,1,0,null,0,0,3.5,null,0,0,0,0,0,null,0,0,0,0,0,null,0,null,0,0,3.58,null,0,0,0,0,0,null,null,31,null,null,null,null,3.5325479999999998,null,7.0000000000000007E-2,null,null,null,null,0.09,null,null,0,0,0,0,3.6340579999999996,null,0,0,0,0,0.10150999999999977]
[null,2,"042",234,81,null,"042234",null,"LED (Dusk to Dawn)","Dusk to Dawn","5W","095L",0,0,0,0,0,1,0,null,0,0,3.84,null,0,0,0,0,0,null,0,0,0,0,0,null,0,null,0,0,3.93,null,0,0,0,0,0,null,null,34,null,null,null,null,3.8776819999999996,null,6.9999999999999951E-2,null,null,null,null,0.09,null,null,0,0,0,0,3.9893429999999999,null,0,0,0,0,0.11166100000000023]
[null,2,"042",421,2,null,"042421",null,"LED (Dusk to Dawn)","Dusk to Dawn","5W","105L",{"$f":"SUMIF($G:$G,TEXT(M$3,\"000\")&TEXT($L14,\"000\"),$E:$E)","v":0},0,0,0,8,0,0,null,0,0,4.28,null,0,0,0,0,34.24,null,{"$f":"SUMIF($G:$G,TEXT(AE$3,\"000\")&TEXT($L14,\"000\"),$E:$E)","v":0},0,0,0,8,null,0,null,0,0,4.38,null,0,0,0,0,35.04,null,null,38,null,null,null,null,4.3344769999999988,null,8.0000000000000016E-2,null,null,null,null,0.09,null,null,0,0,0,0,4.4461379999999995,null,0,0,0,0,0.11166100000000068]
[null,2,"042","421L",1,null,"042421L",null,"LED (Dusk to Dawn)","Dusk to Dawn","5W","115L",0,0,0,0,0,1,0,null,0,0,4.63,null,0,0,0,0,0,null,0,0,0,0,0,null,0,null,0,0,4.74,null,0,0,0,0,0,null,null,41,null,null,null,null,4.6796109999999995,null,8.9999999999999969E-2,null,null,null,null,0.11,null,null,0,0,0,0,4.8115739999999994,null,0,0,0,0,0.13196299999999983]
[null,2,"042",431,529,null,"042431",null,"LED (Dusk to Dawn)","Dusk to Dawn","5W","125L",0,0,0,0,97,0,0,null,0,0,5.07,null,0,0,0,0,491.79,null,0,0,0,0,97,null,0,null,0,0,5.19,null,0,0,0,0,503.43000000000006,null,null,45,null,null,null,null,5.1262549999999996,null,9.9999999999999978E-2,null,null,null,null,0.12,null,null,0,0,0,0,5.2683689999999999,null,0,0,0,0,0.1421140000000003]
[null,2,"042","431L",5337,null,"042431L",null,"LED (Dusk to Dawn)","Dusk to Dawn","5W","135L",0,0,0,0,36,0,0,null,0,0,5.54,null,0,0,0,0,199.44,null,0,0,0,0,36,null,0,null,0,0,5.67,null,0,0,0,0,204.12,null,null,49,null,null,null,null,5.5932009999999988,null,0.1100000000000001,null,null,null,null,0.14000000000000001,null,null,0,0,0,0,5.7556169999999991,null,0,0,0,0,0.16241600000000034]
[null,2,"042","431T",{"$f":"1840+2","v":1842},null,"042431T",null,"LED (Dusk to Dawn)","Dusk to Dawn","5W","145L",0,0,0,0,0,1,0,null,0,0,5.87,null,0,0,0,0,0,null,0,0,0,0,0,null,0,null,0,0,6.01,null,0,0,0,0,0,null,null,52,null,null,null,null,5.928183999999999,null,0.10999999999999999,null,null,null,null,0.14000000000000001,null,null,0,0,0,0,6.1007509999999989,null,0,0,0,0,0.17256699999999991]
[null,2,"042",432,63,null,"042432",null,"LED (Dusk to Dawn)","Dusk to Dawn","5W","155L",0,0,0,0,0,1,0,null,0,0,6.33,null,0,0,0,0,0,null,0,0,0,0,0,null,0,null,0,0,6.48,null,0,0,0,0,0,null,null,56,null,null,null,null,6.3849789999999995,null,0.12,null,null,null,null,0.16,null,null,0,0,0,0,6.5778479999999995,null,0,0,0,0,0.19286899999999996]
[null,2,"042","432L",134,null,"042432L",null,"LED (Dusk to Dawn)","Dusk to Dawn","5W","165L",0,0,0,0,0,1,0,null,0,0,6.66,null,0,0,0,0,0,null,0,0,0,0,0,null,0,null,0,0,6.82,null,0,0,0,0,0,null,null,59,null,null,null,null,6.7199619999999998,null,0.13,null,null,null,null,0.17,null,null,0,0,0,0,6.9229819999999993,null,0,0,0,0,0.20301999999999953]
[null,2,"042","432T",29,null,"042432T",null,"LED (Dusk to Dawn)","Dusk to Dawn","5W","175L",0,0,0,0,0,1,0,null,0,0,7.11,null,0,0,0,0,0,null,0,0,0,0,0,null,0,null,0,0,7.28,null,0,0,0,0,0,null,null,63,null,null,null,null,7.186907999999999,null,0.14000000000000001,null,null,null,null,0.17,null,null,0,0,0,0,7.3899279999999994,null,0,0,0,0,0.20302000000000042]
[null,2,"042",433,6,null,"042433",null,"LED (Dusk to Dawn)","Dusk to Dawn","5W","185L",0,0,0,0,0,1,0,null,0,0,7.56,null,0,0,0,0,0,null,0,0,0,0,0,null,0,null,0,0,7.74,null,0,0,0,0,0,null,null,67,null,null,null,null,7.633551999999999,null,0.14000000000000001,null,null,null,null,0.18,null,null,0,0,0,0,7.8568739999999995,null,0,0,0,0,0.22332200000000046]
[null,2,"042","433L",69,null,"042433L",null,"LED (Dusk to Dawn)","Dusk to Dawn","5W","195L",0,0,0,0,0,1,0,null,0,0,7.9,null,0,0,0,0,0,null,0,0,0,0,0,null,0,null,0,0,8.09,null,0,0,0,0,0,null,null,70,null,null,null,null,7.9786859999999997,null,0.16000000000000003,null,null,null,null,0.2,null,null,0,0,0,0,8.2121589999999998,null,0,0,0,0,0.23347300000000004]
[null,2,"042","433T",67,null,"042433T",null,"LED (Dusk to Dawn)","Dusk to Dawn","5W","212L",{"$f":"SUMIF($G:$G,TEXT(M$3,\"000\")&TEXT($L24,\"000\"),$E:$E)","v":0},0,0,0,8,0,0,null,0,0,8.69,null,0,0,0,0,69.52,null,0,0,0,0,8,null,0,null,0,0,8.9,null,0,0,0,0,71.2,null,null,77,null,null,null,null,8.7806149999999992,null,0.17000000000000004,null,null,null,null,0.21,null,null,0,0,0,0,9.0343900000000001,null,0,0,0,0,0.25377500000000097]
[null,2,"042",434,1634,null,"042434",null,"LED (Dusk to Dawn)","Dusk to Dawn","5W","237L",0,0,0,0,60,0,0,null,0,0,9.7100000000000009,null,0,0,0,0,{"$f":"IF(AND(Q25<>0,W25=0),#VALUE!,Q25*W25)","v":582.6},null,0,0,0,0,60,null,0,null,0,0,{"$f":"ROUND(W25*(1+AO$1),2)","v":9.94},null,0,0,0,0,{"$f":"IF(AND(AI25<>0,AO25=0),#VALUE!,AI25*AO25)","v":596.4},null,null,86,null,null,null,null,9.805866,null,0.18999999999999995,null,null,null,null,0.24,null,null,0,0,0,0,10.090093999999999,null,0,0,0,0,0.28422799999999881]
[null,2,"042","434L",1792,null,"042434L",null,"Single High-Pressure Sodium Vapor","Direct Burial","50W",234,0,81,0,0,0,{"$f":"IF(SUM(M26:Q26)>0,0,1)","v":0},0,14.68,0,0,0,null,{"$f":"IF(AND(M26<>0,S26=0),#VALUE!,M26*S26)","v":0},{"$f":"IF(AND(N26<>0,T26=0),#VALUE!,N26*T26)","v":1189.08},{"$f":"IF(AND(O26<>0,U26=0),#VALUE!,O26*U26)","v":0},{"$f":"IF(AND(P26<>0,V26=0),#VALUE!,P26*V26)","v":0},{"$f":"IF(AND(Q26<>0,W26=0),#VALUE!,Q26*W26)","v":0},null,{"$f":"M26","v":0},{"$f":"N26","v":81},0,0,0,null,0,{"$f":"ROUND(T26*(1+AL$1),2)","v":15.01},0,0,{"$f":"ROUND(W26*(1+AO$1),2)","v":0},null,0,1215.81,0,0,0,{"$f":"SUM(AR26)-SUM(Z26)","v":26.730000000000018},{"$f":"AV26/Z26","v":2.2479564032697564E-2},20,null,14.93,null,null,null,null,{"$f":"ROUND(AX26*$BE$2,2)+ROUND(AX26*$BE$1,2)","v":5.0000000000000017E-2},null,{"$f":"ROUND((T26*$BF$2)+$BE26-AZ26,2)","v":0.02},null,null,null,null,null,{"$f":"AK26*$BM$1","v":0},{"$f":"AL26*$BM$1","v":15.236650999999998},{"$f":"AM26*$BM$1","v":0},0,0,null,{"$f":"BM26-AY26","v":0},{"$f":"BN26-AZ26","v":0.30665099999999867},{"$f":"BO26-BA26","v":0},{"$f":"BP26-BB26","v":0},{"$f":"BQ26-BC26","v":0}]
[null,2,"042",435,233,null,"042435",null,"High-Pressure Sodium Vapor","Dusk to Dawn","70W",335,0,0,0,0,8,0,0,0,0,0,3.8,null,0,0,0,0,30.4,null,0,0,0,0,8,null,0,0,0,0,3.89,null,0,0,0,0,31.12,0,{"$f":"AV27/Z27","v":{"$error":"#DIV/0!"}},25,null,null,null,null,3.84,null,0.06,null,null,null,null,{"$f":"ROUND((W27*$BF$2)+$BE27-BC27,2)","v":0.08},null,null,0,0,0,0,3.9487389999999998,null,0,0,0,0,0.10873899999999992]
[null,2,"042","435L",{"$f":"2602+3","v":2605},null,"042435L",null,"Single Mercury Vapor","Wood Pole",7000,411,1,0,0,0,0,0,17.07,0,0,0,0,null,17.07,0,0,0,0,null,1,0,0,0,0,null,17.48,0,0,0,0,null,17.48,0,0,0,0,0,{"$f":"AV28/Z28","v":{"$error":"#DIV/0!"}},80,17.25,null,null,null,null,null,0.18000000000000016,{"$f":"ROUND((S28*$BF$2)+$BE28-AY28,2)","v":0.26},null,null,null,null,null,null,17.743948,0,0,0,0,null,0.49394799999999961,0,0,0,0]
[null,2,"042","435T",{"$f":"1854+6","v":1860},null,"042435T",null,"Mercury Vapor","Dusk to Dawn",7000,415,0,0,0,61,0,0,0,0,0,7.49,0,null,0,0,0,456.89,0,null,0,0,0,61,0,null,0,0,0,7.67,0,null,0,0,0,467.87,0,0,{"$error":"#DIV/0!"},80,null,null,null,7.56,null,null,0.18000000000000016,null,null,null,{"$f":"ROUND((V29*$BF$2)+$BE29-BB29,2)","v":0.22},null,null,null,0,0,0,7.7858169999999989,0,null,0,0,0,0.22581699999999927,0]
[null,2,"042",436,20,null,"042436",null,"Mercury Vapor","Dusk to 1 AM",7000,419,0,0,0,16,0,0,0,0,0,5.07,0,null,0,0,0,81.12,0,null,{"$f":"M30","v":0},0,0,16,0,null,0,0,0,5.19,0,null,0,0,0,83.04,0,0,{"$error":"#DIV/0!"},80,null,null,null,5.13,null,null,0.18000000000000016,null,null,null,{"$f":"ROUND((V30*$BF$2)+$BE30-BB30,2)","v":0.2},null,null,null,0,0,{"$f":"AM30*$BM$1","v":0},{"$f":"AN30*$BM$1","v":5.2683689999999999},{"$f":"AO30*$BM$1","v":0},null,0,0,0,0.13836899999999996,0]
[null,2,"042","436L",84,null,"042436L",null,"Single High-Pressure Sodium Vapor","Standard","100W",421,0,2,0,0,0,0,0,25.85,0,0,0,null,0,{"$f":"IF(AND(N31<>0,T31=0),#VALUE!,N31*T31)","v":51.7},0,0,0,null,0,2,0,0,0,null,0,{"$f":"ROUND(T31*(1+AL$1),2)","v":26.43},0,0,0,null,0,52.86,0,0,0,1.1599999999999966,2.2437137330754284E-2,40,null,26.291089999999997,null,null,null,null,9.000000000000008E-2,null,{"$f":"ROUND((T31*$BF$2)+$BE31-AZ31,2)","v":0.04},null,null,null,null,null,0,26.829092999999997,0,0,0,null,0,0.53800299999999979,0,0,0]
[null,2,"042","436T",274,null,"042436T",null,"Single Light Emitting Diode (LED)","Standard","70W","421L",0,1,0,0,0,0,0,{"$f":"T31","v":25.85},null,null,null,null,{"$f":"IF(AND(M32<>0,S32=0),#VALUE!,M32*S32)","v":0},{"$f":"IF(AND(N32<>0,T32=0),#VALUE!,N32*T32)","v":25.85},{"$f":"IF(AND(O32<>0,U32=0),#VALUE!,O32*U32)","v":0},{"$f":"IF(AND(P32<>0,V32=0),#VALUE!,P32*V32)","v":0},{"$f":"IF(AND(Q32<>0,W32=0),#VALUE!,Q32*W32)","v":0},null,{"$f":"SUMIF($G:$G,TEXT(AE$3,\"000\")&TEXT($L32,\"000\"),$E:$E)","v":0},{"$f":"SUMIF($G:$G,TEXT(AF$3,\"000\")&TEXT($L32,\"000\"),$E:$E)","v":1},{"$f":"SUMIF($G:$G,TEXT(AG$3,\"000\")&TEXT($L32,\"000\"),$E:$E)","v":0},{"$f":"SUMIF($G:$G,TEXT(AH$3,\"000\")&TEXT($L32,\"000\"),$E:$E)","v":0},{"$f":"SUMIF($G:$G,TEXT(AI$3,\"000\")&TEXT($L32,\"000\"),$E:$E)","v":0},null,{"$f":"ROUND(S32*(1+AK$1),2)","v":0},{"$f":"AL31","v":26.43},0,0,0,null,0,26.43,0,0,0,0.57999999999999829,2.2437137330754284E-2,26,null,26.291089999999997,null,null,null,null,{"$f":"ROUND(AX32*$BE$2,2)+ROUND(AX32*$BE$1,2)","v":0.06},null,0.01,null,null,null,null,null,0,26.829092999999997,{"$f":"AM32*$BM$1","v":0},{"$f":"AN32*$BM$1","v":0},{"$f":"AO32*$BM$1","v":0},null,{"$f":"BM32-AY32","v":0},{"$f":"BN32-AZ32","v":0.53800299999999979},{"$f":"BO32-BA32","v":0},{"$f":"BP32-BB32","v":0},{"$f":"BQ32-BC32","v":0}]
[null,2,"042",438,11,null,"042438",null,"Single High-Pressure Sodium Vapor","Standard","100W",431,0,529,1,0,0,0,0,14.9,8.0500000000000007,0,0,null,0,{"$f":"IF(AND(N33<>0,T33=0),#VALUE!,N33*T33)","v":7882.1},8.0500000000000007,0,0,null,0,{"$f":"N33","v":529},1,0,0,null,0,15.24,8.24,0,0,null,0,{"$f":"IF(AND(AF33<>0,AL33=0),#VALUE!,AF33*AL33)","v":8061.96},8.24,0,0,179.85999999999967,2.2818791946308682E-2,40,null,null,8.1309509999999996,null,null,null,9.000000000000008E-2,null,15.21,{"$f":"ROUND((U33*$BF$2)+$BE33-BA33,2)","v":0.13},null,null,null,null,0,15.470123999999998,8.3644239999999996,0,0,null,0,15.470123999999998,0.23347300000000004,0,0]
[null,2,"042","441L",14,null,"042441L",null,"Single Light Emitting Diode (LED)","Standard","70W","431L",{"$f":"SUMIF($G:$G,TEXT(M$3,\"000\")&TEXT($L34,\"000\"),$E:$E)","v":0},5337,0,0,0,{"$f":"IF(SUM(M34:Q34)>0,0,1)","v":0},0,{"$f":"T33","v":14.9},0,0,0,null,0,{"$f":"IF(AND(N34<>0,T34=0),#VALUE!,N34*T34)","v":79521.3},0,0,0,null,{"$f":"SUMIF($G:$G,TEXT(AE$3,\"000\")&TEXT($L34,\"000\"),$E:$E)","v":0},{"$f":"SUMIF($G:$G,TEXT(AF$3,\"000\")&TEXT($L34,\"000\"),$E:$E)","v":5337},{"$f":"SUMIF($G:$G,TEXT(AG$3,\"000\")&TEXT($L34,\"000\"),$E:$E)","v":0},{"$f":"SUMIF($G:$G,TEXT(AH$3,\"000\")&TEXT($L34,\"000\"),$E:$E)","v":0},{"$f":"SUMIF($G:$G,TEXT(AI$3,\"000\")&TEXT($L34,\"000\"),$E:$E)","v":0},null,0,{"$f":"AL33","v":15.24},0,0,0,null,0,{"$f":"IF(AND(AF34<>0,AL34=0),#VALUE!,AF34*AL34)","v":81335.88},0,0,0,null,null,26,null,null,null,null,null,null,0.06,null,15.18,null,null,null,null,null,0,15.470123999999998,0,{"$f":"AN34*$BM$1","v":0},{"$f":"AO34*$BM$1","v":0},null,0,{"$f":"BN34-AZ34","v":15.470123999999998},{"$f":"BO34-BA34","v":0},{"$f":"BP34-BB34","v":0},{"$f":"BQ34-BC34","v":0}]
[null,2,"042","441T",11,null,"042441T",null,"Single Light Emitting Diode (LED)","Standard","70W","431T",0,1842,0,0,0,0,0,{"$f":"T33-T103","v":9.98},0,0,0,null,0,18383.16,0,0,0,null,{"$f":"M35","v":0},{"$f":"N35","v":1842},{"$f":"O35","v":0},{"$f":"P35","v":0},{"$f":"Q35","v":0},null,0,{"$f":"AL33-AL103","v":10.32},0,0,0,null,0,19009.440000000002,0,0,0,{"$f":"SUM(AQ35:AU35)-SUM(Y35:AC35)","v":626.28000000000247},null,26,null,null,null,null,null,null,0.06,null,10.19,null,null,null,null,null,0,10.475831999999999,0,0,0,null,0,10.475831999999999,0,0,0]
[null,2,"042",474,116,null,"042474",null,"Single High-Pressure Sodium Vapor","Pedestal Base","100W",432,0,63,4,0,0,0,0,27.84,8.0500000000000007,0,0,null,0,1753.92,32.200000000000003,0,0,null,0,63,4,0,0,null,0,{"$f":"ROUND(T36*(1+AL$1),2)","v":28.47},8.24,0,0,null,0,1793.61,32.96,0,0,39.689999999999827,2.2629310344827486E-2,40,null,28.331440999999998,8.1309509999999996,null,null,null,9.000000000000008E-2,null,0.02,{"$f":"ROUND((U36*$BF$2)+$BE36-BA36,2)","v":0.13},null,null,null,null,0,28.899896999999996,8.3644239999999996,0,0,null,0,0.56845599999999763,0.23347300000000004,0,0]
[null,2,"042","474L",{"$f":"229+6","v":235},null,"042474L",null,"Single Light Emitting Diode (LED)","Pedestal Base","70W","432L",0,134,0,0,0,0,0,{"$f":"T36","v":27.84},0,0,0,null,{"$f":"IF(AND(M37<>0,S37=0),#VALUE!,M37*S37)","v":0},3730.56,0,0,0,null,{"$f":"SUMIF($G:$G,TEXT(AE$3,\"000\")&TEXT($L37,\"000\"),$E:$E)","v":0},{"$f":"SUMIF($G:$G,TEXT(AF$3,\"000\")&TEXT($L37,\"000\"),$E:$E)","v":134},{"$f":"SUMIF($G:$G,TEXT(AG$3,\"000\")&TEXT($L37,\"000\"),$E:$E)","v":0},{"$f":"SUMIF($G:$G,TEXT(AH$3,\"000\")&TEXT($L37,\"000\"),$E:$E)","v":0},{"$f":"SUMIF($G:$G,TEXT(AI$3,\"000\")&TEXT($L37,\"000\"),$E:$E)","v":0},null,0,{"$f":"AL36","v":28.47},0,0,0,null,0,3814.98,0,0,0,84.420000000000073,2.2629310344827607E-2,26,null,28.331440999999998,null,null,null,null,{"$f":"ROUND(AX37*$BE$2,2)+ROUND(AX37*$BE$1,2)","v":0.06},null,-0.01,null,null,null,null,null,0,28.899896999999996,{"$f":"AM37*$BM$1","v":0},0,0,null,{"$f":"BM37-AY37","v":0},0.56845599999999763,0,0,0]
[null,2,"042",475,0,null,"042475",null,"Single Light Emitting Diode (LED)","Pedestal Base","70W","432T",0,29,0,0,0,0,0,{"$f":"T36-T103","v":22.92},0,0,0,null,0,{"$f":"IF(AND(N38<>0,T38=0),#VALUE!,N38*T38)","v":664.68000000000006},0,0,0,null,{"$f":"M38","v":0},{"$f":"N38","v":29},{"$f":"O38","v":0},{"$f":"P38","v":0},{"$f":"Q38","v":0},null,0,{"$f":"AL37-AL103","v":23.549999999999997},0,0,0,null,0,682.94999999999993,0,0,0,18.269999999999868,2.7486910994764198E-2,26,null,23.022467999999996,null,null,null,null,{"$f":"ROUND(AX38*$BE$2,2)+ROUND(AX38*$BE$1,2)","v":0.06},null,0.3,null,null,null,null,null,0,23.905604999999994,0,0,0,null,0,0.88313699999999784,0,0,0]
[null,3,"042",478,0,null,"042478",null,"Single High-Pressure Sodium Vapor","Direct Burial","100W",433,0,6,10,0,0,0,0,27.84,8.0500000000000007,0,0,null,0,167.04,80.5,0,0,null,0,{"$f":"N39","v":6},{"$f":"O39","v":10},{"$f":"P39","v":0},{"$f":"Q39","v":0},null,0,{"$f":"ROUND(T39*(1+AL$1),2)","v":28.47},8.24,0,0,null,0,170.82,82.4,0,0,3.7800000000000011,2.2629310344827593E-2,40,null,28.331440999999998,8.1309509999999996,null,null,null,9.000000000000008E-2,null,0.02,{"$f":"ROUND((U39*$BF$2)+$BE39-BA39,2)","v":0.13},null,null,null,null,0,28.899896999999996,8.3644239999999996,0,0,null,0,0.56845599999999763,0.23347300000000004,0,0]
[null,2,"042",484,68,null,"042484",null,"Single Light Emitting Diode (LED)","Direct Burial","70W","433L",0,69,0,0,0,0,0,{"$f":"T39","v":27.84},0,0,0,null,{"$f":"IF(AND(M40<>0,S40=0),#VALUE!,M40*S40)","v":0},1920.96,0,0,0,null,{"$f":"SUMIF($G:$G,TEXT(AE$3,\"000\")&TEXT($L40,\"000\"),$E:$E)","v":0},{"$f":"SUMIF($G:$G,TEXT(AF$3,\"000\")&TEXT($L40,\"000\"),$E:$E)","v":69},{"$f":"SUMIF($G:$G,TEXT(AG$3,\"000\")&TEXT($L40,\"000\"),$E:$E)","v":0},{"$f":"SUMIF($G:$G,TEXT(AH$3,\"000\")&TEXT($L40,\"000\"),$E:$E)","v":0},{"$f":"SUMIF($G:$G,TEXT(AI$3,\"000\")&TEXT($L40,\"000\"),$E:$E)","v":0},null,0,{"$f":"AL39","v":28.47},0,0,0,null,0,1964.4299999999998,0,0,0,43.4699999999998,2.2629310344827482E-2,26,null,28.331440999999998,null,null,null,null,{"$f":"ROUND(AX40*$BE$2,2)+ROUND(AX40*$BE$1,2)","v":0.06},null,-0.01,null,null,null,null,null,0,28.899896999999996,{"$f":"AM40*$BM$1","v":0},0,0,null,{"$f":"BM40-AY40","v":0},0.56845599999999763,0,0,0]
[null,2,"042","484L",99,null,"042484L",null,"Single Light Emitting Diode (LED)","Direct Burial","70W","433T",0,67,0,0,0,0,0,{"$f":"T39-T103","v":22.92},0,0,0,null,0,1535.64,0,0,0,null,{"$f":"M41","v":0},{"$f":"N41","v":67},{"$f":"O41","v":0},{"$f":"P41","v":0},{"$f":"Q41","v":0},null,0,{"$f":"AL40-AL103","v":23.549999999999997},0,0,0,null,0,{"$f":"IF(AND(AF41<>0,AL41=0),#VALUE!,AF41*AL41)","v":1577.85},0,0,0,{"$f":"SUM(AR41)-SUM(Z41)","v":42.209999999999809},2.7486910994764271E-2,26,null,23.022467999999996,null,null,null,null,{"$f":"ROUND(AX41*$BE$2,2)+ROUND(AX41*$BE$1,2)","v":0.06},null,0.3,null,null,null,null,null,0,23.905604999999994,0,0,0,null,0,0.88313699999999784,0,0,0]
[null,2,"042","494L",12,null,{"$f":"IF(OR(ISBLANK(C42),ISBLANK(D42)),\"\",TEXT(C42,\"000\")&TEXT(D42,\"000\"))","v":"042494L"},null,"Single High-Pressure Sodium Vapor","Direct Burial","100W",434,0,1634,0,0,0,0,0,15.7,0,0,0,null,0,25653.8,0,0,0,null,0,{"$f":"N42","v":1634},{"$f":"O42","v":0},{"$f":"P42","v":0},{"$f":"Q42","v":0},null,0,{"$f":"ROUND(T42*(1+AL$1),2)","v":16.05},0,0,0,null,0,26225.7,0,0,0,571.90000000000146,2.2292993630573306E-2,40,null,15.977673999999999,null,null,null,null,9.000000000000008E-2,null,0.05,null,null,null,null,null,0,16.292355000000001,0,0,0,null,0,0.31468100000000199,0,0,0]
[null,2,"042",531,163,null,{"$f":"IF(OR(ISBLANK(C43),ISBLANK(D43)),\"\",TEXT(C43,\"000\")&TEXT(D43,\"000\"))","v":"042531"},null,"Single Light Emitting Diode (LED)","Direct Burial","70W","434L",0,1792,0,0,0,0,0,{"$f":"T42","v":15.7},0,0,0,null,{"$f":"IF(AND(M43<>0,S43=0),#VALUE!,M43*S43)","v":0},{"$f":"IF(AND(N43<>0,T43=0),#VALUE!,N43*T43)","v":28134.399999999998},{"$f":"IF(AND(O43<>0,U43=0),#VALUE!,O43*U43)","v":0},{"$f":"IF(AND(P43<>0,V43=0),#VALUE!,P43*V43)","v":0},{"$f":"IF(AND(Q43<>0,W43=0),#VALUE!,Q43*W43)","v":0},null,{"$f":"SUMIF($G:$G,TEXT(AE$3,\"000\")&TEXT($L43,\"000\"),$E:$E)","v":0},{"$f":"SUMIF($G:$G,TEXT(AF$3,\"000\")&TEXT($L43,\"000\"),$E:$E)","v":1792},{"$f":"SUMIF($G:$G,TEXT(AG$3,\"000\")&TEXT($L43,\"000\"),$E:$E)","v":0},{"$f":"SUMIF($G:$G,TEXT(AH$3,\"000\")&TEXT($L43,\"000\"),$E:$E)","v":0},{"$f":"SUMIF($G:$G,TEXT(AI$3,\"000\")&TEXT($L43,\"000\"),$E:$E)","v":0},null,0,{"$f":"AL42","v":16.05},0,0,0,null,0,28761.600000000002,0,0,0,627.20000000000437,2.2292993630573407E-2,26,null,15.977673999999999,null,null,null,null,{"$f":"ROUND(AX43*$BE$2,2)+ROUND(AX43*$BE$1,2)","v":0.06},null,0.02,null,null,null,null,null,0,16.292355000000001,{"$f":"AM43*$BM$1","v":0},{"$f":"AN43*$BM$1","v":0},{"$f":"AO43*$BM$1","v":0},null,{"$f":"BM43-AY43","v":0},{"$f":"BN43-AZ43","v":0.31468100000000199},{"$f":"BO43-BA43","v":0},{"$f":"BP43-BB43","v":0},{"$f":"BQ43-BC43","v":0}]
[null,2,"042","531L",1349,null,"042531L",null,"Single High-Pressure Sodium Vapor","Standard / Dusk to Dawn (046)","100W",435,{"$f":"SUMIF($G:$G,TEXT(M$3,\"000\")&TEXT($L44,\"000\"),$E:$E)","v":0},233,13,0,17,0,0,14.9,8.0500000000000007,0,5.38,null,0,3471.7000000000003,104.65,0,91.46,null,0,{"$f":"N44","v":233},{"$f":"O44","v":13},{"$f":"P44","v":0},{"$f":"Q44","v":17},null,0,15.24,8.24,0,5.51,null,0,3550.92,107.12,0,93.67,79.2199999999998,{"$f":"AV44/Z44","v":2.2818791946308665E-2},40,null,15.165593999999999,8.1300000000000008,null,5.43,null,9.000000000000008E-2,null,0.05,{"$f":"ROUND((U44*$BF$2)+$BE44-BA44,2)","v":0.13},null,{"$f":"ROUND((W44*$BF$2)+$BE44-BC44,2)","v":0.12},null,null,0,15.470123999999998,8.3644239999999996,0,5.5932009999999988,null,0,0.30452999999999975,0.23442399999999886,0,0.16320099999999904]
[null,2,"042","531T",{"$f":"473+1","v":474},null,"042531T",null,"Single Light Emitting Diode (LED)","Standard / Dusk to Dawn (046)","70W","435L",0,2605,0,0,0,0,0,{"$f":"T44","v":14.9},0,0,0,null,{"$f":"IF(AND(M45<>0,S45=0),#VALUE!,M45*S45)","v":0},38814.5,0,0,0,null,{"$f":"SUMIF($G:$G,TEXT(AE$3,\"000\")&TEXT($L45,\"000\"),$E:$E)","v":0},{"$f":"SUMIF($G:$G,TEXT(AF$3,\"000\")&TEXT($L45,\"000\"),$E:$E)","v":2605},{"$f":"SUMIF($G:$G,TEXT(AG$3,\"000\")&TEXT($L45,\"000\"),$E:$E)","v":0},{"$f":"SUMIF($G:$G,TEXT(AH$3,\"000\")&TEXT($L45,\"000\"),$E:$E)","v":0},{"$f":"SUMIF($G:$G,TEXT(AI$3,\"000\")&TEXT($L45,\"000\"),$E:$E)","v":0},null,0,{"$f":"AL44","v":15.24},0,0,0,null,0,39700.199999999997,0,0,0,885.69999999999709,2.2818791946308651E-2,26,null,15.165593999999999,null,null,null,null,{"$f":"ROUND(AX45*$BE$2,2)+ROUND(AX45*$BE$1,2)","v":0.06},null,0.02,null,null,null,null,null,0,15.470123999999998,{"$f":"AM45*$BM$1","v":0},0,0,null,{"$f":"BM45-AY45","v":0},0.30452999999999975,0,0,0]
[null,2,"042",532,106,null,"042532",null,"Single Light Emitting Diode (LED)","Standard / Dusk to Dawn (046)","70W","435T",0,1860,0,0,0,0,0,{"$f":"T44-T103","v":9.98},0,0,0,null,0,18562.8,0,0,0,null,{"$f":"M46","v":0},{"$f":"N46","v":1860},{"$f":"O46","v":0},{"$f":"P46","v":0},{"$f":"Q46","v":0},null,0,{"$f":"AL45-AL103","v":10.32},0,0,0,null,0,19195.2,0,0,0,632.40000000000146,3.4068136272545173E-2,26,null,9.8566209999999987,null,null,null,null,{"$f":"ROUND(AX46*$BE$2,2)+ROUND(AX46*$BE$1,2)","v":0.06},null,0.33,null,null,null,null,null,0,10.475831999999999,0,0,0,null,0,0.61921099999999996,0,0,0]
[null,2,"042","532L",705,null,"042532L",null,"Single High-Pressure Sodium Vapor","Developer Contributed","100W",436,0,20,0,0,0,0,0,16.899999999999999,0,0,0,null,0,338,0,0,0,null,0,{"$f":"N47","v":20},{"$f":"O47","v":0},{"$f":"P47","v":0},{"$f":"Q47","v":0},null,0,17.28,0,0,0,null,0,345.6,0,0,0,7.6000000000000227,2.2485207100591782E-2,40,null,17.195793999999999,null,null,null,null,9.000000000000008E-2,null,0.05,null,null,null,null,null,0,17.540928000000001,0,0,0,null,0,0.34513400000000161,0,0,0]
[null,2,"042","532T",152,null,"042532T",null,"Single Light Emitting Diode (LED)","Developer Contributed","70W","436L",0,84,0,0,0,0,0,{"$f":"T47","v":16.899999999999999},0,0,0,null,{"$f":"IF(AND(M48<>0,S48=0),#VALUE!,M48*S48)","v":0},1419.6,0,0,0,null,{"$f":"SUMIF($G:$G,TEXT(AE$3,\"000\")&TEXT($L48,\"000\"),$E:$E)","v":0},{"$f":"SUMIF($G:$G,TEXT(AF$3,\"000\")&TEXT($L48,\"000\"),$E:$E)","v":84},{"$f":"SUMIF($G:$G,TEXT(AG$3,\"000\")&TEXT($L48,\"000\"),$E:$E)","v":0},{"$f":"SUMIF($G:$G,TEXT(AH$3,\"000\")&TEXT($L48,\"000\"),$E:$E)","v":0},{"$f":"SUMIF($G:$G,TEXT(AI$3,\"000\")&TEXT($L48,\"000\"),$E:$E)","v":0},null,0,{"$f":"AL47","v":17.28},0,0,0,null,0,1451.52,0,0,0,31.920000000000073,2.2485207100591768E-2,26,null,17.195793999999999,null,null,null,null,{"$f":"ROUND(AX48*$BE$2,2)+ROUND(AX48*$BE$1,2)","v":0.06},null,0.02,null,null,null,null,null,0,17.540928000000001,{"$f":"AM48*$BM$1","v":0},0,0,null,{"$f":"BM48-AY48","v":0},0.34513400000000161,0,0,0]
[null,2,"042",533,18,null,"042533",null,"Single Light Emitting Diode (LED)","Developer Contributed","70W","436T",0,274,0,0,0,0,0,{"$f":"T47-T103","v":11.979999999999999},0,0,0,null,0,3282.5199999999995,0,0,0,null,{"$f":"M49","v":0},{"$f":"N49","v":274},{"$f":"O49","v":0},{"$f":"P49","v":0},{"$f":"Q49","v":0},null,0,{"$f":"AL48-AL103","v":12.360000000000001},0,0,0,null,0,3386.6400000000003,0,0,0,104.1200000000008,3.1719532554257343E-2,26,null,11.886820999999999,null,null,null,null,{"$f":"ROUND(AX49*$BE$2,2)+ROUND(AX49*$BE$1,2)","v":0.06},null,0.33,null,null,null,null,null,0,12.546635999999999,0,0,0,null,0,0.65981500000000004,0,0,0]
[null,2,"042","533L",55,null,"042533L",null,"Decorative Sodium Vapor","No Pole","Kim Light 100W",438,0,11,0,0,0,{"$f":"IF(SUM(M50:Q50)>0,0,1)","v":0},0,15.7,0,0,0,null,0,172.7,0,0,0,null,0,{"$f":"N50","v":11},0,0,0,null,0,{"$f":"ROUND(T50*(1+AL$1),2)","v":16.05},0,0,0,null,0,176.55,0,0,0,3.8500000000000227,2.2292993630573382E-2,40,null,15.977673999999999,null,null,null,null,9.000000000000008E-2,null,0.05,null,null,null,null,null,0,16.292355000000001,0,0,0,null,0,0.31468100000000199,0,0,0]
[null,2,"042","533T",{"$f":"46+1","v":47},null,"042533T",null,"Double Light Emitting Diode (LED)","Standard","70W","441L",0,14,0,0,0,0,0,28.59,0,null,0,null,{"$f":"IF(AND(M51<>0,S51=0),#VALUE!,M51*S51)","v":0},400.26,0,0,0,null,{"$f":"SUMIF($G:$G,TEXT(AE$3,\"000\")&TEXT($L51,\"000\"),$E:$E)","v":0},14,0,0,0,null,0,29.23,0,0,0,null,0,{"$f":"IF(AND(AF51<>0,AL51=0),#VALUE!,AF51*AL51)","v":409.22},0,0,0,8.9600000000000364,2.2385449457852487E-2,52,null,29.092765999999997,null,null,null,null,{"$f":"ROUND(AX51*$BE$2,2)+ROUND(AX51*$BE$1,2)","v":0.10999999999999999},null,0.04,null,null,null,null,null,0,29.671372999999996,{"$f":"AM51*$BM$1","v":0},0,0,null,{"$f":"BM51-AY51","v":0},0.5786069999999981,0,0,0]
[null,2,"042",535,93,null,"042535",null,"Double Light Emitting Diode (LED)","Standard","70W","441T",0,11,0,0,0,0,null,{"$f":"T51-T103-T103","v":18.75},0,0,0,null,0,206.25,0,0,0,null,0,11,0,0,0,null,0,{"$f":"AL51-AL103-AL103","v":19.39},0,0,0,null,0,213.29000000000002,0,0,0,7.0400000000000205,3.4133333333333432E-2,52,null,18.474819999999998,null,null,null,null,{"$f":"ROUND(AX52*$BE$2,2)+ROUND(AX52*$BE$1,2)","v":0.10999999999999999},null,0.67,null,null,null,null,null,0,19.682789,0,0,0,null,0,1.2079690000000021,0,0,0]
[null,2,"042","535L",831,null,"042535L",null,"Decorative Sodium Vapor","Direct Burial","Granville 100W",474,0,116,0,0,0,0,0,27.36,0,0,0,null,0,3173.7599999999998,0,0,0,null,0,{"$f":"N53","v":116},{"$f":"O53","v":0},{"$f":"P53","v":0},{"$f":"Q53","v":0},null,0,27.98,0,0,0,null,{"$f":"IF(AND(AE53<>0,AK53=0),#VALUE!,AE53*AK53)","v":0},{"$f":"IF(AND(AF53<>0,AL53=0),#VALUE!,AF53*AL53)","v":3245.68},{"$f":"IF(AND(AG53<>0,AM53=0),#VALUE!,AG53*AM53)","v":0},0,0,71.920000000000073,2.2660818713450315E-2,40,null,27.834042,null,null,null,null,9.000000000000008E-2,null,0.03,null,null,null,null,null,0,28.402497999999998,0,0,0,null,0,0.56845599999999763,0,0,0]
[null,2,"042","535T",{"$f":"394+2","v":396},null,"042535T",null,"Decorative Light Emitting Diode (LED)","Direct Burial","Granville 70W","474L",{"$f":"SUMIF($G:$G,TEXT(M$3,\"000\")&TEXT($L54,\"000\"),$E:$E)","v":0},235,0,0,0,0,0,{"$f":"T53","v":27.36},0,0,0,null,{"$f":"IF(AND(M54<>0,S54=0),#VALUE!,M54*S54)","v":0},{"$f":"IF(AND(N54<>0,T54=0),#VALUE!,N54*T54)","v":6429.5999999999995},{"$f":"IF(AND(O54<>0,U54=0),#VALUE!,O54*U54)","v":0},{"$f":"IF(AND(P54<>0,V54=0),#VALUE!,P54*V54)","v":0},{"$f":"IF(AND(Q54<>0,W54=0),#VALUE!,Q54*W54)","v":0},null,{"$f":"SUMIF($G:$G,TEXT(AE$3,\"000\")&TEXT($L54,\"000\"),$E:$E)","v":0},{"$f":"SUMIF($G:$G,TEXT(AF$3,\"000\")&TEXT($L54,\"000\"),$E:$E)","v":235},{"$f":"SUMIF($G:$G,TEXT(AG$3,\"000\")&TEXT($L54,\"000\"),$E:$E)","v":0},{"$f":"SUMIF($G:$G,TEXT(AH$3,\"000\")&TEXT($L54,\"000\"),$E:$E)","v":0},{"$f":"SUMIF($G:$G,TEXT(AI$3,\"000\")&TEXT($L54,\"000\"),$E:$E)","v":0},null,0,{"$f":"AL53","v":27.98},0,0,0,null,{"$f":"IF(AND(AE54<>0,AK54=0),#VALUE!,AE54*AK54)","v":0},6575.3,0,0,0,145.70000000000073,2.2660818713450409E-2,26,null,27.834042,null,null,null,null,{"$f":"ROUND(AX54*$BE$2,2)+ROUND(AX54*$BE$1,2)","v":0.06},null,0,null,null,null,null,null,0,28.402497999999998,{"$f":"AM54*$BM$1","v":0},0,0,null,{"$f":"BM54-AY54","v":0},0.56845599999999763,0,0,0]
[null,2,"042",536,152,null,"042536",null,"Decorative Sodium Vapor","Direct Burial","Post Top 100W",484,0,68,0,0,0,0,0,26.04,0,0,0,null,0,1770.72,0,0,0,null,0,{"$f":"N55","v":68},0,0,0,null,{"$f":"ROUND(S55*(1+AK$1),2)","v":0},26.63,{"$f":"ROUND(U55*(1+AM$1),2)","v":0},{"$f":"ROUND(V55*(1+AN$1),2)","v":0},{"$f":"ROUND(W55*(1+AO$1),2)","v":0},null,{"$f":"IF(AND(AE55<>0,AK55=0),#VALUE!,AE55*AK55)","v":0},1810.84,{"$f":"IF(AND(AG55<>0,AM55=0),#VALUE!,AG55*AM55)","v":0},{"$f":"IF(AND(AH55<>0,AN55=0),#VALUE!,AH55*AN55)","v":0},{"$f":"IF(AND(AI55<>0,AO55=0),#VALUE!,AI55*AO55)","v":0},40.119999999999891,2.2657450076804853E-2,40,null,26.494109999999999,null,null,null,null,9.000000000000008E-2,null,0.03,null,null,null,null,null,{"$f":"AK55*$BM$1","v":0},{"$f":"AL55*$BM$1","v":27.032112999999995},0,0,0,null,0,0.53800299999999623,0,0,0]
[null,2,"042","536L",245,null,"042536L",null,"Decorative Light Emitting Diode (LED)","Direct Burial","Post Top 70W","484L",0,99,0,0,0,0,0,{"$f":"T55","v":26.04},0,0,0,null,{"$f":"IF(AND(M56<>0,S56=0),#VALUE!,M56*S56)","v":0},{"$f":"IF(AND(N56<>0,T56=0),#VALUE!,N56*T56)","v":2577.96},{"$f":"IF(AND(O56<>0,U56=0),#VALUE!,O56*U56)","v":0},{"$f":"IF(AND(P56<>0,V56=0),#VALUE!,P56*V56)","v":0},{"$f":"IF(AND(Q56<>0,W56=0),#VALUE!,Q56*W56)","v":0},null,{"$f":"SUMIF($G:$G,TEXT(AE$3,\"000\")&TEXT($L56,\"000\"),$E:$E)","v":0},99,0,0,0,null,{"$f":"ROUND(S56*(1+AK$1),2)","v":0},{"$f":"AL55","v":26.63},0,0,0,null,0,2636.37,0,0,0,58.409999999999854,2.265745007680486E-2,26,null,26.494109999999999,null,null,null,null,{"$f":"ROUND(AX56*$BE$2,2)+ROUND(AX56*$BE$1,2)","v":0.06},null,0,null,null,null,null,null,0,27.032112999999995,{"$f":"AM56*$BM$1","v":0},0,0,null,{"$f":"BM56-AY56","v":0},{"$f":"BN56-AZ56","v":0.53800299999999623},{"$f":"BO56-BA56","v":0},{"$f":"BP56-BB56","v":0},{"$f":"BQ56-BC56","v":0}]
[null,2,"042","536T",{"$f":"339+4","v":343},null,"042536T",null,"Single Light Emitting Diode (LED)","30ft Fiberglass Pole","70W","494L",0,12,0,0,0,{"$f":"IF(SUM(M57:Q57)>0,0,1)","v":0},0,28.79,0,0,0,null,{"$f":"IF(AND(M57<>0,S57=0),#VALUE!,M57*S57)","v":0},{"$f":"IF(AND(N57<>0,T57=0),#VALUE!,N57*T57)","v":345.48},{"$f":"IF(AND(O57<>0,U57=0),#VALUE!,O57*U57)","v":0},{"$f":"IF(AND(P57<>0,V57=0),#VALUE!,P57*V57)","v":0},{"$f":"IF(AND(Q57<>0,W57=0),#VALUE!,Q57*W57)","v":0},null,0,12,0,0,0,null,{"$f":"ROUND(S57*(1+AK$1),2)","v":0},{"$f":"ROUND(T57*(1+AL$1),2)","v":29.44},0,0,0,null,0,353.28000000000003,0,0,0,null,null,26,null,29.295785999999996,null,null,null,null,{"$f":"ROUND(AX57*$BE$2,2)+ROUND(AX57*$BE$1,2)","v":0.06},null,-0.01,null,null,null,null,null,0,29.884543999999998,0,0,0,null,{"$f":"BM57-AY57","v":0},{"$f":"BN57-AZ57","v":0.58875800000000211},{"$f":"BO57-BA57","v":0},{"$f":"BP57-BB57","v":0},{"$f":"BQ57-BC57","v":0}]
[null,2,"042",541,2,null,"042541",null,"LED (Dusk to 11:00)","Dusk to 11 PM","100W",499,0,0,0,0,41,0,0,0,0,0,2.98,null,0,0,0,0,122.17999999999999,null,0,0,0,0,41,null,0,0,0,0,3.05,null,0,0,0,0,125.05,0,{"$error":"#DIV/0!"},21,null,null,null,null,3.01,null,3.999999999999998E-2,null,null,null,null,{"$f":"ROUND((W58*$BF$2)+$BE58-BC58,2)","v":0.05},null,null,0,0,0,0,3.0960549999999993,null,{"$f":"BM58-AY58","v":0},0,0,0,8.6054999999999549E-2]
[null,2,"042","541L",1,null,"042541L",null,"Mercury Vapor","Dusk to Dawn",10000,515,0,0,0,1,0,0,0,0,0,10.35,0,null,0,0,0,10.35,0,null,0,0,0,1,0,null,0,0,0,10.6,0,null,0,0,0,10.6,0,0,{"$error":"#DIV/0!"},111,null,null,null,10.46,null,null,0.25,null,null,null,{"$f":"ROUND((V59*$BF$2)+$BE59-BB59,2)","v":0.3},null,null,null,0,0,0,10.760059999999999,0,null,0,0,0,0.30005999999999844,0]
[null,2,"042","541T",0,null,"042541T",null,"Single High-Pressure Sodium Vapor","Standard  ","200W",531,0,163,0,0,0,0,0,20.72,12.53,0,0,null,0,3377.3599999999997,0,0,0,null,0,{"$f":"N60","v":163},{"$f":"O60","v":0},{"$f":"P60","v":0},{"$f":"Q60","v":0},null,0,{"$f":"ROUND(T60*(1+AL$1),2)","v":21.19},12.83,0,0,null,0,3453.9700000000003,0,0,0,76.610000000000582,2.2683397683397857E-2,85,null,null,12.66,null,null,null,0.17999999999999994,null,null,{"$f":"ROUND((U60*$BF$2)+$BE60-BA60,2)","v":0.24},null,null,null,null,0,21.509968999999998,13.023732999999998,0,0,null,0,21.509968999999998,0.36373299999999809,0,0]
[null,2,"042","542L",15,null,"042542L",null,"Single Light Emitting Diode (LED)","Standard  ","107W","531L",0,1349,0,0,0,{"$f":"IF(SUM(M61:Q61)>0,0,1)","v":0},0,{"$f":"T60","v":20.72},0,0,0,null,0,27951.279999999999,0,0,0,null,{"$f":"SUMIF($G:$G,TEXT(AE$3,\"000\")&TEXT($L61,\"000\"),$E:$E)","v":0},{"$f":"SUMIF($G:$G,TEXT(AF$3,\"000\")&TEXT($L61,\"000\"),$E:$E)","v":1349},{"$f":"SUMIF($G:$G,TEXT(AG$3,\"000\")&TEXT($L61,\"000\"),$E:$E)","v":0},{"$f":"SUMIF($G:$G,TEXT(AH$3,\"000\")&TEXT($L61,\"000\"),$E:$E)","v":0},{"$f":"SUMIF($G:$G,TEXT(AI$3,\"000\")&TEXT($L61,\"000\"),$E:$E)","v":0},null,0,{"$f":"AL60","v":21.19},0,0,0,null,0,28585.31,0,0,0,null,null,39,null,null,null,null,null,null,8.0000000000000016E-2,null,{"$f":"ROUND((T61*$BF$2)+$BE61-AZ61,2)","v":21.11},null,null,null,null,null,0,21.509968999999998,0,0,0,null,0,21.509968999999998,0,0,0]
[null,2,"042","542T",9,null,"042542T",null,"Single Light Emitting Diode (LED)","Standard  ","107W","531T",0,474,0,0,0,0,0,{"$f":"T60-T104","v":15.509999999999998},0,0,0,null,0,7351.7399999999989,0,0,0,null,{"$f":"M62","v":0},{"$f":"N62","v":474},{"$f":"O62","v":0},{"$f":"P62","v":0},{"$f":"Q62","v":0},null,0,{"$f":"AL60-AL104","v":15.98},0,0,0,null,0,7574.52,0,0,0,{"$f":"SUM(AQ62:AU62)-SUM(Y62:AC62)","v":222.78000000000156},null,39,null,null,null,null,null,null,8.0000000000000016E-2,null,15.82,null,null,null,null,null,0,16.221297999999997,0,0,0,null,0,16.221297999999997,0,0,0]
[null,2,"042","546T",8,null,"042546T",null,"Single High-Pressure Sodium Vapor","Pedestal Base","200W",532,0,106,89,0,0,0,0,37.26,12.53,0,0,null,0,{"$f":"IF(AND(N63<>0,T63=0),#VALUE!,N63*T63)","v":3949.56},1115.1699999999998,0,0,null,0,106,89,0,0,null,0,38.1,12.83,0,0,null,0,4038.6000000000004,1141.8700000000001,0,0,89.040000000000418,2.2544283413848738E-2,85,null,37.903833999999996,12.66,null,null,null,0.17999999999999994,null,{"$f":"ROUND((T63*$BF$2)+$BE63-AZ63,2)","v":0.1},{"$f":"ROUND((U63*$BF$2)+$BE63-BA63,2)","v":0.24},null,null,null,null,0,38.675309999999996,13.023732999999998,0,0,null,0,0.77147599999999983,0.36373299999999809,0,0]
[null,2,"042","594L",5,null,{"$f":"IF(OR(ISBLANK(C64),ISBLANK(D64)),\"\",TEXT(C64,\"000\")&TEXT(D64,\"000\"))","v":"042594L"},null,"Single Light Emitting Diode (LED)","Pedestal Base","107W","532L",{"$f":"SUMIF($G:$G,TEXT(M$3,\"000\")&TEXT($L64,\"000\"),$E:$E)","v":0},705,0,0,0,0,0,{"$f":"T63","v":37.26},0,0,0,null,{"$f":"IF(AND(M64<>0,S64=0),#VALUE!,M64*S64)","v":0},26268.3,0,0,0,null,{"$f":"SUMIF($G:$G,TEXT(AE$3,\"000\")&TEXT($L64,\"000\"),$E:$E)","v":0},{"$f":"SUMIF($G:$G,TEXT(AF$3,\"000\")&TEXT($L64,\"000\"),$E:$E)","v":705},{"$f":"SUMIF($G:$G,TEXT(AG$3,\"000\")&TEXT($L64,\"000\"),$E:$E)","v":0},{"$f":"SUMIF($G:$G,TEXT(AH$3,\"000\")&TEXT($L64,\"000\"),$E:$E)","v":0},{"$f":"SUMIF($G:$G,TEXT(AI$3,\"000\")&TEXT($L64,\"000\"),$E:$E)","v":0},null,{"$f":"ROUND(S64*(1+AK$1),2)","v":0},{"$f":"AL63","v":38.1},0,0,0,null,0,26860.5,0,0,0,592.20000000000073,2.2544283413848658E-2,39,null,37.903833999999996,null,null,null,null,{"$f":"ROUND(AX64*$BE$2,2)+ROUND(AX64*$BE$1,2)","v":8.0000000000000016E-2},null,0,null,null,null,null,null,0,38.675309999999996,{"$f":"AM64*$BM$1","v":0},0,0,null,{"$f":"BM64-AY64","v":0},0.77147599999999983,0,0,0]
[null,2,"042",631,38,null,"042631",null,"Single Light Emitting Diode (LED)","Pedestal Base","107W","532T",0,152,0,0,0,0,0,{"$f":"T63-T104","v":32.049999999999997},0,0,0,null,0,4871.5999999999995,0,0,0,null,{"$f":"M65","v":0},{"$f":"N65","v":152},{"$f":"O65","v":0},{"$f":"P65","v":0},{"$f":"Q65","v":0},null,{"$f":"ROUND(S65*(1+AK$1),2)","v":0},{"$f":"AL64-AL104","v":32.89},0,0,0,null,0,4999.28,0,0,0,127.68000000000029,2.620904836193454E-2,39,null,32.290331000000002,null,null,null,null,{"$f":"ROUND(AX65*$BE$2,2)+ROUND(AX65*$BE$1,2)","v":8.0000000000000016E-2},null,0.32,null,null,null,null,null,0,33.386638999999995,0,0,0,null,0,1.0963079999999934,0,0,0]
[null,2,"042",633,34,null,"042633",null,"Single High-Pressure Sodium Vapor","Direct Burial","200W",533,0,18,2,0,0,0,0,37.26,12.53,0,0,null,0,670.68,25.06,0,0,null,0,18,2,0,0,null,0,38.1,12.83,0,0,null,0,685.80000000000007,25.66,0,0,15.120000000000118,2.2544283413848808E-2,85,null,37.903833999999996,12.66,null,null,null,0.17999999999999994,null,0.1,{"$f":"ROUND((U66*$BF$2)+$BE66-BA66,2)","v":0.24},null,null,null,null,0,38.675309999999996,13.023732999999998,0,0,null,0,0.77147599999999983,0.36373299999999809,0,0]
[null,2,"042",636,2,null,"042636",null,"Single Light Emitting Diode (LED)","Direct Burial","107W","533L",0,55,0,0,0,0,0,{"$f":"T66","v":37.26},0,0,0,null,{"$f":"IF(AND(M67<>0,S67=0),#VALUE!,M67*S67)","v":0},2049.2999999999997,0,0,0,null,{"$f":"SUMIF($G:$G,TEXT(AE$3,\"000\")&TEXT($L67,\"000\"),$E:$E)","v":0},{"$f":"SUMIF($G:$G,TEXT(AF$3,\"000\")&TEXT($L67,\"000\"),$E:$E)","v":55},{"$f":"SUMIF($G:$G,TEXT(AG$3,\"000\")&TEXT($L67,\"000\"),$E:$E)","v":0},{"$f":"SUMIF($G:$G,TEXT(AH$3,\"000\")&TEXT($L67,\"000\"),$E:$E)","v":0},{"$f":"SUMIF($G:$G,TEXT(AI$3,\"000\")&TEXT($L67,\"000\"),$E:$E)","v":0},null,{"$f":"ROUND(S67*(1+AK$1),2)","v":0},{"$f":"AL66","v":38.1},0,0,0,null,0,2095.5,0,0,0,46.200000000000273,2.2544283413848766E-2,39,null,37.903833999999996,null,null,null,null,{"$f":"ROUND(AX67*$BE$2,2)+ROUND(AX67*$BE$1,2)","v":8.0000000000000016E-2},null,0,null,null,null,null,null,0,38.675309999999996,{"$f":"AM67*$BM$1","v":0},0,0,null,{"$f":"BM67-AY67","v":0},0.77147599999999983,0,0,0]
[null,2,"042",831,14,null,"042831",null,"Single Light Emitting Diode (LED)","Direct Burial","107W","533T",0,47,0,0,0,0,0,{"$f":"T66-T104","v":32.049999999999997},0,0,0,null,0,1506.35,0,0,0,null,{"$f":"M68","v":0},{"$f":"N68","v":47},{"$f":"O68","v":0},{"$f":"P68","v":0},{"$f":"Q68","v":0},null,{"$f":"ROUND(S68*(1+AK$1),2)","v":0},{"$f":"AL67-AL104","v":32.89},0,0,0,null,0,1545.83,0,0,0,39.480000000000018,2.6209048361934491E-2,39,null,32.290331000000002,null,null,null,null,{"$f":"ROUND(AX68*$BE$2,2)+ROUND(AX68*$BE$1,2)","v":8.0000000000000016E-2},null,0.32,null,null,null,null,null,0,33.386638999999995,0,0,0,null,0,1.0963079999999934,0,0,0]
[null,2,"042","831T",39,null,"042831T",null,"Single High-Pressure Sodium Vapor","Standard / Dusk to Dawn (046)","200W",535,0,93,8,0,45,0,0,20.72,12.53,0,9.9,null,0,1926.9599999999998,100.24,0,445.5,null,0,93,8,0,45,null,0,21.19,12.83,0,{"$f":"ROUND(W69*(1+AO$1),2)","v":10.14},null,0,1970.67,102.64,0,456.3,43.710000000000264,2.2683397683397822E-2,85,null,21.083626999999996,12.66,null,10.01,null,0.17999999999999994,null,0.13,{"$f":"ROUND((U69*$BF$2)+$BE69-BA69,2)","v":0.24},null,{"$f":"ROUND((W69*$BF$2)+$BE69-BC69,2)","v":0.22},null,null,0,21.509968999999998,13.023732999999998,0,10.293113999999999,null,0,0.42634200000000178,0.36373299999999809,0,0.28311399999999942]
[null,2,"042","831L",2,null,{"$f":"IF(OR(ISBLANK(C70),ISBLANK(D70)),\"\",TEXT(C70,\"000\")&TEXT(D70,\"000\"))","v":"042831L"},null,"Single Light Emitting Diode (LED)","Standard / Dusk to Dawn (046)","107W","535L",0,831,0,0,0,0,0,{"$f":"T69","v":20.72},0,0,0,null,{"$f":"IF(AND(M70<>0,S70=0),#VALUE!,M70*S70)","v":0},17218.32,0,0,0,null,{"$f":"SUMIF($G:$G,TEXT(AE$3,\"000\")&TEXT($L70,\"000\"),$E:$E)","v":0},{"$f":"SUMIF($G:$G,TEXT(AF$3,\"000\")&TEXT($L70,\"000\"),$E:$E)","v":831},{"$f":"SUMIF($G:$G,TEXT(AG$3,\"000\")&TEXT($L70,\"000\"),$E:$E)","v":0},{"$f":"SUMIF($G:$G,TEXT(AH$3,\"000\")&TEXT($L70,\"000\"),$E:$E)","v":0},{"$f":"SUMIF($G:$G,TEXT(AI$3,\"000\")&TEXT($L70,\"000\"),$E:$E)","v":0},null,{"$f":"ROUND(S70*(1+AK$1),2)","v":0},{"$f":"AL69","v":21.19},0,0,0,null,0,17608.89,0,0,0,390.56999999999971,2.2683397683397666E-2,39,null,21.083626999999996,null,null,null,null,{"$f":"ROUND(AX70*$BE$2,2)+ROUND(AX70*$BE$1,2)","v":8.0000000000000016E-2},null,0.03,null,null,null,null,null,0,21.509968999999998,{"$f":"AM70*$BM$1","v":0},0,0,null,{"$f":"BM70-AY70","v":0},0.42634200000000178,0,0,0]
[null,2,"042",832,0,null,"042832",null,"Single Light Emitting Diode (LED)","Standard / Dusk to Dawn (046)","107W","535T",0,396,0,0,0,0,0,{"$f":"T69-T104","v":15.509999999999998},0,0,0,null,0,6141.9599999999991,0,0,0,null,{"$f":"M71","v":0},{"$f":"N71","v":396},{"$f":"O71","v":0},{"$f":"P71","v":0},{"$f":"Q71","v":0},null,{"$f":"ROUND(S71*(1+AK$1),2)","v":0},{"$f":"AL70-AL104","v":15.98},0,0,0,null,0,6328.08,0,0,0,186.1200000000008,3.0303030303030439E-2,39,null,15.470123999999997,null,null,null,null,{"$f":"ROUND(AX71*$BE$2,2)+ROUND(AX71*$BE$1,2)","v":8.0000000000000016E-2},null,0.35,null,null,null,null,null,0,16.221297999999997,0,0,0,null,0,0.75117400000000067,0,0,0]
[null,2,"042","832T",{"$f":"1+1","v":2},null,{"$f":"IF(OR(ISBLANK(C72),ISBLANK(D72)),\"\",TEXT(C72,\"000\")&TEXT(D72,\"000\"))","v":"042832T"},null,"Single High-Pressure Sodium Vapor","Developer Contributed","200W",536,0,152,0,0,0,0,0,25.17,0,0,0,null,0,3825.84,0,0,0,null,0,152,0,0,0,null,0,25.74,0,0,0,null,0,3912.4799999999996,0,0,0,86.639999999999418,2.2646007151370526E-2,85,null,25.600821999999997,null,null,null,null,0.17999999999999994,null,0.13,null,null,null,null,null,0,26.128673999999997,0,0,0,null,0,0.52785199999999932,0,0,0]
[null,2,"042","832L",1,null,"042832L",null,"Single Light Emitting Diode (LED)","Developer Contributed","107W","536L",0,245,0,0,0,0,0,{"$f":"T72","v":25.17},0,0,0,null,{"$f":"IF(AND(M73<>0,S73=0),#VALUE!,M73*S73)","v":0},6166.6500000000005,0,0,0,null,{"$f":"SUMIF($G:$G,TEXT(AE$3,\"000\")&TEXT($L73,\"000\"),$E:$E)","v":0},{"$f":"SUMIF($G:$G,TEXT(AF$3,\"000\")&TEXT($L73,\"000\"),$E:$E)","v":245},{"$f":"SUMIF($G:$G,TEXT(AG$3,\"000\")&TEXT($L73,\"000\"),$E:$E)","v":0},{"$f":"SUMIF($G:$G,TEXT(AH$3,\"000\")&TEXT($L73,\"000\"),$E:$E)","v":0},{"$f":"SUMIF($G:$G,TEXT(AI$3,\"000\")&TEXT($L73,\"000\"),$E:$E)","v":0},null,{"$f":"ROUND(S73*(1+AK$1),2)","v":0},{"$f":"AL72","v":25.74},0,0,0,null,0,6306.2999999999993,0,0,0,139.64999999999873,2.2646007151370471E-2,39,null,25.600821999999997,null,null,null,null,{"$f":"ROUND(AX73*$BE$2,2)+ROUND(AX73*$BE$1,2)","v":8.0000000000000016E-2},null,0.03,null,null,null,null,null,0,26.128673999999997,{"$f":"AM73*$BM$1","v":0},0,0,null,{"$f":"BM73-AY73","v":0},0.52785199999999932,0,0,0]
[null,2,"042",835,7,null,{"$f":"IF(OR(ISBLANK(C74),ISBLANK(D74)),\"\",TEXT(C74,\"000\")&TEXT(D74,\"000\"))","v":"042835"},null,"Single Light Emitting Diode (LED)","Developer Contributed","107W","536T",{"$f":"SUMIF($G:$G,TEXT(M$3,\"000\")&TEXT($L74,\"000\"),$E:$E)","v":0},343,0,0,0,0,0,{"$f":"T72-T104","v":19.96},0,0,0,null,0,6846.2800000000007,0,0,0,null,{"$f":"M74","v":0},{"$f":"N74","v":343},{"$f":"O74","v":0},{"$f":"P74","v":0},{"$f":"Q74","v":0},null,{"$f":"ROUND(S74*(1+AK$1),2)","v":0},{"$f":"AL73-AL104","v":20.529999999999998},0,0,0,null,0,7041.7899999999991,0,0,0,195.5099999999984,2.8557114228456679E-2,39,null,19.987318999999996,null,null,null,null,{"$f":"ROUND(AX74*$BE$2,2)+ROUND(AX74*$BE$1,2)","v":8.0000000000000016E-2},null,0.35,null,null,null,null,null,0,20.840002999999996,0,0,0,null,0,0.852684,0,0,0]
[null,2,"042","835T",39,null,{"$f":"IF(OR(ISBLANK(C75),ISBLANK(D75)),\"\",TEXT(C75,\"000\")&TEXT(D75,\"000\"))","v":"042835T"},null,"Double High-Pressure Sodium Vapor","Standard","200W",541,0,2,0,0,0,0,0,45.9,0,0,0,null,0,91.8,0,0,0,null,0,2,0,0,0,null,0,{"$f":"ROUND(T75*(1+AL$1),2)","v":46.93},0,0,0,null,0,93.86,0,0,0,2.0600000000000023,2.2440087145969526E-2,170,null,46.694599999999994,null,null,null,null,0.38000000000000012,null,0.28000000000000003,null,null,null,null,null,0,47.638642999999995,0,0,0,null,0,0.94404300000000063,0,0,0]
[null,2,"042","835L",12,null,{"$f":"IF(OR(ISBLANK(C76),ISBLANK(D76)),\"\",TEXT(C76,\"000\")&TEXT(D76,\"000\"))","v":"042835L"},null,"Double Light Emitting Diode (LED)","Standard","107W","541L",0,1,0,0,0,0,0,{"$f":"T75","v":45.9},0,0,0,null,{"$f":"IF(AND(M76<>0,S76=0),#VALUE!,M76*S76)","v":0},45.9,0,0,0,null,{"$f":"SUMIF($G:$G,TEXT(AE$3,\"000\")&TEXT($L76,\"000\"),$E:$E)","v":0},1,0,0,0,null,{"$f":"ROUND(S76*(1+AK$1),2)","v":0},{"$f":"AL75","v":46.93},0,0,0,null,0,46.93,0,0,0,1.0300000000000011,2.2440087145969526E-2,78,null,46.694599999999994,null,null,null,null,{"$f":"ROUND(AX76*$BE$2,2)+ROUND(AX76*$BE$1,2)","v":0.18000000000000005},null,0.08,null,null,null,null,null,0,47.638642999999995,{"$f":"AM76*$BM$1","v":0},{"$f":"AN76*$BM$1","v":0},{"$f":"AO76*$BM$1","v":0},null,{"$f":"BM76-AY76","v":0},0.94404300000000063,0,0,0]
[null,2,"042","836T",0,null,{"$f":"IF(OR(ISBLANK(C77),ISBLANK(D77)),\"\",TEXT(C77,\"000\")&TEXT(D77,\"000\"))","v":"042836T"},null,"Double Light Emitting Diode (LED)","Pedestal Base","107W","542L",0,15,0,0,0,0,0,63.15,0,0,0,null,{"$f":"IF(AND(M77<>0,S77=0),#VALUE!,M77*S77)","v":0},947.25,0,0,0,null,0,15,0,0,0,null,0,64.569999999999993,0,0,0,null,0,{"$f":"IF(AND(AF77<>0,AL77=0),#VALUE!,AF77*AL77)","v":968.55},0,0,0,21.299999999999955,2.2486144101345952E-2,78,null,64.245678999999996,null,null,null,null,0.18000000000000005,null,0.04,null,null,null,null,null,0,65.545006999999984,0,0,0,null,0,1.2993279999999885,0,0,0]
[null,2,"042",842,2,null,"042842",null,"Double Light Emitting Diode (LED)","Pedestal Base","107W","542T",0,9,0,0,0,0,0,{"$f":"T77-T104-T104","v":52.73},0,0,0,null,0,474.57,0,0,0,null,{"$f":"M78","v":0},9,0,0,0,null,{"$f":"ROUND(S78*(1+AK$1),2)","v":0},{"$f":"AL77-AL104-AL104","v":54.149999999999991},0,0,0,null,0,487.34999999999991,0,0,0,12.779999999999916,2.6929641570263431E-2,78,null,53.018672999999993,null,null,null,null,{"$f":"ROUND(AX78*$BE$2,2)+ROUND(AX78*$BE$1,2)","v":0.18000000000000005},null,{"$f":"ROUND((T78*$BF$2)+$BE78-AZ78,2)","v":0.69},null,null,null,null,null,0,54.967664999999982,{"$f":"AM78*$BM$1","v":0},0,0,null,{"$f":"BM78-AY78","v":0},1.9489919999999898,0,0,0]
[null,null,null,null,{"$f":"SUM(E13:E78)","v":22589},null,"",null,"Double Light Emitting Diode (LED)","Developer Contributed","107W","546T",0,8,0,0,0,0,0,{"$f":"T144-T104-T104","v":39.92},0,0,0,null,0,319.36,0,0,0,null,0,8,0,0,0,null,{"$f":"ROUND(S79*(1+AK$1),2)","v":0},{"$f":"AL144-AL104-AL104","v":41.05},0,0,0,null,0,328.4,0,0,0,9.0399999999999636,2.8306613226452792E-2,78,null,38.340326999999995,null,null,null,null,{"$f":"ROUND(AX79*$BE$2,2)+ROUND(AX79*$BE$1,2)","v":0.18000000000000005},null,2.36,null,null,null,null,null,0,41.669854999999991,0,0,0,null,0,3.3295279999999963,0,0,0]
[null,null,null,null,null,null,"",null,"Single Light Emitting Diode (LED)","35ft Fiberglass Pole","107W","594L",0,5,0,0,0,{"$f":"IF(SUM(M80:Q80)>0,0,1)","v":0},0,31.72,0,0,0,null,0,158.6,0,0,0,null,{"$f":"M80","v":0},{"$f":"N80","v":5},{"$f":"O80","v":0},{"$f":"P80","v":0},{"$f":"Q80","v":0},null,{"$f":"ROUND(S80*(1+AK$1),2)","v":0},{"$f":"ROUND(T80*(1+AL$1),2)","v":32.43},0,0,0,null,0,162.15,0,0,0,{"$f":"SUM(AQ80:AU80)-SUM(Y80:AC80)","v":3.5500000000000114},null,39,null,32.270028999999994,null,null,null,null,{"$f":"ROUND(AX80*$BE$2,2)+ROUND(AX80*$BE$1,2)","v":8.0000000000000016E-2},null,0.01,null,null,null,null,null,0,32.919692999999995,0,0,0,null,0,0.64966400000000135,0,0,0]
[null,2,"044",431,1,null,{"$f":"IF(OR(ISBLANK(C81),ISBLANK(D81)),\"\",TEXT(C81,\"000\")&TEXT(D81,\"000\"))","v":"044431"},null,"Single Mercury Vapor","Wood Pole",20000,611,6,0,0,0,0,0,29.56,0,0,0,0,null,{"$f":"IF(AND(M81<>0,S81=0),#VALUE!,M81*S81)","v":177.35999999999999},0,0,0,0,null,6,0,0,0,0,null,30.26,0,{"$f":"ROUND(U81*(1+AM$1),2)","v":0},{"$f":"ROUND(V81*(1+AN$1),2)","v":0},{"$f":"ROUND(W81*(1+AO$1),2)","v":0},null,181.56,0,0,0,0,0,{"$error":"#DIV/0!"},182,29.87,null,null,null,null,null,0.41000000000000014,{"$f":"ROUND((S81*$BF$2)+$BE81-AY81,2)","v":0.55000000000000004},null,null,null,null,null,null,30.716925999999997,0,0,0,0,null,0.84692599999999629,0,0,0,0]
[null,2,"044",432,4,null,"044432",null,"Mercury Vapor","Dusk to Dawn",20000,615,0,0,0,87,0,0,0,0,0,16,0,null,0,0,0,1392,0,null,0,0,0,87,0,null,0,0,0,16.38,0,null,{"$f":"IF(AND(AE82<>0,AK82=0),#VALUE!,AE82*AK82)","v":0},0,{"$f":"IF(AND(AG82<>0,AM82=0),#VALUE!,AG82*AM82)","v":0},{"$f":"IF(AND(AH82<>0,AN82=0),#VALUE!,AH82*AN82)","v":1425.06},{"$f":"IF(AND(AI82<>0,AO82=0),#VALUE!,AI82*AO82)","v":0},0,{"$error":"#DIV/0!"},182,null,null,null,16.16,null,null,{"$f":"ROUND(AX82*$BE$2,2)+ROUND(AX82*$BE$1,2)","v":0.41000000000000014},null,null,null,{"$f":"ROUND((V82*$BF$2)+$BE82-BB82,2)","v":0.49},null,null,null,{"$f":"AK82*$BM$1","v":0},{"$f":"AL82*$BM$1","v":0},0,16.627337999999998,0,null,0,0,0,0.46733799999999803,0]
[null,2,"044",433,10,null,"044433",null,"Mercury Vapor","Dust to 1 AM",20000,618,0,0,0,87,0,{"$f":"IF(SUM(M83:Q83)>0,0,1)","v":0},0,0,0,9.4600000000000009,0,null,{"$f":"IF(AND(M83<>0,S83=0),#VALUE!,M83*S83)","v":0},{"$f":"IF(AND(N83<>0,T83=0),#VALUE!,N83*T83)","v":0},{"$f":"IF(AND(O83<>0,U83=0),#VALUE!,O83*U83)","v":0},{"$f":"IF(AND(P83<>0,V83=0),#VALUE!,P83*V83)","v":823.0200000000001},{"$f":"IF(AND(Q83<>0,W83=0),#VALUE!,Q83*W83)","v":0},null,{"$f":"M83","v":0},{"$f":"N83","v":0},{"$f":"O83","v":0},{"$f":"P83","v":87},{"$f":"Q83","v":0},null,{"$f":"ROUND(S83*(1+AK$1),2)","v":0},{"$f":"ROUND(T83*(1+AL$1),2)","v":0},{"$f":"ROUND(U83*(1+AM$1),2)","v":0},{"$f":"ROUND(V83*(1+AN$1),2)","v":9.69},{"$f":"ROUND(W83*(1+AO$1),2)","v":0},null,{"$f":"IF(AND(AE83<>0,AK83=0),#VALUE!,AE83*AK83)","v":0},{"$f":"IF(AND(AF83<>0,AL83=0),#VALUE!,AF83*AL83)","v":0},{"$f":"IF(AND(AG83<>0,AM83=0),#VALUE!,AG83*AM83)","v":0},{"$f":"IF(AND(AH83<>0,AN83=0),#VALUE!,AH83*AN83)","v":843.03},{"$f":"IF(AND(AI83<>0,AO83=0),#VALUE!,AI83*AO83)","v":0},0,{"$error":"#DIV/0!"},124,null,null,null,9.7799999999999994,null,null,{"$f":"ROUND(AX83*$BE$2,2)+ROUND(AX83*$BE$1,2)","v":0.28000000000000003},null,null,null,{"$f":"ROUND((V83*$BF$2)+$BE83-BB83,2)","v":0.1},null,null,null,{"$f":"AK83*$BM$1","v":0},{"$f":"AL83*$BM$1","v":0},{"$f":"AM83*$BM$1","v":0},{"$f":"AN83*$BM$1","v":9.8363189999999978},{"$f":"AO83*$BM$1","v":0},null,{"$f":"BM83-AY83","v":0},{"$f":"BN83-AZ83","v":0},{"$f":"BO83-BA83","v":0},{"$f":"BP83-BB83","v":5.6318999999998454E-2},{"$f":"BQ83-BC83","v":0}]
[null,2,"044",435,{"$f":"11+1+1","v":13},null,"044435",null,"Single High-Pressure Sodium Vapor","Standard","250W",631,{"$f":"SUMIF($G:$G,TEXT(M$3,\"000\")&TEXT($L84,\"000\"),$E:$E)","v":0},38,0,0,0,0,0,25.23,0,0,0,null,0,958.74,0,0,0,null,0,38,0,0,0,null,0,25.8,0,0,0,null,0,980.4,0,0,0,21.659999999999968,2.2592152199762155E-2,107,null,25.682029999999997,14.729100999999998,null,null,null,0.22999999999999998,null,{"$f":"ROUND((T84*$BF$2)+$BE84-AZ84,2)","v":0.16},{"$f":"ROUND((U84*$BF$2)+$BE84-BA84,2)","v":-14.5},null,null,null,null,0,26.189579999999999,0,0,0,null,0,0.50755000000000194,-14.729100999999998,0,0]
[null,2,"044",531,0,null,"044531",null,"Single High-Pressure Sodium Vapor","Direct Burial","250W",633,0,34,0,0,0,0,0,41.79,0,0,0,null,0,1420.86,0,0,0,null,0,34,0,0,0,null,0,42.73,0,0,0,null,0,1452.82,0,0,0,31.960000000000036,2.2493419478344129E-2,107,null,42.512388000000001,14.729100999999998,null,null,null,0.22999999999999998,null,{"$f":"ROUND((T85*$BF$2)+$BE85-AZ85,2)","v":0.14000000000000001},{"$f":"ROUND((U85*$BF$2)+$BE85-BA85,2)","v":-14.5},null,null,null,null,0,43.375222999999991,0,0,0,null,0,0.8628349999999898,-14.729100999999998,0,0]
[null,2,"044",532,89,null,"044532",null,"Single High-Pressure Sodium Vapor","Dusk to Dawn (046)","250W",635,0,0,14,0,237,0,0,0,14.57,0,11.93,null,0,0,203.98000000000002,0,2827.41,null,0,0,14,0,237,null,0,0,14.92,0,12.21,null,0,0,208.88,0,2893.77,0,{"$error":"#DIV/0!"},107,null,null,14.729100999999998,null,12.049236999999998,null,0.22999999999999998,null,null,{"$f":"ROUND((U86*$BF$2)+$BE86-BA86,2)","v":0.28999999999999998},null,{"$f":"ROUND((W86*$BF$2)+$BE86-BC86,2)","v":0.28999999999999998},null,null,0,0,15.145291999999998,0,12.394371,null,0,0,0.41619099999999953,0,0.34513400000000161]
[null,2,"044",533,2,null,"044533",null,"Single High-Pressure Sodium Vapor","Developer Contributed","250W",636,0,2,0,0,0,0,0,29.68,0,0,0,null,0,59.36,0,0,0,null,0,2,0,0,0,null,0,30.35,0,0,0,null,0,60.7,0,0,0,1.3400000000000034,2.2574123989218386E-2,107,null,30.199224999999998,null,null,null,null,0.22999999999999998,null,{"$f":"ROUND((T87*$BF$2)+$BE87-AZ87,2)","v":0.16},null,null,null,null,null,0,30.808284999999998,0,0,0,null,0,0.60905999999999949,0,0,0]
[null,2,"044",535,{"$f":"7+1","v":8},null,"044535",null,"Mercury Vapor","Dusk to Dawn",35000,715,0,0,0,6,0,0,0,0,0,25.97,0,null,0,0,0,155.82,0,null,0,0,0,6,0,null,0,{"$f":"ROUND(T88*(1+AL$1),2)","v":0},0,26.59,0,null,0,0,0,159.54,0,0,{"$error":"#DIV/0!"},285,null,null,null,26.230183999999998,null,null,0.63000000000000034,null,null,null,{"$f":"ROUND((V88*$BF$2)+$BE88-BB88,2)","v":0.76},null,null,null,0,0,0,26.991508999999997,0,null,0,0,0,0.76132499999999936,0]
[null,2,"044",632,0,null,"044632",null,"Single High-Pressure Sodium Vapor","Pedestal Base","310W",732,0,0,7,0,0,0,0,0,17.100000000000001,0,0,null,0,0,119.70000000000002,0,0,null,0,0,7,0,0,null,0,0,17.510000000000002,0,0,null,0,0,122.57000000000001,0,0,0,{"$error":"#DIV/0!"},133,null,null,17.277001999999996,null,null,null,0.29000000000000004,null,null,{"$f":"ROUND((U89*$BF$2)+$BE89-BA89,2)","v":0.37},null,null,null,null,0,0,17.774401000000001,0,0,null,0,0,0.49739900000000503,0,0]
[null,2,"044",635,{"$f":"13+1","v":14},null,{"$f":"IF(OR(ISBLANK(C90),ISBLANK(D90)),\"\",TEXT(C90,\"000\")&TEXT(D90,\"000\"))","v":"044635"},null,"Single High-Pressure Sodium Vapor","No Pole / Dusk to Dawn (046)","310W",735,0,0,1,0,184,0,0,0,17.100000000000001,0,14.39,null,0,0,17.100000000000001,0,2647.76,null,0,0,1,0,184,null,0,0,17.510000000000002,0,14.73,null,0,0,17.510000000000002,0,2710.32,0,{"$error":"#DIV/0!"},133,null,null,17.277001999999996,null,14.536231999999998,null,0.29000000000000004,null,null,{"$f":"ROUND((U90*$BF$2)+$BE90-BA90,2)","v":0.37},null,{"$f":"ROUND((W90*$BF$2)+$BE90-BC90,2)","v":0.36},null,null,0,0,17.774401000000001,0,14.952423,null,0,0,0.49739900000000503,0,0.41619100000000131]
[null,2,"044",732,7,null,{"$f":"IF(OR(ISBLANK(C91),ISBLANK(D91)),\"\",TEXT(C91,\"000\")&TEXT(D91,\"000\"))","v":"044732"},null,"Single High-Pressure Sodium Vapor","Standard  ","400W",831,0,14,0,0,0,{"$f":"IF(SUM(M91:Q91)>0,0,1)","v":0},0,29.41,21.95,0,0,null,0,{"$f":"IF(AND(N91<>0,T91=0),#VALUE!,N91*T91)","v":411.74},0,0,0,null,0,14,0,0,0,null,0,30.07,22.47,0,0,null,0,420.98,0,0,0,{"$f":"SUM(AQ91:AU91)-SUM(Y91:AC91)","v":9.2400000000000091},null,169,null,null,22.17,null,null,null,0.37999999999999989,null,{"$f":"ROUND((T91*$BF$2)+$BE91-AZ91,2)","v":30.23},{"$f":"ROUND((U91*$BF$2)+$BE91-BA91,2)","v":0.49},null,null,null,null,0,30.524056999999996,22.809296999999997,0,0,null,0,30.524056999999996,0.63929699999999556,0,0]
[null,2,"044",735,1,null,"044735",null,"Single Light Emitting Diode (LED)","Standard  ","248W","831T",0,39,0,0,0,0,0,{"$f":"T91-T105","v":21.95},null,0,0,null,0,856.05,0,0,0,null,0,39,0,0,0,null,0,{"$f":"AL91-AL105","v":22.61},0,0,0,null,0,{"$f":"IF(AND(AF92<>0,AL92=0),#VALUE!,AF92*AL92)","v":881.79},0,0,0,{"$f":"SUM(AQ92:AU92)-SUM(Y92:AC92)","v":25.740000000000009},null,83,null,null,null,null,null,null,0.18999999999999995,null,22.47,null,null,null,null,null,0,22.951410999999997,0,0,0,null,0,22.951410999999997,0,0,0]
[null,2,"044",835,9,null,"044835",null,"Single Light Emitting Diode (LED)","Standard  ","248W","831L",0,2,0,0,0,0,0,{"$f":"T91","v":29.41},0,0,null,null,null,58.82,0,0,0,null,{"$f":"SUMIF($G:$G,TEXT(AE$3,\"000\")&TEXT($L93,\"000\"),$E:$E)","v":0},2,0,0,0,null,0,{"$f":"AL91","v":30.07},0,0,0,null,0,60.14,0,0,0]
[null,2,"044",845,1,null,"044845",null,"Single Light Emitting Diode (LED)","Pedestal Base","248W","832T",{"$f":"SUMIF($G:$G,TEXT(M$3,\"000\")&TEXT($L94,\"000\"),$E:$E)","v":0},2,0,0,0,0,0,{"$f":"T160-T105","v":48.269999999999996},0,0,null,null,null,{"$f":"IF(AND(N94<>0,T94=0),#VALUE!,N94*T94)","v":96.539999999999992},0,0,0,null,0,2,0,0,0,null,{"$f":"ROUND(S94*(1+AK$1),2)","v":0},{"$f":"AL95-AL105","v":49.519999999999996},{"$f":"ROUND(U94*(1+AM$1),2)","v":0},0,0,null,0,{"$f":"IF(AND(AF94<>0,AL94=0),#VALUE!,AF94*AL94)","v":99.039999999999992},0,0,0,{"$f":"SUM(AR94)-SUM(Z94)","v":2.5},{"$f":"AV94/Z94","v":2.5896001657344108E-2}]
[null,null,null,null,{"$f":"SUM(E81:E94)","v":159},null,"",null,"Single Light Emitting Diode (LED)","Pedestal Base","248W","832L",0,1,0,0,0,0,0,55.73,0,0,null,null,null,{"$f":"IF(AND(N95<>0,T95=0),#VALUE!,N95*T95)","v":55.73},0,0,0,null,0,1,0,0,0,null,{"$f":"ROUND(S95*(1+AK$1),2)","v":0},{"$f":"ROUND(T95*(1+AL$1),2)","v":56.98},0,0,0,null,0,56.98,0,0,0,1.25,2.2429571146599679E-2]
[null,null,null,null,null,null,"",null,"Single High-Pressure Sodium Vapor","Standard / Dusk to Dawn (046)","400W",835,0,7,9,0,16,0,0,29.41,21.95,0,18.260000000000002,null,0,205.87,197.54999999999998,0,292.16000000000003,null,0,7,9,0,16,null,0,{"$f":"ROUND(T96*(1+AL$1),2)","v":30.07},22.47,0,18.690000000000001,null,0,{"$f":"IF(AND(AF96<>0,AL96=0),#VALUE!,AF96*AL96)","v":210.49},202.23,0,299.04000000000002,{"$f":"SUM(AR96)-SUM(Z96)","v":4.6200000000000045},{"$f":"AV96/Z96","v":2.2441346480788868E-2},169,null,29.925147999999997,22.169783999999996,null,18.444367,null,0.37999999999999989,null,{"$f":"ROUND((T96*$BF$2)+$BE96-AZ96,2)","v":0.31},{"$f":"ROUND((U96*$BF$2)+$BE96-BA96,2)","v":0.49},null,{"$f":"ROUND((W96*$BF$2)+$BE96-BC96,2)","v":0.47},null,null,0,30.524056999999996,22.809296999999997,0,18.972218999999999,null,0,0.59890899999999903,0.63951300000000089,0,0.52785199999999932]
[null,2,"045",415,61,null,"045415",null,"Single Light Emitting Diode (LED)","Standard / Dusk to Dawn (046)","248W","835T",0,39,0,0,0,0,0,{"$f":"T96-T105","v":21.95},null,0,null,null,{"$f":"IF(AND(M97<>0,S97=0),#VALUE!,M97*S97)","v":0},{"$f":"IF(AND(N97<>0,T97=0),#VALUE!,N97*T97)","v":856.05},0,0,0,null,{"$f":"M97","v":0},{"$f":"N97","v":39},{"$f":"O97","v":0},{"$f":"P97","v":0},{"$f":"Q97","v":0},null,{"$f":"ROUND(S97*(1+AK$1),2)","v":0},{"$f":"AL96-AL105","v":22.61},0,0,0,null,0,881.79,0,0,0,{"$f":"SUM(AR97)-SUM(Z97)","v":25.740000000000009},3.0068337129840559E-2,83,null,21.885556000000001,null,null,null,null,{"$f":"ROUND(AX97*$BE$2,2)+ROUND(AX97*$BE$1,2)","v":0.18999999999999995},null,0.59,null,null,null,null,null,0,22.951410999999997,{"$f":"AM97*$BM$1","v":0},{"$f":"AN97*$BM$1","v":0},{"$f":"AO97*$BM$1","v":0},null,{"$f":"BM97-AY97","v":0},{"$f":"BN97-AZ97","v":1.0658549999999956},{"$f":"BO97-BA97","v":0},{"$f":"BP97-BB97","v":0},{"$f":"BQ97-BC97","v":0}]
[null,2,"045",419,16,null,{"$f":"IF(OR(ISBLANK(C98),ISBLANK(D98)),\"\",TEXT(C98,\"000\")&TEXT(D98,\"000\"))","v":"045419"},null,"Single Light Emitting Diode (LED)","Standard / Dusk to Dawn (046)","248W","835L",0,12,0,0,0,0,0,{"$f":"T96","v":29.41},0,0,null,null,null,{"$f":"IF(AND(N98<>0,T98=0),#VALUE!,N98*T98)","v":352.92},0,0,0,null,{"$f":"SUMIF($G:$G,TEXT(AE$3,\"000\")&TEXT($L98,\"000\"),$E:$E)","v":0},{"$f":"SUMIF($G:$G,TEXT(AF$3,\"000\")&TEXT($L98,\"000\"),$E:$E)","v":12},{"$f":"SUMIF($G:$G,TEXT(AG$3,\"000\")&TEXT($L98,\"000\"),$E:$E)","v":0},{"$f":"SUMIF($G:$G,TEXT(AH$3,\"000\")&TEXT($L98,\"000\"),$E:$E)","v":0},{"$f":"SUMIF($G:$G,TEXT(AI$3,\"000\")&TEXT($L98,\"000\"),$E:$E)","v":0},null,{"$f":"ROUND(S98*(1+AK$1),2)","v":0},{"$f":"AL96","v":30.07},{"$f":"ROUND(U98*(1+AM$1),2)","v":0},{"$f":"ROUND(V98*(1+AN$1),2)","v":0},{"$f":"ROUND(W98*(1+AO$1),2)","v":0},null,0,360.84000000000003,0,0,0,{"$f":"SUM(AR98)-SUM(Z98)","v":7.9200000000000159},2.2441346480788892E-2]
[null,2,"045",515,1,null,{"$f":"IF(OR(ISBLANK(C99),ISBLANK(D99)),\"\",TEXT(C99,\"000\")&TEXT(D99,\"000\"))","v":"045515"},null,"Single Light Emitting Diode (LED)","Developer Contributed","248W","836T",0,0,0,0,0,{"$f":"IF(SUM(M99:Q99)>0,0,1)","v":1},0,{"$f":"T151-T105","v":30.14},0,0,0,null,{"$f":"IF(AND(M99<>0,S99=0),#VALUE!,M99*S99)","v":0},{"$f":"IF(AND(N99<>0,T99=0),#VALUE!,N99*T99)","v":0},0,0,0,null,{"$f":"M99","v":0},{"$f":"N99","v":0},{"$f":"O99","v":0},{"$f":"P99","v":0},{"$f":"Q99","v":0},null,{"$f":"ROUND(S99*(1+AK$1),2)","v":0},{"$f":"AL151-AL105","v":30.990000000000002},{"$f":"ROUND(U99*(1+AM$1),2)","v":0},{"$f":"ROUND(V99*(1+AN$1),2)","v":0},{"$f":"ROUND(W99*(1+AO$1),2)","v":0},null,0,{"$f":"IF(AND(AF99<>0,AL99=0),#VALUE!,AF99*AL99)","v":0},0,0,0,0,{"$error":"#DIV/0!"},83,null,28.981104999999992,null,null,null,null,{"$f":"ROUND(AX99*$BE$2,2)+ROUND(AX99*$BE$1,2)","v":0.18999999999999995},null,{"$f":"ROUND((T99*$BF$2)+$BE99-AZ99,2)","v":1.8},null,null,null,null,null,{"$f":"AK99*$BM$1","v":0},{"$f":"AL99*$BM$1","v":31.457948999999999},{"$f":"AM99*$BM$1","v":0},{"$f":"AN99*$BM$1","v":0},{"$f":"AO99*$BM$1","v":0},null,{"$f":"BM99-AY99","v":0},{"$f":"BN99-AZ99","v":2.4768440000000069},{"$f":"BO99-BA99","v":0},{"$f":"BP99-BB99","v":0},{"$f":"BQ99-BC99","v":0}]
[null,2,"045",615,87,null,"045615",null,"Double High-Pressure Sodium Vapor","Pedestal Base","400W",842,0,2,0,0,0,0,0,98.54,0,0,0,null,0,197.08,0,0,0,null,0,2,0,0,0,null,0,{"$f":"ROUND(T100*(1+AL$1),2)","v":100.76},0,0,0,null,0,201.52,0,0,0,4.4399999999999977,2.2528922265070011E-2,338,null,100.25127599999999,null,null,null,null,0.75,null,0.53,null,null,null,null,null,0,102.281476,0,0,0,null,0,2.0302000000000078,0,0,0]
[null,2,"045",618,87,null,{"$f":"IF(OR(ISBLANK(C101),ISBLANK(D101)),\"\",TEXT(C101,\"000\")&TEXT(D101,\"000\"))","v":"045618"},null,"Double High-Pressure Sodium Vapor","No Pole","400W",845,0,0,1,0,0,{"$f":"IF(SUM(M101:Q101)>0,0,1)","v":0},0,0,41.14,0,0,null,{"$f":"IF(AND(M101<>0,S101=0),#VALUE!,M101*S101)","v":0},0,41.14,0,0,null,0,0,1,0,0,null,0,{"$f":"ROUND(T101*(1+AL$1),2)","v":0},42.12,0,0,null,0,0,42.12,0,0,0,{"$error":"#DIV/0!"},338,null,null,41.568345000000001,null,null,null,0.75,null,null,{"$f":"ROUND((U101*$BF$2)+$BE101-BA101,2)","v":0.94},null,null,null,null,0,0,42.756011999999991,0,0,null,0,0,1.1876669999999905,0,0]
[null,2,"045",715,6,null,"045715",null,"Single High-Pressure Sodium Vapor","Dust to Dawn (046)","150W",935,0,0,0,0,59,0,0,0,0,0,7.39,null,{"$f":"IF(AND(M102<>0,S102=0),#VALUE!,M102*S102)","v":0},0,0,0,436.01,null,0,0,0,0,59,null,{"$f":"ROUND(S102*(1+AK$1),2)","v":0},0,0,0,7.57,null,0,0,0,0,446.63,0,{"$error":"#DIV/0!"},62,null,null,null,null,7.4711359999999996,null,0.13,null,null,null,null,{"$f":"ROUND((W102*$BF$2)+$BE102-BC102,2)","v":0.16},null,null,0,0,0,0,7.6843069999999996,null,0,0,0,0,0.213171]
[null,null,null,null,{"$f":"SUM(E97:E102)","v":258},null,"",null,"TIB Capital Offset",null,"70W",null,null,null,null,null,null,null,null,4.92,null,0,0,null,null,null,null,null,null,null,null,null,null,null,null,null,null,{"$f":"ROUND(T103,2)","v":4.92},null,null,null,null,0,null,null,null,null,null,null,null,null,null,5.3089729999999999,null,null,null,null,null,null,null,null,null,null,null,null,null,{"$f":"AL103*$BM$1","v":4.9942919999999997},null,null,null,null,null,-0.31468100000000021]
[null,null,null,null,null,null,"",null,"TIB Capital Offset",null,"107W",null,null,null,null,null,null,null,null,5.21,null,0,0,null,null,null,null,null,null,null,null,null,null,null,null,null,null,{"$f":"ROUND(T104,2)","v":5.21},null,null,null,null,0,null,null,null,null,null,null,null,null,null,5.6135029999999997,null,null,null,null,null,null,null,null,null,null,null,null,null,{"$f":"AL104*$BM$1","v":5.288670999999999},null,null,null,null,null,-0.32483200000000068]
[null,2,"046","005L",0,null,"046005L",null,"TIB Capital Offset",null,"248W",null,null,null,null,null,null,null,0,7.46,null,0,0,null,null,null,null,null,null,null,null,null,null,null,null,null,0,{"$f":"ROUND(T105,2)","v":7.46},null,{"$f":"ROUND(V105*(1+AN$1),2)","v":0},0,null,null,null,null,null,null,{"$f":"SUM(AQ105:AU105)-SUM(Y105:AC105)","v":0},null,null,null,null,8.039591999999999,null,null,null,null,null,null,null,null,null,null,null,{"$f":"AK105*$BM$1","v":0},{"$f":"#REF!*$BM$1","v":{"$error":"#REF!"}},{"$f":"AL105*$BM$1","v":7.5726459999999989},0,0,null,null,null,-0.46694600000000008]
[null,2,"046","015L",42,null,"046015L",null,null,null,"Total",null,{"$f":"SUM(M4:M105)","v":7},{"$f":"SUM(N4:N105)","v":22589},{"$f":"SUM(O4:O105)","v":159},{"$f":"SUM(P4:P105)","v":258},{"$f":"SUM(Q4:Q105)","v":906},null,0,0,0,0,0,null,{"$f":"ROUND(SUM(Y4:Y105),2)","v":194.43},{"$f":"ROUND(SUM(Z4:Z105),2)","v":379269.46},{"$f":"ROUND(SUM(AA4:AA105),2)","v":2045.34},{"$f":"ROUND(SUM(AB4:AB105),2)","v":2919.2},{"$f":"ROUND(SUM(AC4:AC105),2)","v":8347.69},null,{"$f":"SUM(AE4:AE105)","v":7},{"$f":"SUM(AF4:AF105)","v":22589},{"$f":"SUM(AG4:AG105)","v":159},{"$f":"SUM(AH4:AH105)","v":258},{"$f":"SUM(AI4:AI105)","v":906},null,0,0,{"$f":"ROUND(U106*(1+AM$1),2)","v":0},0,0,null,{"$f":"ROUND(SUM(AQ4:AQ105),2)","v":199.04},{"$f":"ROUND(SUM(AR4:AR105),2)","v":388507.18},{"$f":"ROUND(SUM(AS4:AS105),2)","v":2094.1999999999998},{"$f":"ROUND(SUM(AT4:AT105),2)","v":2989.14},{"$f":"ROUND(SUM(AU4:AU105),2)","v":8544.81},null,null,null,null,null,null,null,null,null,null,null,null,null,null,null,null,null,0,{"$f":"AL106*$BM$1","v":0},0,0,0]
[null,2,"046","025L",45,null,"046025L",null,"All light codes notated with a \"T\" are not on the tariff sheets.",null,null,null,null,null,null,null,{"$f":"SUM(M106:Q106)","v":23919},null,0,0,0,0,0,null,null,null,null,null,null,null,null,null,null,null,{"$f":"SUM(AE106:AI106)","v":23919},null,0,0,0,0,0,null,null,null,null,null,{"$f":"SUM(AQ106:AU106)","v":402334.37},null,null,null,null,null,null,null,null,null,null,null,null,null,null,null,null,null,0,0,0,0,0]
[null,2,"046","035L",0,null,"046035L",null,null,null,null,null,null,null,null,null,{"$f":"ROUND(Q107-E140,0)","v":0},null,0,0,0,0,0,null,null,null,null,null,{"$f":"SUM(Y106:AC106)","v":392776.12000000005},null,null,null,null,null,{"$f":"AI107-Q107","v":0},null,null,0,0,0,0,null,null,null,null,null,{"$f":"AU107/AC108-1","v":2.4335109782132269E-2},null,null,null,null,null,null,null,null,null,null,null,null,null,null,null,null,null,{"$f":"X108*$BM$1","v":0},0,0,0,0]
[null,2,"046","045L",0,null,"046045L",null,null,null,null,null,null,null,null,null,null,null,null,null,null,null,null,null,null,null,null,null,null,null,null,null,null,null,null,null,0,0,0,0,0,null,null,null,null,null,null,null,null,null,null,null,null,null,null,null,null,null,null,null,null,null,null,null,0,0,0,0,0]
[null,2,"046","055L",0,null,"046055L",null,"no customer count - taken out of exhibit to limit print range",null,null,null,null,null,null,null,null,null,0,0,0,0,0,null,{"$f":"Y106-Y107","v":194.43},{"$f":"Z106-Z107","v":379269.46},2045.34,2919.2,8347.69,null,null,null,null,null,null,null,0,0,0,0,0,null,null,null,null,null,null,null,null,null,null,null,null,null,null,null,null,null,null,null,null,null,null,null,0,0,0,0,0]
[null,2,"046","065L",3,null,"046065L",null,"Single High-Pressure Sodium Vapor","Dusk to 1 AM (046)","100W",439,{"$f":"SUMIF($G:$G,TEXT(M$3,\"000\")&TEXT($L111,\"000\"),$E:$E)","v":0},{"$f":"SUMIF($G:$G,TEXT(N$3,\"000\")&TEXT($L111,\"000\"),$E:$E)","v":0},{"$f":"SUMIF($G:$G,TEXT(O$3,\"000\")&TEXT($L111,\"000\"),$E:$E)","v":0},{"$f":"SUMIF($G:$G,TEXT(P$3,\"000\")&TEXT($L111,\"000\"),$E:$E)","v":0},{"$f":"SUMIF($G:$G,TEXT(Q$3,\"000\")&TEXT($L111,\"000\"),$E:$E)","v":0},{"$f":"IF(SUM(M111:Q111)>0,0,1)","v":1},null,null,null,null,null,null,null,null,null,null,null,null,null,{"$f":"SUMIF($G:$G,TEXT(AF$3,\"000\")&TEXT($L111,\"000\"),$E:$E)","v":0},{"$f":"SUMIF($G:$G,TEXT(AG$3,\"000\")&TEXT($L111,\"000\"),$E:$E)","v":0},{"$f":"SUMIF($G:$G,TEXT(AH$3,\"000\")&TEXT($L111,\"000\"),$E:$E)","v":0},{"$f":"SUMIF($G:$G,TEXT(AI$3,\"000\")&TEXT($L111,\"000\"),$E:$E)","v":0},null,0,0,0,0,0,null,null,null,null,null,null,null,null,null,null,null,null,null,null,null,null,null,null,null,null,null,null,null,0,0,0,0,0,null,0,0,0,0,0]
[null,2,"046","075L",0,null,"046075L"]
[null,2,"046","085L",0,null,"046085L",null,"Double High-Pressure Sodium Vapor","Direct Burial","100W",443,{"$f":"SUMIF($G:$G,TEXT(M$3,\"000\")&TEXT($L113,\"000\"),$E:$E)","v":0},0,0,0,0,{"$f":"IF(SUM(M113:Q113)>0,0,1)","v":1},null,null,null,null,null,null,null,null,null,null,null,null,null,{"$f":"SUMIF($G:$G,TEXT(AF$3,\"000\")&TEXT($L113,\"000\"),$E:$E)","v":0},0,0,0,null,0,null,{"$f":"ROUND(U113*(1+AM$1),2)","v":0},0,0,null,null,null,null,null,null,null,null,null,null,null,null,null,null,null,null,null,null,null,null,null,null,null,{"$f":"AK113*$BM$1","v":0},{"$f":"AL113*$BM$1","v":0},0,0,0,null,0,0,0,0,0]
[null,2,"046","095L",0,null,"046095L",null,"Double High-Pressure Sodium Vapor","Developer Contributed","100W",446,0,0,0,0,0,{"$f":"IF(SUM(M114:Q114)>0,0,1)","v":1},null,null,null,null,null,null,null,null,null,null,null,null,null,0,0,0,0,null,0,null,0,0,0,null,null,null,null,null,null,null,null,null,null,null,null,null,null,null,null,null,null,null,null,null,null,null,0,0,0,0,0,null,0,0,0,0,0]
[null,2,"046","105L",8,null,"046105L",null,"Single Mercury Vapor","Wood Pole",10000,511,0,0,0,0,0,null,null,0,0,0,0,null,null,null,null,null,null,null,{"$f":"M115","v":0},0,0,0,0,null,{"$f":"ROUND(S115*(1+AK$1),2)","v":0},0,0,0,0,null,{"$f":"IF(AND(AE115<>0,AK115=0),#VALUE!,AE115*AK115)","v":0},0,0,0,0,{"$f":"SUM(AQ115:AU115)-SUM(Y115:AC115)","v":0},null,111,20.88,null,null,null,null,null,{"$f":"ROUND(AX115*$BE$2,2)+ROUND(AX115*$BE$1,2)","v":0.25},{"$f":"ROUND((S115*$BF$2)+$BE115-AY115,2)","v":-20.63},null,null,null,null,null,null,{"$f":"AK115*$BM$1","v":0},0,{"$f":"AM115*$BM$1","v":0},0,0,null,{"$f":"BM115-AY115","v":-20.88},0,0,0,0]
[null,2,"046","115L",0,null,"046115L",null,"Double High-Pressure Sodium Vapor","Standard","100W",441,0,0,0,0,0,{"$f":"IF(SUM(M116:Q116)>0,0,1)","v":1},0,null,null,0,0,null,{"$f":"IF(AND(M116<>0,S116=0),#VALUE!,M116*S116)","v":0},{"$f":"IF(AND(N116<>0,T116=0),#VALUE!,N116*T116)","v":0},{"$f":"IF(AND(O116<>0,U116=0),#VALUE!,O116*U116)","v":0},{"$f":"IF(AND(P116<>0,V116=0),#VALUE!,P116*V116)","v":0},{"$f":"IF(AND(Q116<>0,W116=0),#VALUE!,Q116*W116)","v":0},null,0,0,0,0,0,null,0,0,0,0,0,null,0,0,0,0,0,{"$f":"SUM(AQ116:AU116)-SUM(Y116:AC116)","v":0},null,80,null,29.57,14.19,null,null,null,0.18000000000000016,null,{"$f":"ROUND((T116*$BF$2)+$BE116-AZ116,2)","v":-29.39},{"$f":"ROUND((U116*$BF$2)+$BE116-BA116,2)","v":-14.01},null,null,null,null,0,0,0,0,0,null,0,-29.57,-14.19,0,0]
[null,2,"046","125L",97,null,"046125L",null,"Double High-Pressure Sodium Vapor","Pedestal Base","100W",442,0,0,0,0,0,1,0,null,0,0,0,null,null,{"$f":"IF(AND(N117<>0,T117=0),#VALUE!,N117*T117)","v":0},null,null,{"$f":"IF(AND(Q117<>0,W117=0),#VALUE!,Q117*W117)","v":0},null,{"$f":"SUMIF($G:$G,TEXT(AE$3,\"000\")&TEXT($L117,\"000\"),$E:$E)","v":0},{"$f":"SUMIF($G:$G,TEXT(AF$3,\"000\")&TEXT($L117,\"000\"),$E:$E)","v":0},{"$f":"SUMIF($G:$G,TEXT(AG$3,\"000\")&TEXT($L117,\"000\"),$E:$E)","v":0},{"$f":"SUMIF($G:$G,TEXT(AH$3,\"000\")&TEXT($L117,\"000\"),$E:$E)","v":0},{"$f":"SUMIF($G:$G,TEXT(AI$3,\"000\")&TEXT($L117,\"000\"),$E:$E)","v":0},null,0,0,0,0,0,null,null,{"$f":"IF(AND(AF117<>0,AL117=0),#VALUE!,AF117*AL117)","v":0},null,null,null,null,null,80,null,41.39,null,null,null,null,0.18000000000000016,null,{"$f":"ROUND((T117*$BF$2)+$BE117-AZ117,2)","v":-41.21},null,null,null,null,null,0,0,0,0,0,null,0,-41.39,0,0,0]
[null,2,"046","135L",36,null,"046135L",null,"Single High-Pressure Sodium Vapor","Pedestal Base","200W",522,0,0,0,0,0,1,0,null,0,0,0,null,{"$f":"IF(AND(M118<>0,S118=0),#VALUE!,M118*S118)","v":0},0,{"$f":"IF(AND(O118<>0,U118=0),#VALUE!,O118*U118)","v":0},0,0,null,{"$f":"M118","v":0},0,0,0,0,null,0,0,0,0,0,null,{"$f":"IF(AND(AE118<>0,AK118=0),#VALUE!,AE118*AK118)","v":0},0,{"$f":"IF(AND(AG118<>0,AM118=0),#VALUE!,AG118*AM118)","v":0},{"$f":"IF(AND(AH118<>0,AN118=0),#VALUE!,AH118*AN118)","v":0},{"$f":"IF(AND(AI118<>0,AO118=0),#VALUE!,AI118*AO118)","v":0},{"$f":"SUM(AQ118:AU118)-SUM(Y118:AC118)","v":0},null,85,null,59.82,null,null,null,null,0.17999999999999994,null,{"$f":"ROUND((T118*$BF$2)+$BE118-AZ118,2)","v":-59.64},null,null,null,null,null,0,0,0,0,0,null,0,-59.82,0,0,0]
[null,2,"046","145L",0,null,"046145L",null,"Single High-Pressure Sodium Vapor (Capital Only)","Direct Burial","200W",538,0,0,0,0,0,1,0,null,0,0,0,null,0,0,0,0,0,null,0,0,0,0,0,null,0,0,0,0,0,null,0,0,0,0,0,null,null,85,null,24.3,null,null,null,null,0.17999999999999994,null,{"$f":"ROUND((T119*$BF$2)+$BE119-AZ119,2)","v":-24.12},null,null,null,null,null,0,0,0,0,0,null,0,-24.3,0,0,0]
[null,2,"046","155L",0,null,"046155L",null,"Double High-Pressure Sodium Vapor","Pedestal Base","200W",542,0,0,0,0,0,1,0,null,null,0,0,null,0,0,0,0,0,null,0,0,0,0,0,null,0,0,0,0,0,null,0,0,0,0,0,{"$f":"SUM(AQ120:AU120)-SUM(Y120:AC120)","v":0},null,170,null,61.09,23.76,null,null,null,0.38000000000000012,null,{"$f":"ROUND((T120*$BF$2)+$BE120-AZ120,2)","v":-60.71},{"$f":"ROUND((U120*$BF$2)+$BE120-BA120,2)","v":-23.38},null,null,null,null,0,0,0,0,0,null,0,-61.09,-23.76,0,0]
[null,2,"046","165L",0,null,"046165L",null,"Mercury Vapor","Dusk to 1 AM",55000,819,0,0,0,0,0,1,0,null,0,null,0,null,0,0,0,0,0,null,0,0,0,0,0,null,0,0,0,0,0,null,0,0,0,0,0,{"$f":"SUM(AQ121:AU121)-SUM(Y121:AC121)","v":0},null,417,null,null,null,28.89,null,null,0.91999999999999993,null,null,null,{"$f":"ROUND((V121*$BF$2)+$BE121-BB121,2)","v":-27.97},null,null,null,0,0,0,0,0,null,0,0,0,-28.89,0]
[null,2,"046","175L",0,null,"046175L",null,"Single High-Pressure Sodium Vapor","Developer Contributed","400W",836,0,0,0,0,0,1,0,null,0,0,0,null,0,0,0,0,0,null,0,0,0,0,0,null,0,0,0,0,0,null,0,0,0,0,0,{"$f":"SUM(AQ122:AU122)-SUM(Y122:AC122)","v":0},null,169,null,37.39,null,null,null,null,0.37999999999999989,null,{"$f":"ROUND((T122*$BF$2)+$BE122-AZ122,2)","v":-37.01},null,null,null,null,null,0,0,0,0,0,null,0,-37.39,0,0,0]
[null,2,"046","185L",0,null,"046185L",null,"Single Light Emitting Diode (LED)","Standard","70W","431L",{"$f":"SUMIF($G:$G,TEXT(M$3,\"000\")&TEXT($L123,\"000\"),$E:$E)","v":0},5337,0,0,0,0,0,{"$f":"T33","v":14.9},0,null,null,null,0,79521.3,{"$f":"IF(AND(O123<>0,U123=0),#VALUE!,O123*U123)","v":0},0,0,null,{"$f":"SUMIF($G:$G,TEXT(AE$3,\"000\")&TEXT($L123,\"000\"),$E:$E)","v":0},{"$f":"SUMIF($G:$G,TEXT(AF$3,\"000\")&TEXT($L123,\"000\"),$E:$E)","v":5337},{"$f":"SUMIF($G:$G,TEXT(AG$3,\"000\")&TEXT($L123,\"000\"),$E:$E)","v":0},{"$f":"SUMIF($G:$G,TEXT(AH$3,\"000\")&TEXT($L123,\"000\"),$E:$E)","v":0},{"$f":"SUMIF($G:$G,TEXT(AI$3,\"000\")&TEXT($L123,\"000\"),$E:$E)","v":0},null,{"$f":"ROUND(S123*(1+AK$1),2)","v":0},{"$f":"AL33","v":15.24},{"$f":"ROUND(U123*(1+AM$1),2)","v":0},{"$f":"ROUND(V123*(1+AN$1),2)","v":0},{"$f":"ROUND(W123*(1+AO$1),2)","v":0},null,0,81335.88,0,0,0,null,null,26,null,null,null,null,null,null,0.06,null,15.18,null,null,null,null,null,0,15.470123999999998,0,0,0,null,0,15.470123999999998,0,0,0]
[null,2,"046","195L",0,null,"046195L",null,"Single Light Emitting Diode (LED)","Standard","70W","431T",0,1842,0,0,0,0,0,null,null,0,0,null,0,{"$error":"#VALUE!"},0,0,0,null,{"$f":"M124","v":0},{"$f":"N124","v":1842},{"$f":"O124","v":0},{"$f":"P124","v":0},{"$f":"Q124","v":0},null,0,null,0,0,0,null,0,{"$error":"#VALUE!"},0,0,0,{"$f":"SUM(AQ124:AU124)-SUM(Y124:AC124)","v":{"$error":"#VALUE!"}},null,26,null,null,null,null,null,null,0.06,null,0.06,null,null,null,null,null,0,0,0,0,0,null,0,0,0,0,0]
[null,2,"046","212L",8,null,"046212L",null,"Single Light Emitting Diode (LED)","Standard  ","107W","531L",0,1349,0,0,0,0,0,20.72,0,0,null,null,{"$f":"IF(AND(M125<>0,S125=0),#VALUE!,M125*S125)","v":0},27951.279999999999,0,0,0,null,{"$f":"SUMIF($G:$G,TEXT(AE$3,\"000\")&TEXT($L125,\"000\"),$E:$E)","v":0},{"$f":"SUMIF($G:$G,TEXT(AF$3,\"000\")&TEXT($L125,\"000\"),$E:$E)","v":1349},{"$f":"SUMIF($G:$G,TEXT(AG$3,\"000\")&TEXT($L125,\"000\"),$E:$E)","v":0},{"$f":"SUMIF($G:$G,TEXT(AH$3,\"000\")&TEXT($L125,\"000\"),$E:$E)","v":0},{"$f":"SUMIF($G:$G,TEXT(AI$3,\"000\")&TEXT($L125,\"000\"),$E:$E)","v":0},null,0,{"$f":"AL60","v":21.19},0,0,0,null,0,28585.31,0,0,0,null,null,39,null,null,null,null,null,null,8.0000000000000016E-2,null,21.11,null,null,null,null,null,0,21.509968999999998,{"$f":"AM125*$BM$1","v":0},0,0,null,{"$f":"BM125-AY125","v":0},21.509968999999998,0,0,0]
[null,2,"046","237L",{"$f":"30+30","v":60},null,"046237L",null,"Single Light Emitting Diode (LED)","Standard  ","107W","531T",0,474,0,0,0,0,0,null,null,0,0,null,0,{"$error":"#VALUE!"},0,0,0,null,{"$f":"M126","v":0},474,0,0,0,null,0,null,0,0,0,null,0,{"$error":"#VALUE!"},0,0,0,{"$f":"SUM(AQ126:AU126)-SUM(Y126:AC126)","v":{"$error":"#VALUE!"}},null,39,null,null,null,null,null,null,8.0000000000000016E-2,null,0.08,null,null,null,null,null,0,0,0,0,0,null,0,0,0,0,0]
[null,2,"046",335,8,null,{"$f":"IF(OR(ISBLANK(C127),ISBLANK(D127)),\"\",TEXT(C127,\"000\")&TEXT(D127,\"000\"))","v":"046335"},null,"Single High-Pressure Sodium Vapor","Standard  ","400W",831,0,14,0,0,0,0,0,null,null,0,0,null,{"$f":"IF(AND(M127<>0,S127=0),#VALUE!,M127*S127)","v":0},{"$error":"#VALUE!"},0,0,0,null,0,14,0,0,0,null,0,null,0,0,0,null,0,{"$error":"#VALUE!"},0,0,0,{"$f":"SUM(AQ127:AU127)-SUM(Y127:AC127)","v":{"$error":"#VALUE!"}},null,169,null,null,22.17,null,null,null,0.37999999999999989,null,0.38,{"$f":"ROUND((U127*$BF$2)+$BE127-BA127,2)","v":-21.79},null,null,null,null,0,0,0,0,0,null,{"$f":"BM127-AY127","v":0},0,-22.17,0,0]
[null,2,"046","295L",0,null,{"$f":"IF(OR(ISBLANK(C128),ISBLANK(D128)),\"\",TEXT(C128,\"000\")&TEXT(D128,\"000\"))","v":"046295L"},null,"Single Light Emitting Diode (LED)","Standard  ","248W","831T",0,39,0,0,0,0,0,null,null,0,0,null,0,{"$error":"#VALUE!"},0,0,0,null,0,39,0,0,0,null,0,null,0,0,0,null,0,{"$error":"#VALUE!"},0,0,0,{"$f":"SUM(AQ128:AU128)-SUM(Y128:AC128)","v":{"$error":"#VALUE!"}},null,83,null,null,null,null,null,null,0.18999999999999995,null,0.19,null,null,null,null,null,0,0,0,0,0,null,0,0,0,0,0]
[null,2,"046","395L",0,null,"046395L",null,"Single Light Emitting Diode (LED)","Standard  ","248W","831L",0,2,0,0,0,0,0,{"$f":"T127","v":0},0,0,null,null,null,{"$f":"IF(AND(N129<>0,T129=0),#VALUE!,N129*T129)","v":{"$error":"#VALUE!"}},0,0,0,null,{"$f":"SUMIF($G:$G,TEXT(AE$3,\"000\")&TEXT($L129,\"000\"),$E:$E)","v":0},{"$f":"SUMIF($G:$G,TEXT(AF$3,\"000\")&TEXT($L129,\"000\"),$E:$E)","v":2},{"$f":"SUMIF($G:$G,TEXT(AG$3,\"000\")&TEXT($L129,\"000\"),$E:$E)","v":0},{"$f":"SUMIF($G:$G,TEXT(AH$3,\"000\")&TEXT($L129,\"000\"),$E:$E)","v":0},{"$f":"SUMIF($G:$G,TEXT(AI$3,\"000\")&TEXT($L129,\"000\"),$E:$E)","v":0},null,0,{"$f":"AL127","v":0},0,0,0,null,0,{"$error":"#VALUE!"},0,0,0]
[null,2,"046",435,17,null,"046435",null,"Double Light Emitting Diode (LED)","Standard","107W","541T",0,0,0,0,0,1,0,{"$f":"T75-T104-T104","v":35.479999999999997},0,0,0,null,{"$f":"IF(AND(M130<>0,S130=0),#VALUE!,M130*S130)","v":0},0,0,0,0,null,{"$f":"M130","v":0},0,0,0,0,null,0,{"$f":"AL75-AL104-AL104","v":36.51},0,0,0,null,0,0,0,0,0,{"$f":"SUM(AQ130:AU130)-SUM(Y130:AC130)","v":0},null,78,null,35.47,null,null,null,null,{"$f":"ROUND(AX130*$BE$2,2)+ROUND(AX130*$BE$1,2)","v":0.18000000000000005},null,{"$f":"ROUND((T130*$BF$2)+$BE130-AZ130,2)","v":0.73},null,null,null,null,null,{"$f":"AK130*$BM$1","v":0},37.061300999999993,0,0,0,null,{"$f":"BM130-AY130","v":0},1.5913009999999943,0,0,0]
[null,2,"046",495,0,null,{"$f":"IF(OR(ISBLANK(C131),ISBLANK(D131)),\"\",TEXT(C131,\"000\")&TEXT(D131,\"000\"))","v":"046495"},null,"Decorative Sodium Vapor (Capital Only)","Direct Burial","Granville 100W",478,0,0,0,0,0,1,0,20.440000000000001,0,0,0,null,{"$f":"IF(AND(M131<>0,S131=0),#VALUE!,M131*S131)","v":0},0,0,0,0,null,0,0,0,0,0,null,0,{"$f":"ROUND(T131*(1+AL$1),2)","v":20.9},0,0,0,null,0,0,0,0,0,{"$f":"SUM(AQ131:AU131)-SUM(Y131:AC131)","v":0},null,null,null,19.7,null,null,null,null,{"$f":"ROUND(AX131*$BE$2,2)+ROUND(AX131*$BE$1,2)","v":0},null,{"$f":"ROUND((T131*$BF$2)+$BE131-AZ131,2)","v":1.05},null,null,null,null,null,0,21.215589999999995,0,0,0,null,0,1.515589999999996,0,0,0]
[null,2,"046",499,41,null,{"$f":"IF(OR(ISBLANK(C132),ISBLANK(D132)),\"\",TEXT(C132,\"000\")&TEXT(D132,\"000\"))","v":"046499"},null,"Single High-Pressure Sodium Vapor","Dusk to 1 AM (046)","200W",539,0,0,0,0,0,1,null,null,null,null,null,null,null,null,null,null,null,null,{"$f":"SUMIF($G:$G,TEXT(AE$3,\"000\")&TEXT($L132,\"000\"),$E:$E)","v":0},0,0,0,0,null,0,0,{"$f":"ROUND(U132*(1+AM$1),2)","v":0},{"$f":"ROUND(V132*(1+AN$1),2)","v":0},{"$f":"ROUND(W132*(1+AO$1),2)","v":0},null,null,null,null,null,null,null,null,null,null,null,null,null,null,null,null,null,null,null,null,null,null,null,{"$f":"AK132*$BM$1","v":0},{"$f":"AL132*$BM$1","v":0},0,0,0,null,0,0,0,0,0]
[null,2,"046",535,45,null,"046535",null,"Double High-Pressure Sodium Vapor","Direct Burial","200W",543,{"$f":"SUMIF($G:$G,TEXT(M$3,\"000\")&TEXT($L133,\"000\"),$E:$E)","v":0},0,0,0,0,1,null,null,null,null,null,null,null,null,null,null,null,null,0,0,0,0,0,null,0,0,0,0,0,null,null,null,null,null,null,null,null,null,null,null,null,null,null,null,null,null,null,null,null,null,null,null,0,0,0,0,0,null,0,0,0,0,0]
[null,2,"046",635,237,null,"046635",null,"Mercury Vapor","Dusk to 1 AM",20000,619,0,0,0,0,0,1,null,null,null,null,null,null,null,null,null,null,null,null,0,0,0,0,0,null,0,0,0,0,0,null,null,null,null,null,null,null,null,null,null,null,null,null,null,null,null,null,null,null,null,null,null,null,0,0,0,0,0,null,0,0,0,{"$f":"BP134-BB134","v":0},0]
[null,2,"046",735,184,null,"046735",null,"Single High-Pressure Sodium Vapor","Dusk to 1 AM (046)","250W",639,0,0,0,0,0,1,null,null,null,null,null,null,null,null,null,null,null,null,0,0,0,0,0,null,0,0,0,0,0,null,null,null,null,null,null,null,null,null,null,null,null,null,null,null,null,null,null,null,null,null,null,null,0,0,0,0,0,null,{"$f":"BM135-AY135","v":0},0,0,0,0]
[null,2,"046",835,16,null,"046835",null,"Double High-Pressure Sodium Vapor","Pedestal Base","250W",642,0,0,0,0,0,1,null,null,null,null,null,null,null,null,null,null,null,null,0,0,0,0,0,null,0,0,0,0,0,null,null,null,null,null,null,null,null,null,null,null,null,null,null,null,null,null,null,null,null,null,null,null,0,0,0,0,0,null,0,0,0,0,0]
[null,2,"046",935,59,null,"046935",null,"Single High-Pressure Sodium Vapor","Wood Pole","310W",731,0,0,0,0,0,1,null,null,null,null,null,null,null,null,null,null,null,null,0,0,0,0,0,null,0,0,0,0,0,null,null,null,null,null,null,null,null,null,null,null,null,null,null,null,null,null,null,null,null,null,null,null,0,0,0,0,0,null,0,0,0,0,0]
[null,null,null,null,{"$f":"SUM(E105:E137)","v":906},null,"",null,"Single High-Pressure Sodium Vapor","Direct Burial","310W",733,0,0,0,0,0,{"$f":"IF(SUM(M138:Q138)>0,0,1)","v":1},null,null,null,null,null,null,null,null,null,null,null,null,0,0,0,0,0,null,0,0,0,0,0,null,null,null,null,null,null,null,null,null,null,null,null,null,null,null,null,null,null,null,null,null,null,null,0,0,0,0,0,null,0,0,0,0,0]
[null,null,null,null,null,null,"",null,"Single High-Pressure Sodium Vapor","Dusk to 1 AM (046)","310W",739,0,0,0,0,0,1,null,null,null,null,null,null,null,null,null,null,null,null,0,0,0,0,0,null,0,0,0,0,0,null,null,null,null,null,null,null,null,null,null,null,null,null,null,null,null,null,null,null,null,null,null,null,0,0,0,0,0,null,{"$f":"BM139-AY139","v":0},0,0,0,0]
[null,2,null,null,{"$f":"E11+E79+E95+E103+E138","v":23919},null,null,null,"Double High-Pressure Sodium Vapor","Pedestal Base","310W",742,0,0,0,0,0,1,null,null,null,null,null,null,null,null,null,null,null,null,0,0,0,0,0,null,0,0,0,0,0,null,null,null,null,null,null,null,null,null,null,null,null,null,null,null,null,null,null,null,null,null,null,null,0,0,0,0,0,null,0,0,0,0,0]
[null,null,null,null,null,null,null,null,"Mercury Vapor","Dusk to Dawn",55000,815,0,0,0,0,0,1,null,null,null,null,null,null,null,null,null,null,null,null,0,0,0,0,0,null,0,0,0,0,0,null,null,null,null,null,null,null,null,null,null,null,null,null,null,null,null,null,null,null,null,null,null,null,0,0,0,0,0,null,0,0,0,0,0]
[null,null,null,"Street Light Summary total, WA",{"$f":"884+258+200+22566+11","v":23919},null,null,null,"Single High-Pressure Sodium Vapor","Direct Burial","400W",833,0,0,0,0,0,1,null,null,null,null,null,null,null,null,null,null,null,null,0,0,0,0,0,null,0,0,0,0,0,null,null,null,null,null,null,null,null,null,null,null,null,null,null,null,null,null,null,null,null,null,null,null,0,0,0,0,0,null,0,0,0,0,0]
[null,null,null,"Area Light Count, WA",{"$f":"5456+3974","v":9430},null,null,null,"Decorative Light Emitting Diode (LED)","No Pole","Kim Light 70W","438L",0,0,0,0,0,{"$f":"IF(SUM(M143:Q143)>0,0,1)","v":1},0,null,0,null,null,null,null,null,null,null,null,null,0,0,0,0,0,null,{"$f":"ROUND(S143*(1+AK$1),2)","v":0},null,{"$f":"ROUND(U143*(1+AM$1),2)","v":0},{"$f":"ROUND(V143*(1+AN$1),2)","v":0},{"$f":"ROUND(W143*(1+AO$1),2)","v":0},null,null,null,null,null,null,null,null,26,null,0,null,null,null,null,{"$f":"ROUND(AX143*$BE$2,2)+ROUND(AX143*$BE$1,2)","v":0.06},null,{"$f":"ROUND((T143*$BF$2)+$BE143-AZ143,2)","v":0.06},null,null,null,null,null,{"$f":"AK143*$BM$1","v":0},{"$f":"AL143*$BM$1","v":0},{"$f":"AM143*$BM$1","v":0},{"$f":"AN143*$BM$1","v":0},{"$f":"AO143*$BM$1","v":0},null,{"$f":"BM143-AY143","v":0},{"$f":"BN143-AZ143","v":0},{"$f":"BO143-BA143","v":0},{"$f":"BP143-BB143","v":0},{"$f":"BQ143-BC143","v":0}]
[null,null,null,null,{"$f":"E142+E143","v":33349},null,null,null,"Double Light Emitting Diode (LED)","Developer Contributed","107W","546L",null,null,null,null,null,null,null,50.34,null,null,null,null,null,null,null,null,null,null,null,null,null,null,null,null,null,{"$f":"ROUND(T144*(1+AL$1),2)","v":51.47}]
[null,null,null,null,{"$f":"E140+'Area Lts'!E98-E144","v":0},null,null,null,"Single Light Emitting Diode (LED)","Pedestal Base","107W","522L",{"$f":"SUMIF($G:$G,TEXT(M$3,\"000\")&TEXT($L145,\"000\"),$E:$E)","v":0},0,0,0,0,{"$f":"IF(SUM(M145:Q145)>0,0,1)","v":1},0,63.15,0,null,null,null,null,null,null,null,null,null,{"$f":"SUMIF($G:$G,TEXT(AE$3,\"000\")&TEXT($L145,\"000\"),$E:$E)","v":0},0,0,0,0,null,{"$f":"ROUND(S145*(1+AK$1),2)","v":0},{"$f":"ROUND(T145*(1+AL$1),2)","v":64.569999999999993},{"$f":"ROUND(U145*(1+AM$1),2)","v":0},0,0,null,null,null,null,null,null,null,null,39,null,64.245678999999996,null,null,null,null,{"$f":"ROUND(AX145*$BE$2,2)+ROUND(AX145*$BE$1,2)","v":8.0000000000000016E-2},null,{"$f":"ROUND((T145*$BF$2)+$BE145-AZ145,2)","v":-0.06},null,null,null,null,null,{"$f":"AK145*$BM$1","v":0},65.545006999999984,0,0,0,null,{"$f":"BM145-AY145","v":0},1.2993279999999885,0,0,0]
[null,null,null,null,null,null,null,null,"Double Light Emitting Diode (LED)","Pedestal Base","70W","442L",0,0,0,0,0,1,0,43.36,0,0,null,null,null,null,null,null,null,null,0,0,0,0,0,null,0,{"$f":"ROUND(T146*(1+AL$1),2)","v":44.34},0,0,0,null,null,null,null,null,null,null,null,{"$f":"26+26","v":52},null,44.116245999999997,null,null,null,null,{"$f":"ROUND(AX146*$BE$2,2)+ROUND(AX146*$BE$1,2)","v":0.10999999999999999},null,{"$f":"ROUND((T146*$BF$2)+$BE146-AZ146,2)","v":0.01},null,null,null,null,null,0,45.009534000000002,0,0,0,null,0,0.89328800000000541,0,0,0]
[null,null,null,null,null,null,null,null,"Decorative Light Emitting Diode (LED)","No Pole","70W","475L",0,0,0,0,0,1,0,21,0,0,null,null,null,null,null,null,null,null,0,0,0,0,0,null,0,{"$f":"AL158","v":22.67},0,0,0,null,null,null,null,null,null,null,null,26,null,21.367854999999999,null,null,null,null,{"$f":"ROUND(AX147*$BE$2,2)+ROUND(AX147*$BE$1,2)","v":0.06},null,{"$f":"ROUND((T147*$BF$2)+$BE147-AZ147,2)","v":0.01},null,null,null,null,null,0,23.012316999999999,0,0,0,null,0,1.6444620000000008,0,0,0]
[null,null,null,null,null,null,null,null,"LED (Dusk to Dawn)","Dusk to Dawn","18W","295L",0,0,0,0,0,1,0,0,0,0,null,null,{"$f":"IF(AND(M148<>0,S148=0),#VALUE!,M148*S148)","v":0},{"$f":"IF(AND(N148<>0,T148=0),#VALUE!,N148*T148)","v":0},{"$f":"IF(AND(O148<>0,U148=0),#VALUE!,O148*U148)","v":0},{"$f":"IF(AND(P148<>0,V148=0),#VALUE!,P148*V148)","v":0},{"$f":"IF(AND(Q148<>0,W148=0),#VALUE!,Q148*W148)","v":0},null,0,0,0,0,0,null,0,null,0,0,0,null,{"$f":"IF(AND(AE148<>0,AK148=0),#VALUE!,AE148*AK148)","v":0},{"$f":"IF(AND(AF148<>0,AL148=0),#VALUE!,AF148*AL148)","v":0},{"$f":"IF(AND(AG148<>0,AM148=0),#VALUE!,AG148*AM148)","v":0},{"$f":"IF(AND(AH148<>0,AN148=0),#VALUE!,AH148*AN148)","v":0},{"$f":"IF(AND(AI148<>0,AO148=0),#VALUE!,AI148*AO148)","v":0},null,null,6,null,null,null,null,null,null,{"$f":"ROUND(AX148*$BE$2,2)+ROUND(AX148*$BE$1,2)","v":9.999999999999995E-3},null,null,null,null,{"$f":"ROUND((W148*$BF$2)+$BE148-BC148,2)","v":0.01},null,null,0,0,0,0,0,null,0,0,0,0,{"$f":"BQ148-BC148","v":0}]
[null,null,null,null,null,null,null,null,"LED (Dusk to Dawn)","Dusk to Dawn","26W","395L",0,0,0,0,0,1,0,0,0,0,null,null,0,0,0,0,0,null,0,0,0,0,0,null,0,null,0,0,0,null,0,0,0,0,0,null,null,9,null,null,null,null,null,null,2.0000000000000004E-2,null,null,null,null,{"$f":"ROUND((W149*$BF$2)+$BE149-BC149,2)","v":0.02},null,null,0,0,0,0,0,null,0,0,0,0,0]
[]
[null,null,null,null,null,null,null,null,"Single Light Emitting Diode (LED)","Developer Contributed","248W","836L",{"$f":"SUMIF($G:$G,TEXT(M$3,\"000\")&TEXT($L151,\"000\"),$E:$E)","v":0},0,0,0,0,1,0,37.6,0,0,null,null,null,null,null,null,null,null,{"$f":"SUMIF($G:$G,TEXT(AE$3,\"000\")&TEXT($L151,\"000\"),$E:$E)","v":0},0,0,0,0,null,0,{"$f":"ROUND(T151*(1+AL$1),2)","v":38.450000000000003},0,0,0,null,null,null,null,null,null,null,null,83,null,36.1,null,null,null,null,{"$f":"ROUND(AX151*$BE$2,2)+ROUND(AX151*$BE$1,2)","v":0.18999999999999995},null,{"$f":"ROUND((T151*$BF$2)+$BE151-AZ151,2)","v":2.2599999999999998}]
[null,null,null,null,null,null,null,null,"Double Light Emitting Diode (LED)","Pedestal Base","248W","842L",0,0,0,0,0,1,0,98.54,0,0,null,null,null,null,null,null,null,null,0,0,0,0,0,null,0,{"$f":"AL100","v":100.76},0,0,0,null,null,null,null,null,null,null,null,166,null,93.85,null,null,null,null,{"$f":"ROUND(AX152*$BE$2,2)+ROUND(AX152*$BE$1,2)","v":0.3600000000000001},null,{"$f":"ROUND((T152*$BF$2)+$BE152-AZ152,2)","v":6.54}]
[null,null,null,null,null,null,null,null,"LED (Dusk to Dawn)","Dusk to Dawn","18W","295L",0,0,0,0,0,{"$f":"IF(SUM(M153:Q153)>0,0,1)","v":1},0,0,0,0,0.73,null,{"$f":"IF(AND(M153<>0,S153=0),#VALUE!,M153*S153)","v":0},0,0,0,0,null,0,0,0,0,0,null,{"$f":"ROUND(S153*(1+AK$1),2)","v":0},null,{"$f":"ROUND(U153*(1+AM$1),2)","v":0},0,0.75,null,{"$f":"IF(AND(AE153<>0,AK153=0),#VALUE!,AE153*AK153)","v":0},0,0,0,0,{"$f":"SUM(AR153)-SUM(Z153)","v":0},{"$f":"AV153/Z153","v":{"$error":"#DIV/0!"}},6,null,null,null,null,null,null,{"$f":"ROUND(AX153*$BE$2,2)+ROUND(AX153*$BE$1,2)","v":9.999999999999995E-3},null,null,null,null,{"$f":"ROUND((W153*$BF$2)+$BE153-BC153,2)","v":0.75},null,null,{"$f":"AK153*$BM$1","v":0},{"$f":"AL153*$BM$1","v":0},{"$f":"AM153*$BM$1","v":0},{"$f":"AN153*$BM$1","v":0},{"$f":"AO153*$BM$1","v":0.76132499999999992},null,{"$f":"BM153-AY153","v":0},{"$f":"BN153-AZ153","v":0},{"$f":"BO153-BA153","v":0},{"$f":"BP153-BB153","v":0},{"$f":"BQ153-BC153","v":0.76132499999999992}]
[null,null,null,null,null,null,null,null,"LED (Dusk to Dawn)","Dusk to Dawn","26W","395L",0,0,0,0,0,{"$f":"IF(SUM(M154:Q154)>0,0,1)","v":1},0,0,0,0,1.1100000000000001,null,0,0,0,0,0,null,0,0,0,0,0,null,{"$f":"ROUND(S154*(1+AK$1),2)","v":0},null,0,0,1.1399999999999999,null,0,0,0,0,0,{"$f":"SUM(AR154)-SUM(Z154)","v":0},{"$f":"AV154/Z154","v":{"$error":"#DIV/0!"}},9,null,null,null,null,null,null,{"$f":"ROUND(AX154*$BE$2,2)+ROUND(AX154*$BE$1,2)","v":2.0000000000000004E-2},null,null,null,null,{"$f":"ROUND((W154*$BF$2)+$BE154-BC154,2)","v":1.1499999999999999},null,null,{"$f":"AK154*$BM$1","v":0},0,0,0,{"$f":"AO154*$BM$1","v":1.1572139999999997},null,{"$f":"BM154-AY154","v":0},0,0,0,{"$f":"BQ154-BC154","v":1.1572139999999997}]
[null,null,null,null,null,null,null,null,"LED (Dusk to Dawn)","Dusk to Dawn","100W",495,0,0,0,0,0,{"$f":"IF(SUM(M155:Q155)>0,0,1)","v":1},0,0,0,0,5.68,null,0,0,0,0,0,null,0,0,0,0,0,null,{"$f":"ROUND(S155*(1+AK$1),2)","v":0},{"$f":"ROUND(T155*(1+AL$1),2)","v":0},0,0,5.82,null,0,0,0,0,0,{"$f":"SUM(AR155)-SUM(Z155)","v":0},{"$f":"AV155/Z155","v":{"$error":"#DIV/0!"}},49,null,null,null,null,null,null,{"$f":"ROUND(AX155*$BE$2,2)+ROUND(AX155*$BE$1,2)","v":0.1100000000000001},null,null,null,null,{"$f":"ROUND((W155*$BF$2)+$BE155-BC155,2)","v":5.88},null,null,0,0,0,0,{"$f":"AO155*$BM$1","v":5.9078819999999999},null,0,0,0,0,{"$f":"BQ155-BC155","v":5.9078819999999999}]
[]
[null,null,null,null,null,null,null,null,"Single Mercury Vapor","Direct Burial",4000,214,{"$f":"SUMIF($G:$G,TEXT(M$3,\"000\")&TEXT($L157,\"000\"),$E:$E)","v":0},0,0,0,0,{"$f":"IF(SUM(M157:Q157)>0,0,1)","v":1},null,0,0,0,0,null,{"$f":"IF(AND(M157<>0,S157=0),#VALUE!,M157*S157)","v":0},{"$f":"IF(AND(N157<>0,T157=0),#VALUE!,N157*T157)","v":0},{"$f":"IF(AND(O157<>0,U157=0),#VALUE!,O157*U157)","v":0},{"$f":"IF(AND(P157<>0,V157=0),#VALUE!,P157*V157)","v":0},{"$f":"IF(AND(Q157<>0,W157=0),#VALUE!,Q157*W157)","v":0},null,{"$f":"M157","v":0},{"$f":"N157","v":0},{"$f":"O157","v":0},{"$f":"P157","v":0},{"$f":"Q157","v":0},null,null,{"$f":"ROUND(T157*(1+AL$1),2)","v":0},0,0,0,null,{"$f":"IF(AND(AE157<>0,AK157=0),#VALUE!,AE157*AK157)","v":0},{"$f":"IF(AND(AF157<>0,AL157=0),#VALUE!,AF157*AL157)","v":0},{"$f":"IF(AND(AG157<>0,AM157=0),#VALUE!,AG157*AM157)","v":0},{"$f":"IF(AND(AH157<>0,AN157=0),#VALUE!,AH157*AN157)","v":0},{"$f":"IF(AND(AI157<>0,AO157=0),#VALUE!,AI157*AO157)","v":0},{"$f":"SUM(AQ157:AU157)-SUM(Y157:AC157)","v":0},null,42,null,null,null,null,null,null,{"$f":"ROUND(AX157*$BE$2,2)+ROUND(AX157*$BE$1,2)","v":9.9999999999999978E-2},{"$f":"ROUND((S157*$BF$2),2)+ROUND($BE157-AY157,2)","v":0.1},null,null,null,null,null,null,{"$f":"AK157*$BM$1","v":0},0,0,0,0,null,{"$f":"BM157-AY157","v":0},0,0,0,0]
[null,null,null,null,null,null,null,null,"Decorative Sodium Vapor","No Pole","Granville 100W",475,0,0,0,0,0,{"$f":"IF(SUM(M158:Q158)>0,0,1)","v":1},0,22.17,0,0,0,null,null,{"$f":"IF(AND(N158<>0,T158=0),#VALUE!,N158*T158)","v":0},null,null,null,null,{"$f":"SUMIF($G:$G,TEXT(AE$3,\"000\")&TEXT($L158,\"000\"),$E:$E)","v":0},{"$f":"SUMIF($G:$G,TEXT(AF$3,\"000\")&TEXT($L158,\"000\"),$E:$E)","v":0},{"$f":"SUMIF($G:$G,TEXT(AG$3,\"000\")&TEXT($L158,\"000\"),$E:$E)","v":0},{"$f":"SUMIF($G:$G,TEXT(AH$3,\"000\")&TEXT($L158,\"000\"),$E:$E)","v":0},{"$f":"SUMIF($G:$G,TEXT(AI$3,\"000\")&TEXT($L158,\"000\"),$E:$E)","v":0},null,{"$f":"ROUND(S158*(1+AK$1),2)","v":0},22.67,0,0,0,null,null,{"$f":"IF(AND(AF158<>0,AL158=0),#VALUE!,AF158*AL158)","v":0},null,null,null,{"$f":"SUM(AR158)-SUM(Z158)","v":0},{"$f":"AV158/Z158","v":{"$error":"#DIV/0!"}},40,null,21.37,null,null,null,null,{"$f":"ROUND(AX158*$BE$2,2)+ROUND(AX158*$BE$1,2)","v":9.000000000000008E-2},null,{"$f":"ROUND((T158*$BF$2)+$BE158-AZ158,2)","v":1.22},null,null,null,null,null,0,23.012316999999999,0,0,0,null,0,1.6423169999999985,0,0,0]
[null,null,null,null,null,null,null,null,"Single High-Pressure Sodium Vapor","Pedestal Base","250W",632,0,0,0,0,0,{"$f":"IF(SUM(M159:Q159)>0,0,1)","v":1},0,null,15.39,0,0,null,{"$f":"IF(AND(M159<>0,S159=0),#VALUE!,M159*S159)","v":0},{"$f":"IF(AND(N159<>0,T159=0),#VALUE!,N159*T159)","v":0},{"$f":"IF(AND(O159<>0,U159=0),#VALUE!,O159*U159)","v":0},0,0,null,{"$f":"M159","v":0},0,0,0,0,null,{"$f":"ROUND(S159*(1+AK$1),2)","v":0},0,15.76,0,0,null,{"$f":"IF(AND(AE159<>0,AK159=0),#VALUE!,AE159*AK159)","v":0},{"$f":"IF(AND(AF159<>0,AL159=0),#VALUE!,AF159*AL159)","v":0},{"$f":"IF(AND(AG159<>0,AM159=0),#VALUE!,AG159*AM159)","v":0},0,0,{"$f":"SUM(AR159)-SUM(Z159)","v":0},{"$f":"AV159/Z159","v":{"$error":"#DIV/0!"}},107,null,null,14.73,null,null,null,{"$f":"ROUND(AX159*$BE$2,2)+ROUND(AX159*$BE$1,2)","v":0.22999999999999998},null,null,{"$f":"ROUND((U159*$BF$2)+$BE159-BA159,2)","v":1.1200000000000001},null,null,null,null,0,0,15.997975999999998,0,0,null,0,0,1.2679759999999973,0,0]
[null,null,null,null,null,null,null,null,"Single High-Pressure Sodium Vapor","Pedestal Base","400W",832,0,0,0,0,0,{"$f":"IF(SUM(M160:Q160)>0,0,1)","v":1},0,55.73,null,0,0,null,{"$f":"IF(AND(M160<>0,S160=0),#VALUE!,M160*S160)","v":0},{"$f":"IF(AND(N160<>0,T160=0),#VALUE!,N160*T160)","v":0},0,0,0,null,0,0,0,0,0,null,{"$f":"ROUND(S160*(1+AK$1),2)","v":0},56.98,0,0,0,null,{"$f":"IF(AND(AE160<>0,AK160=0),#VALUE!,AE160*AK160)","v":0},{"$f":"IF(AND(AF160<>0,AL160=0),#VALUE!,AF160*AL160)","v":0},0,0,0,{"$f":"SUM(AR160)-SUM(Z160)","v":0},{"$f":"AV160/Z160","v":{"$error":"#DIV/0!"}},169,null,56.7,null,null,null,null,{"$f":"ROUND(AX160*$BE$2,2)+ROUND(AX160*$BE$1,2)","v":0.37999999999999989},null,{"$f":"ROUND((T160*$BF$2)+$BE160-AZ160,2)","v":0.25},{"$f":"ROUND((U160*$BF$2)+$BE160-BA160,2)","v":0.38},null,null,null,null,0,57.840397999999993,0,0,0,null,0,1.1403979999999905,0,0,0]

{"sheet":"Area Lts","index":12,"n_rows":104,"n_cols":34,"rows_kept":104,"cut":false,"hidden":false,"merged":[]}
["Area Light Summary",null,null,null,null,null,null,null,"WASHINGTON Area Lights (Schedule 47)",null,null,null,null,null,null,null,null,null,"Monthly Rev.",null,null,null,null,null,null,{"$f":"SL_RateIncr","v":0},null,null,"% rate increase -->",{"$f":"'Lighting summary'!L16","v":2.3800000000000002E-2},null,null,"Monthly Rev."]
[{"$f":"'St Lts'!A2","v":"MDM-10069 Report as of 9/30/21"},null,null,null,null,null,null,null,null,null,null,null,"# of Lights(1)",null,null,"Pres. Rates",null,null,"at Pres. Rates",null,null,"# of Lights(1)",null,null,null,null,"# of Lights",null,null,"Prop. Rates",null,null,"at Prop. Rates"]
[null,null,null,null,null,null,null,null,"Fixture Type","Pole Facility","Size","Sched","047","048",null,"047","048",null,"047","048",null,"047","048",null,null,null,"047","048",null,"047","048",null,"047","048"]
[null,null,null,null,null,null,null,null,"Sodium Vapor","Floodlight on existing standard","250W","HAH",{"$f":"SUMIF($G:$G,TEXT(M$3,\"000\")&TEXT($L4,\"000\"),$E:$E)","v":95},2,null,24.43,{"$f":"P4","v":24.43},null,{"$f":"IF(AND(M4<>0,P4=0),#VALUE!,M4*P4)","v":2320.85},{"$f":"IF(AND(N4<>0,Q4=0),#VALUE!,N4*Q4)","v":48.86},null,{"$f":"SUMIF($G:$G,TEXT(V$3,\"000\")&TEXT($L4,\"000\"),$E:$E)","v":95},2,null,null,null,{"$f":"M4","v":95},2,null,{"$f":"ROUND(P4*(1+AD$1),2)","v":25.01},{"$f":"AD4","v":25.01},null,{"$f":"IF(AND(AA4<>0,AD4=0),#VALUE!,AA4*AD4)","v":2375.9500000000003},{"$f":"IF(AND(AB4<>0,AE4=0),#VALUE!,AB4*AE4)","v":50.02}]
[null,"State","Sched","Rate Sub","# of Lights",null,null,null,"Sodium Vapor","Kim light w/25' fiberglass pole","100W","HAI",16,2,null,31.91,31.91,null,{"$f":"IF(AND(M5<>0,P5=0),#VALUE!,M5*P5)","v":510.56},63.82,null,16,2,null,null,null,16,2,null,32.67,{"$f":"AD5","v":32.67},null,522.72,65.34]
[null,null,null,null,null,null,null,null,"Sodium Vapor","on existing standard","100W","HPA",330,367,null,15.15,15.15,null,4999.5,{"$f":"IF(AND(N6<>0,Q6=0),#VALUE!,N6*Q6)","v":5560.05},null,330,367,null,null,null,330,367,null,15.51,15.51,null,5118.3,5692.17]
[null,"WA","047","HAGL",1,null,{"$f":"IF(OR(ISBLANK(C7),ISBLANK(D7)),\"\",TEXT(C7,\"000\")&TEXT(D7,\"000\"))","v":"047HAGL"},null,"Sodium Vapor","on existing standard","200W","HPB",785,361,null,21.51,21.51,null,16885.350000000002,7765.1100000000006,null,785,361,null,null,null,785,361,null,22.02,22.02,null,17285.7,7949.22]
[null,"WA","047","HAH",95,null,{"$f":"IF(OR(ISBLANK(C8),ISBLANK(D8)),\"\",TEXT(C8,\"000\")&TEXT(D8,\"000\"))","v":"047HAH"},null,"Sodium Vapor","on existing standard","400W","HPC",104,8,null,29.71,29.71,null,3089.84,237.68,null,104,8,null,null,null,104,8,null,{"$f":"ROUND(P8*(1+AD$1),2)","v":30.42},30.42,null,3163.6800000000003,243.36]
[null,"WA","047","HAI",16,null,{"$f":"IF(OR(ISBLANK(C9),ISBLANK(D9)),\"\",TEXT(C9,\"000\")&TEXT(D9,\"000\"))","v":"047HAI"},null,"Sodium Vapor","35' wood pole","200W","HPD",495,165,null,29.89,29.89,null,14795.550000000001,4931.8500000000004,null,495,165,null,null,null,495,165,null,30.6,30.6,null,15147,5049]
[null,"WA","047","HPA",330,null,"047HPA",null,"Sodium Vapor","35' wood pole","100W","HPE",241,151,null,22.18,22.18,null,5345.38,3349.18,null,241,151,null,null,null,241,151,null,22.71,22.71,null,5473.1100000000006,3429.21]
[null,"WA","047","HPB",785,null,"047HPB",null,"Sodium Vapor","35' wood pole","400W","HPG",31,3,null,38.200000000000003,38.200000000000003,null,1184.2,114.60000000000001,null,31,3,null,null,null,31,3,null,39.11,39.11,null,1212.4100000000001,117.33]
[null,"WA","047","HPC",104,null,"047HPC",null,"Sodium Vapor","30' steel pole","200W","HPL",36,7,null,37.520000000000003,37.520000000000003,null,1350.72,262.64000000000004,null,36,7,null,null,null,36,7,null,38.409999999999997,38.409999999999997,null,1382.7599999999998,268.87]
[null,"WA","047","HPD",495,null,"047HPD",null,"Sodium Vapor","25' steel pole","200W","HPO",1,0,null,32.51,32.51,null,32.51,0,null,1,0,null,null,null,1,0,null,33.28,33.28,null,33.28,0]
[null,"WA","047","HPE",241,null,"047HPE",null,"Sodium Vapor","20' fiberglass pole","100W","HPS",67,140,null,22.18,22.18,null,1486.06,3105.2,null,67,140,null,null,null,67,140,null,22.71,22.71,null,1521.5700000000002,3179.4]
[null,"WA","047","HPG",31,null,"047HPG",null,"Sodium Vapor","30' steel pole w/2 arms","200W","HPY",12,0,null,63.59,63.59,null,763.08,0,null,12,0,null,null,null,12,0,null,65.099999999999994,65.099999999999994,null,781.19999999999993,0]
[null,"WA","047","HPL",36,null,"047HPL",null,"Mercury Vapor","on existing standard",7000,"MVA",85,169,null,17.420000000000002,17.420000000000002,null,1480.7,2943.9800000000005,null,85,169,null,null,null,85,169,null,17.829999999999998,17.829999999999998,null,1515.55,3013.2699999999995]
[null,"WA","047","HPO",1,null,{"$f":"IF(OR(ISBLANK(C17),ISBLANK(D17)),\"\",TEXT(C17,\"000\")&TEXT(D17,\"000\"))","v":"047HPO"},null,"Mercury Vapor","on existing standard",10000,"MVB",114,164,null,20.88,20.88,null,2380.3199999999997,3424.3199999999997,null,114,164,null,null,null,114,164,null,21.38,21.38,null,2437.3199999999997,3506.3199999999997]
[null,"WA","047","HPS",67,null,"047HPS",null,"Mercury Vapor","on existing standard",20000,"MVC",215,13,null,29.69,29.69,null,6383.35,385.97,null,215,13,null,null,null,215,13,null,30.4,30.4,null,6536,395.2]
[null,"WA","047","HPY",12,null,"047HPY",null,"Mercury Vapor","30' wood pole",7000,"MVD",32,73,null,21.74,21.74,null,695.68,1587.02,null,32,73,null,null,null,32,73,null,22.26,22.26,null,712.32,1624.98]
[null,"WA","047","HAIL",1,null,{"$f":"IF(OR(ISBLANK(C20),ISBLANK(D20)),\"\",TEXT(C20,\"000\")&TEXT(D20,\"000\"))","v":"047HAIL"},null,"Mercury Vapor","30' wood pole",10000,"MVE",35,35,null,25.24,25.24,null,883.4,883.4,null,35,35,null,null,null,35,35,null,25.84,25.84,null,904.4,904.4]
[null,"WA","047","HAML",94,null,"047HAML",null,"Mercury Vapor","30' wood pole",20000,"MVF",109,16,null,34.08,34.08,null,3714.72,545.28,null,109,16,null,null,null,109,16,null,34.89,34.89,null,3803.01,558.24]
[null,"WA","047","HANL",31,null,"047HANL",null,"Mercury Vapor","25' steel",10000,"MVH",0,5,null,31.87,31.87,null,0,159.35,null,0,5,null,null,null,0,5,null,32.630000000000003,32.630000000000003,null,0,163.15]
[null,"WA","047","HAOL",2,null,{"$f":"IF(OR(ISBLANK(C23),ISBLANK(D23)),\"\",TEXT(C23,\"000\")&TEXT(D23,\"000\"))","v":"047HAOL"},null,"Mercury Vapor","25' steel",20000,"MVI",1,0,null,40.65,40.65,null,40.65,0,null,1,0,null,null,null,1,0,null,41.62,41.62,null,41.62,0]
[null,"WA","047","HAPL",5,null,{"$f":"IF(OR(ISBLANK(C24),ISBLANK(D24)),\"\",TEXT(C24,\"000\")&TEXT(D24,\"000\"))","v":"047HAPL"},null,"Mercury Vapor","30' steel",7000,"MVJ",{"$f":"SUMIF($G:$G,TEXT(M$3,\"000\")&TEXT($L24,\"000\"),$E:$E)","v":2},0,null,29.72,29.72,null,59.44,0,null,{"$f":"SUMIF($G:$G,TEXT(V$3,\"000\")&TEXT($L24,\"000\"),$E:$E)","v":2},0,null,null,null,2,0,null,30.43,30.43,null,60.86,0]
[null,"WA","047","HAQL",2,null,{"$f":"IF(OR(ISBLANK(C25),ISBLANK(D25)),\"\",TEXT(C25,\"000\")&TEXT(D25,\"000\"))","v":"047HAQL"},null,"Mercury Vapor","30' steel",10000,"MVK",0,5,null,33.229999999999997,33.229999999999997,null,0,166.14999999999998,null,0,5,null,null,null,0,5,null,34.020000000000003,34.020000000000003,null,0,170.10000000000002]
[null,"WA","047","HARL",20,null,{"$f":"IF(OR(ISBLANK(C26),ISBLANK(D26)),\"\",TEXT(C26,\"000\")&TEXT(D26,\"000\"))","v":"047HARL"},null,"Mercury Vapor","30' steel",20000,"MVL",2,0,null,42.02,42.02,null,84.04,0,null,2,0,null,null,null,2,0,null,43.02,43.02,null,86.04,0]
[null,"WA","047","HPAL",626,null,"047HPAL",null,"Mercury Vapor","Special",7000,"MVV",0,2,null,{"$f":"P16/2","v":8.7100000000000009},8.7100000000000009,null,0,17.420000000000002,null,0,2,null,null,null,0,2,null,{"$f":"AD16/2","v":8.9149999999999991},8.9149999999999991,null,0,17.829999999999998]
[null,"WA","047","HPBL",527,null,"047HPBL",null,"none","35' wood pole","n/a","PA",49,2,null,7.01,7.01,null,343.49,14.02,null,49,2,null,null,null,49,2,null,7.18,7.18,null,351.82,14.36]
[null,"WA","047","HPCL",153,null,"047HPCL",null,"LED",{"$f":"J6","v":"on existing standard"},"70W","HPAL",626,1071,null,{"$f":"P6","v":15.15},15.15,null,{"$f":"IF(AND(M29<>0,P29=0),#VALUE!,M29*P29)","v":9483.9},{"$f":"IF(AND(N29<>0,Q29=0),#VALUE!,N29*Q29)","v":16225.65},null,626,1071,null,null,null,{"$f":"M29","v":626},{"$f":"N29","v":1071},null,{"$f":"AD6","v":15.51},15.51,null,{"$f":"IF(AND(AA29<>0,AD29=0),#VALUE!,AA29*AD29)","v":9709.26},{"$f":"IF(AND(AB29<>0,AE29=0),#VALUE!,AB29*AE29)","v":16611.21}]
[null,"WA","047","HPDL",480,null,"047HPDL",null,"LED",{"$f":"J7","v":"on existing standard"},"107W","HPBL",527,152,null,{"$f":"P7","v":21.51},21.51,null,11335.77,3269.5200000000004,null,527,152,null,null,null,527,152,null,{"$f":"AD7","v":22.02},{"$f":"AE7","v":22.02},null,{"$f":"IF(AND(AA30<>0,AD30=0),#VALUE!,AA30*AD30)","v":11604.539999999999},{"$f":"IF(AND(AB30<>0,AE30=0),#VALUE!,AB30*AE30)","v":3347.04}]
[null,"WA","047","HPEL",{"$f":"428+1","v":429},null,"047HPEL",null,"LED",{"$f":"J8","v":"on existing standard"},"241W","HPCL",153,6,null,{"$f":"P8","v":29.71},{"$f":"P31","v":29.71},null,{"$f":"IF(AND(M31<>0,P31=0),#VALUE!,M31*P31)","v":4545.63},{"$f":"IF(AND(N31<>0,Q31=0),#VALUE!,N31*Q31)","v":178.26},null,153,6,null,null,null,{"$f":"M31","v":153},{"$f":"N31","v":6},null,{"$f":"AD8","v":30.42},{"$f":"AE8","v":30.42},null,{"$f":"IF(AND(AA31<>0,AD31=0),#VALUE!,AA31*AD31)","v":4654.26},{"$f":"IF(AND(AB31<>0,AE31=0),#VALUE!,AB31*AE31)","v":182.52}]
[null,"WA","047","HPGL",132,null,"047HPGL",null,"LED",{"$f":"J14","v":"20' fiberglass pole"},"70W","HPSL",34,197,null,{"$f":"P14","v":22.18},22.18,null,754.12,4369.46,null,34,197,null,null,null,34,197,null,{"$f":"AD14","v":22.71},{"$f":"AE14","v":22.71},null,772.14,4473.87]
[null,"WA","047","HPJL",1,null,{"$f":"IF(OR(ISBLANK(C33),ISBLANK(D33)),\"\",TEXT(C33,\"000\")&TEXT(D33,\"000\"))","v":"047HPJL"},null,"LED",{"$f":"J10","v":"35' wood pole"},"70W","HPEL",429,536,null,{"$f":"P10","v":22.18},22.18,null,9515.2199999999993,11888.48,null,429,536,null,null,null,429,536,null,{"$f":"AD10","v":22.71},{"$f":"AE10","v":22.71},null,9742.59,12172.560000000001]
[null,"WA","047","HPKL",5,null,{"$f":"IF(OR(ISBLANK(C34),ISBLANK(D34)),\"\",TEXT(C34,\"000\")&TEXT(D34,\"000\"))","v":"047HPKL"},null,"LED",{"$f":"J9","v":"35' wood pole"},"107W","HPDL",480,88,null,{"$f":"P9","v":29.89},29.89,null,14347.2,2630.32,null,480,88,null,null,null,480,88,null,{"$f":"AD9","v":30.6},{"$f":"AE9","v":30.6},null,14688,2692.8]
[null,"WA","047","HPLL",8,null,"047HPLL",null,"LED",{"$f":"J10","v":"35' wood pole"},"107W","HPJL",1,0,null,38.08,{"$f":"P35","v":38.08},null,{"$f":"IF(AND(M35<>0,P35=0),#VALUE!,M35*P35)","v":38.08},{"$f":"IF(AND(N35<>0,Q35=0),#VALUE!,N35*Q35)","v":0},null,1,0,null,null,null,{"$f":"M35","v":1},{"$f":"N35","v":0},null,{"$f":"ROUND(P35*(1+AD$1),2)","v":38.99},{"$f":"AD35","v":38.99},null,{"$f":"IF(AND(AA35<>0,AD35=0),#VALUE!,AA35*AD35)","v":38.99},{"$f":"IF(AND(AB35<>0,AE35=0),#VALUE!,AB35*AE35)","v":0}]
[null,"WA","047","HPSL",34,null,"047HPSL",null,"LED",{"$f":"J13","v":"25' steel pole"},"107W","HPOL",0,5,null,{"$f":"P13","v":32.51},32.51,null,0,162.54999999999998,null,0,5,null,null,null,0,5,null,{"$f":"AD13","v":33.28},{"$f":"AE13","v":33.28},null,0,166.4]
[null,"WA","047","HPYL",5,null,"047HPYL",null,"LED",{"$f":"J12","v":"30' steel pole"},"107W","HPLL",8,4,null,{"$f":"P12","v":37.520000000000003},37.520000000000003,null,300.16000000000003,150.08000000000001,null,8,4,null,null,null,8,4,null,{"$f":"AD12","v":38.409999999999997},{"$f":"AE12","v":38.409999999999997},null,307.27999999999997,153.63999999999999]
[null,"WA","047","HPZL",43,null,"047HPZL",null,"LED",{"$f":"J15","v":"30' steel pole w/2 arms"},"107W","HPYL",5,0,null,{"$f":"P15","v":63.59},63.59,null,317.95000000000005,0,null,5,0,null,null,null,5,0,null,{"$f":"AD15","v":65.099999999999994},{"$f":"AE15","v":65.099999999999994},null,325.5,0]
[null,"WA","047","MVA",85,null,"047MVA",null,"LED",{"$f":"J98","v":"Granville w/16' decorative pole"},"70W","HAGL",1,0,null,33.020000000000003,33.020000000000003,null,33.020000000000003,0,null,1,0,null,null,null,1,0,null,{"$f":"ROUND(P39*(1+AD$1),2)","v":33.81},{"$f":"AD39","v":33.81},null,33.81,0]
[null,"WA","047","MVB",114,null,"047MVB",null,"LED",{"$f":"J99","v":"Post Top w/16' decorative pole"},"70W","HAPL",5,1,null,31.5,31.5,null,157.5,31.5,null,5,1,null,null,null,5,1,null,32.25,32.25,null,{"$f":"IF(AND(AA40<>0,AD40=0),#VALUE!,AA40*AD40)","v":161.25},32.25]
[null,"WA","047","MVC",215,null,"047MVC",null,"LED","35 ft direct buried steel pole","70W","HAAL",0,10,null,31.16,{"$f":"P41","v":31.16},null,{"$f":"IF(AND(M41<>0,P41=0),#VALUE!,M41*P41)","v":0},311.60000000000002,null,0,10,null,null,null,{"$f":"M41","v":0},10,null,{"$f":"ROUND(P41*(1+AD$1),2)","v":31.9},{"$f":"AD41","v":31.9},null,{"$f":"IF(AND(AA41<>0,AD41=0),#VALUE!,AA41*AD41)","v":0},319]
[null,"WA","047","MVD",32,null,"047MVD",null,"LED","Floodlight on existing standard","125W","HAML",94,15,null,16.809999999999999,16.809999999999999,null,1580.1399999999999,252.14999999999998,null,94,15,null,null,null,94,15,null,{"$f":"ROUND(P42*(1+AD$1),2)","v":17.21},{"$f":"AD42","v":17.21},null,{"$f":"IF(AND(AA42<>0,AD42=0),#VALUE!,AA42*AD42)","v":1617.74},258.15000000000003]
[null,"WA","047","MVE",35,null,"047MVE",null,"LED","Floodlight 35ft wood pole","125W","HANL",31,2,null,23.83,23.83,null,738.7299999999999,47.66,null,31,2,null,null,null,{"$f":"M43","v":31},2,null,24.4,24.4,null,756.4,48.8]
[null,"WA","047","MVF",109,null,"047MVF",null,"LED","70W Kim light w/25ft Fiberglass pole","70W","HAIL",{"$f":"SUMIF($G:$G,TEXT(M$3,\"000\")&TEXT($L44,\"000\"),$E:$E)","v":1},0,null,31.91,31.91,null,31.91,0,null,{"$f":"SUMIF($G:$G,TEXT(V$3,\"000\")&TEXT($L44,\"000\"),$E:$E)","v":1},0,null,null,null,{"$f":"M44","v":1},{"$f":"N44","v":0},null,{"$f":"ROUND(P44*(1+AD$1),2)","v":32.67},{"$f":"AD44","v":32.67},null,{"$f":"IF(AND(AA44<>0,AD44=0),#VALUE!,AA44*AD44)","v":32.67},{"$f":"IF(AND(AB44<>0,AE44=0),#VALUE!,AB44*AE44)","v":0}]
[null,"WA","047","MVH",0,null,"047MVH",null,"LED","30 ft Fiberglass direct buried","70W","HAOL",2,3,null,29,29,null,{"$f":"IF(AND(M45<>0,P45=0),#VALUE!,M45*P45)","v":58},{"$f":"IF(AND(N45<>0,Q45=0),#VALUE!,N45*Q45)","v":87},null,2,3,null,null,null,2,3,null,29.69,29.69,null,59.38,89.070000000000007]
[null,"WA","047","MVI",1,null,"047MVI",null,"LED","on existing standard (Capital Only","248W","HARL",20,0,null,19.91,{"$f":"P46","v":19.91},null,{"$f":"IF(AND(M46<>0,P46=0),#VALUE!,M46*P46)","v":398.2},{"$f":"IF(AND(N46<>0,Q46=0),#VALUE!,N46*Q46)","v":0},null,20,0,null,null,null,{"$f":"M46","v":20},{"$f":"N46","v":0},null,{"$f":"ROUND(P46*(1+AD$1),2)","v":20.38},{"$f":"AD46","v":20.38},null,{"$f":"IF(AND(AA46<>0,AD46=0),#VALUE!,AA46*AD46)","v":407.59999999999997},{"$f":"IF(AND(AB46<>0,AE46=0),#VALUE!,AB46*AE46)","v":0}]
[null,"WA","047","MVJ",2,null,"047MVJ",null,"LED","35 ft Fiberglass direct buried","107W","HAQL",2,0,null,31.95,31.95,null,63.9,0,null,2,0,null,null,null,2,0,null,32.71,32.71,null,65.42,0]
[null,"WA","047","MVK",0,null,"047MVK",null,"LED","30 steel pole pedestal base","70W","HPKL",5,0,null,31.16,31.16,null,155.80000000000001,0,null,5,0,null,null,null,5,0,null,31.9,31.9,null,{"$f":"IF(AND(AA48<>0,AD48=0),#VALUE!,AA48*AD48)","v":159.5},0]
[null,"WA","047","MVL",2,null,"047MVL",null,"LED","30 steel pole pedestal base (Dev Contr)","107W","HPZL",43,0,null,{"$f":"P34","v":29.89},{"$f":"P49","v":29.89},null,{"$f":"IF(AND(M49<>0,P49=0),#VALUE!,M49*P49)","v":1285.27},{"$f":"IF(AND(N49<>0,Q49=0),#VALUE!,N49*Q49)","v":0},null,43,0,null,null,null,{"$f":"M49","v":43},{"$f":"N49","v":0},null,{"$f":"ROUND(P49*(1+AD$1),2)","v":30.6},{"$f":"AD49","v":30.6},null,{"$f":"IF(AND(AA49<>0,AD49=0),#VALUE!,AA49*AD49)","v":1315.8},{"$f":"IF(AND(AB49<>0,AE49=0),#VALUE!,AB49*AE49)","v":0}]
[null,"WA","047","MVO",0,null,"047MVO",null,"LED",{"$f":"J11","v":"35' wood pole"},"248W","HPGL",132,0,null,{"$f":"P11","v":38.200000000000003},null,null,5042.4000000000005,0,null,132,0,null,null,null,132,0,null,{"$f":"AD11","v":39.11},{"$f":"AE11","v":39.11},null,{"$f":"IF(AND(AA50<>0,AD50=0),#VALUE!,AA50*AD50)","v":5162.5199999999995},0]
[null,"WA","047","PA",49,null,"047PA",null,null,null,null,"SLB",0,0,null,null,9.9999999999999995E-8,null,0,0,null,0,0,null,null,null,0,0,null,{"$f":"ROUND(P51*(1+$Z$1),2)","v":0},9.9999999999999995E-7,null,0,0]
[null,null,null,null,{"$f":"SUM(E7:E51)","v":5456},null,{"$f":"IF(OR(ISBLANK(C53),ISBLANK(D53)),\"\",TEXT(C53,\"000\")&TEXT(D53,\"000\"))","v":""},null,null,null,null,"SLC",0,194,null,null,9.9999999999999995E-7,null,0,1.94E-4,null,0,194,null,null,null,0,194,null,{"$f":"ROUND(P52*(1+$Z$1),2)","v":0},9.9999999999999995E-7,null,0,1.94E-4]
[null,null,null,null,null,null,null,null,null,null,null,"SLD",0,0,null,null,9.9999999999999995E-7,null,0,0,null,0,0,null,null,null,0,0,null,{"$f":"ROUND(P53*(1+$Z$1),2)","v":0},9.9999999999999995E-7,null,0,0]
[null,"WA","048","HAH",2,null,{"$f":"IF(OR(ISBLANK(C54),ISBLANK(D54)),\"\",TEXT(C54,\"000\")&TEXT(D54,\"000\"))","v":"048HAH"}]
[null,"WA","048","HAI",2,null,"048HAI",null,null,null,"Total",null,{"$f":"SUM(M4:M54)","v":5456},{"$f":"SUM(N4:N54)","v":3974},null,null,null,null,{"$f":"SUM(S4:S54)","v":129012.28999999998},{"$f":"SUM(T4:T54)","v":75170.130193999998},null,{"$f":"SUM(V4:V54)","v":5456},{"$f":"SUM(W4:W54)","v":3974},null,null,null,{"$f":"SUM(AA4:AA54)","v":5456},{"$f":"SUM(AB4:AB54)","v":3974},null,null,null,null,{"$f":"SUM(AG4:AG54)","v":132081.26999999999},{"$f":"SUM(AH4:AH54)","v":76959.080193999995}]
[null,"WA","048","HAP",0,null,"048HAP",null,null,null,null,null,null,{"$f":"SUM(M55:N55)","v":9430},null,null,null,null,null,{"$f":"ROUND(SUM(S55:T55),2)","v":204182.42},null,null,{"$f":"SUM(V55:W55)","v":9430},null,null,null,null,{"$f":"SUM(AA55:AB55)","v":9430},null,null,null,null,null,{"$f":"ROUND(SUM(AG55:AH55),2)","v":209040.35}]
[null,"WA","048","HPA",367,null,"048HPA",null,{"$f":"'St Lts'!I108","v":0},null,null,null,null,{"$f":"ROUND(N56-E98,0)","v":0},null,null,null,null,null,null,null,null,null,null,null,null,null,{"$f":"AB56-N56","v":0},null,null,null,null,null,{"$f":"AH56/T56-1","v":2.3792107077582836E-2}]
[null,"WA","048","HPAL",1071,null,"048HPAL",null,null,null,null,null,null,null,null,null,null,null,{"$f":"S55-S57","v":129012.28999999998},{"$f":"T55-T57","v":75170.130193999998}]
[null,"WA","048","HPB",361,null,"048HPB"]
[null,"WA","048","HPBL",152,null,"048HPBL"]
[null,"WA","048","HPC",8,null,"048HPC"]
[null,"WA","048","HPCL",6,null,"048HPCL"]
[null,"WA","048","HPD",165,null,"048HPD"]
[null,"WA","048","HPDL",88,null,"048HPDL",null,null,null,null,null,null,null,null,null,null,null,{"$f":"S62+S63","v":0},{"$f":"T62+T63","v":0}]
[null,"WA","048","HPE",151,null,"048HPE",null,null,null,null,null,null,null,null,null,null,null,null,{"$f":"S64+T64","v":0}]
[null,"WA","048","HPEL",536,null,"048HPEL"]
[null,"WA","048","HPG",3,null,"048HPG"]
[null,"WA","048","HPL",7,null,"048HPL",null,null,null,null,null,null,null,null,null,null,null,null,null,null,null,null,"Monthly Increase (Decrease)"]
[null,"WA","048","HPLL",4,null,"048HPLL",null,null,null,null,null,null,null,null,null,null,null,null,null,null,null,null,"Annual Increase (Decrease)"]
[null,"WA","048","HPO",0,null,"048HPO"]
[null,"WA","048","HPOL",5,null,"048HPOL"]
[null,"WA","048","HPS",140,null,"048HPS"]
[null,"WA","048","HPSL",197,null,"048HPSL"]
[null,"WA","048","HAAL",10,null,"048HAAL"]
[null,"WA","048","HAML",15,null,"048HAML"]
[null,"WA","048","HANL",2,null,"048HANL"]
[null,"WA","048","HAOL",3,null,{"$f":"IF(OR(ISBLANK(C77),ISBLANK(D77)),\"\",TEXT(C77,\"000\")&TEXT(D77,\"000\"))","v":"048HAOL"}]
[null,"WA","048","HAPL",1,null,{"$f":"IF(OR(ISBLANK(C78),ISBLANK(D78)),\"\",TEXT(C78,\"000\")&TEXT(D78,\"000\"))","v":"048HAPL"}]
[null,"WA","048","HPKL",0,null,"048HPKL"]
[null,"WA","048","MVA",169,null,"048MVA"]
[null,"WA","048","MVB",164,null,"048MVB"]
[null,"WA","048","MVC",13,null,"048MVC"]
[null,"WA","048","MVD",73,null,"048MVD"]
[null,"WA","048","MVE",35,null,"048MVE"]
[null,"WA","048","MVF",16,null,"048MVF"]
[null,"WA","048","MVG",0,null,"048MVG"]
[null,"WA","048","MVH",5,null,"048MVH"]
[null,"WA","048","MVK",5,null,"048MVK"]
[null,"WA","048","MVN",0,null,"048MVN"]
[null,"WA","048","MVV",2,null,"048MVV"]
[null,"WA","048","PA",2,null,"048PA"]
[null,"WA","048","PB",0,null,"048PB"]
[null,"WA","048","SLB",0,null,"048SLB"]
[null,"WA","048","SLC",194,null,"048SLC"]
[null,"WA","048","SLD",0,null,"048SLD"]
[null,null,null,null,{"$f":"SUM(E54:E95)","v":3974},null,{"$f":"IF(OR(ISBLANK(C97),ISBLANK(D97)),\"\",TEXT(C97,\"000\")&TEXT(D97,\"000\"))","v":""}]
[]
[null,"WA",null,null,{"$f":"E52+E96","v":9430},null,null,null,"Sodium Vapor","Granville w/16' decorative pole","100W","HAG",{"$f":"SUMIF($G:$G,TEXT(M$3,\"000\")&TEXT($L98,\"000\"),$E:$E)","v":0},0,null,null,{"$f":"P98","v":0},null,{"$f":"IF(AND(M98<>0,P98=0),#VALUE!,M98*P98)","v":0},0,null,{"$f":"SUMIF($G:$G,TEXT(V$3,\"000\")&TEXT($L98,\"000\"),$E:$E)","v":0},0,null,null,null,{"$f":"M98","v":0},0,null,{"$f":"ROUND(P98*(1+AD$1),2)","v":0},{"$f":"AD98","v":0},null,{"$f":"IF(AND(AA98<>0,AD98=0),#VALUE!,AA98*AD98)","v":0},0]
[null,null,null,null,null,null,null,null,"Sodium Vapor","Post Top w/16' decorative pole","100W","HAP",0,0,null,null,0,null,0,0,null,0,0,null,null,null,0,0,null,0,0,null,0,0]
[null,null,null,null,null,null,null,null,"Mercury Vapor","25' steel",7000,"MVG",0,0,null,null,0,null,0,0,null,0,0,null,null,null,0,0,null,0,0,null,0,0]
[null,null,null,null,null,null,null,null,"Mercury Vapor","25' aluminum",7000,"MVM",0,0,null,null,0,null,0,0,null,0,0,null,null,null,0,0,null,0,0,null,0,0]
[null,null,null,null,null,null,null,null,"Mercury Vapor","25' aluminum",10000,"MVN",0,0,null,null,0,null,0,0,null,0,0,null,null,null,0,0,null,0,0,null,0,0]
[null,null,null,null,null,null,null,null,"Mercury Vapor","25' aluminum",20000,"MVO",0,0,null,null,0,null,0,0,null,0,0,null,null,null,0,0,null,0,0,null,0,0]
[null,null,null,null,null,null,null,null,"none","55' wood pole","n/a","PB",0,0,null,null,0,null,0,0,null,0,0,null,null,null,0,0,null,0,0,null,0,0]

{"sheet":"Block Data","index":13,"n_rows":153,"n_cols":19,"rows_kept":153,"cut":false,"hidden":false,"merged":[]}
[]
[]
["WASHINGTON ELECTRIC SYSTEM"]
[null,null,"October","November","December","January","February","March","April","May","June","July","August","September","Annual Total"]
["Rate Design Program Monthly Results"]
[null,"Schedule 001/002"]
[null,"Block 1",{"$f":"'REVRUNS 12ME0921'!D61+'REVRUNS 12ME0921'!D76","v":126671526.79886},{"$f":"'REVRUNS 12ME0921'!E61+'REVRUNS 12ME0921'!E76","v":141161403.90276},{"$f":"'REVRUNS 12ME0921'!F61+'REVRUNS 12ME0921'!F76","v":153279164.25044999},{"$f":"'REVRUNS 12ME0921'!G61+'REVRUNS 12ME0921'!G76","v":145336918.74568},{"$f":"'REVRUNS 12ME0921'!H61+'REVRUNS 12ME0921'!H76","v":143450858.24737},{"$f":"'REVRUNS 12ME0921'!I61+'REVRUNS 12ME0921'!I76","v":165087270.92676002},{"$f":"'REVRUNS 12ME0921'!J61+'REVRUNS 12ME0921'!J76","v":137318007.94782999},{"$f":"'REVRUNS 12ME0921'!K61+'REVRUNS 12ME0921'!K76","v":125820470.97221},{"$f":"'REVRUNS 12ME0921'!L61+'REVRUNS 12ME0921'!L76","v":131235812.11885001},{"$f":"'REVRUNS 12ME0921'!M61+'REVRUNS 12ME0921'!M76","v":148068257.98974001},{"$f":"'REVRUNS 12ME0921'!N61+'REVRUNS 12ME0921'!N76","v":148228693.69687},{"$f":"'REVRUNS 12ME0921'!O61+'REVRUNS 12ME0921'!O76","v":133468353.58196001},{"$f":"SUM(C7:N7)","v":1699126739.1793399},null,null,0,{"$f":"R7/$R$10","v":{"$error":"#DIV/0!"}}]
[null,"Block 2",{"$f":"'REVRUNS 12ME0921'!D62+'REVRUNS 12ME0921'!D77","v":24044218.450139999},{"$f":"'REVRUNS 12ME0921'!E62+'REVRUNS 12ME0921'!E77","v":42000514.480240002},{"$f":"'REVRUNS 12ME0921'!F62+'REVRUNS 12ME0921'!F77","v":64752272.93355},{"$f":"'REVRUNS 12ME0921'!G62+'REVRUNS 12ME0921'!G77","v":65236875.307320006},{"$f":"'REVRUNS 12ME0921'!H62+'REVRUNS 12ME0921'!H77","v":59974258.81763},{"$f":"'REVRUNS 12ME0921'!I62+'REVRUNS 12ME0921'!I77","v":61059929.873240001},{"$f":"'REVRUNS 12ME0921'!J62+'REVRUNS 12ME0921'!J77","v":37659186.637170002},{"$f":"'REVRUNS 12ME0921'!K62+'REVRUNS 12ME0921'!K77","v":23694340.99179},{"$f":"'REVRUNS 12ME0921'!L62+'REVRUNS 12ME0921'!L77","v":29451849.342149999},{"$f":"'REVRUNS 12ME0921'!M62+'REVRUNS 12ME0921'!M77","v":60647956.696079999},{"$f":"'REVRUNS 12ME0921'!N62+'REVRUNS 12ME0921'!N77","v":58181641.990220003},{"$f":"'REVRUNS 12ME0921'!O62+'REVRUNS 12ME0921'!O77","v":33362568.635029998},{"$f":"SUM(C8:N8)","v":560065614.15455997},null,null,0,{"$f":"R8/$R$10","v":{"$error":"#DIV/0!"}}]
[null,"Block 3",{"$f":"'REVRUNS 12ME0921'!D63+'REVRUNS 12ME0921'!D78","v":6475352.4009999996},{"$f":"'REVRUNS 12ME0921'!E63+'REVRUNS 12ME0921'!E78","v":19767305.714000002},{"$f":"'REVRUNS 12ME0921'!F63+'REVRUNS 12ME0921'!F78","v":48202395.524000004},{"$f":"'REVRUNS 12ME0921'!G63+'REVRUNS 12ME0921'!G78","v":53768002.208000004},{"$f":"'REVRUNS 12ME0921'!H63+'REVRUNS 12ME0921'!H78","v":47806031.272},{"$f":"'REVRUNS 12ME0921'!I63+'REVRUNS 12ME0921'!I78","v":41081750.129000001},{"$f":"'REVRUNS 12ME0921'!J63+'REVRUNS 12ME0921'!J78","v":16356955.027000001},{"$f":"'REVRUNS 12ME0921'!K63+'REVRUNS 12ME0921'!K78","v":6848310.6289999997},{"$f":"'REVRUNS 12ME0921'!L63+'REVRUNS 12ME0921'!L78","v":8872409.9340000004},{"$f":"'REVRUNS 12ME0921'!M63+'REVRUNS 12ME0921'!M78","v":27807660.878050003},{"$f":"'REVRUNS 12ME0921'!N63+'REVRUNS 12ME0921'!N78","v":25860463.195020001},{"$f":"'REVRUNS 12ME0921'!O63+'REVRUNS 12ME0921'!O78","v":11155513.652000001},{"$f":"SUM(C9:N9)","v":314002150.56307012},null,null,0,{"$f":"R9/$R$10","v":{"$error":"#DIV/0!"}}]
["kWhs","Total",{"$f":"SUM(C7:C9)","v":157191097.65000001},{"$f":"SUM(D7:D9)","v":202929224.097},266233832.708,264341796.26100001,251231148.33700001,267228950.92900002,191334149.61199999,156363122.59300002,169560071.39499998,236523875.56387001,232270798.88211,177986435.86899,2573194503.8969703,null,null,{"$f":"SUM(R7:R9)","v":0},{"$f":"SUM(S7:S9)","v":{"$error":"#DIV/0!"}}]
[null,"Billed Customers",{"$f":"'REVRUNS 12ME0921'!C39","v":221953},{"$f":"'REVRUNS 12ME0921'!D39","v":222003},{"$f":"'REVRUNS 12ME0921'!E39","v":222995},{"$f":"'REVRUNS 12ME0921'!F39","v":209088},{"$f":"'REVRUNS 12ME0921'!G39","v":210581},{"$f":"'REVRUNS 12ME0921'!H39","v":250547},{"$f":"'REVRUNS 12ME0921'!I39","v":224063},{"$f":"'REVRUNS 12ME0921'!J39","v":223629},{"$f":"'REVRUNS 12ME0921'!K39","v":223770},{"$f":"'REVRUNS 12ME0921'!L39","v":223958},{"$f":"'REVRUNS 12ME0921'!M39","v":224348},{"$f":"'REVRUNS 12ME0921'!N39","v":224617},{"$f":"SUM(C11:N11)","v":2681552}]
[null,"Block 1 Limit",{"$f":"C11*800","v":177562400},{"$f":"D11*800","v":177602400},178396000,167270400,168464800,200437600,179250400,178903200,179016000,179166400,179478400,179693600,{"$f":"SUM(C12:N12)","v":2145241600}]
[null,"Revenue Run Total",{"$f":"'REVRUNS 12ME0921'!D333","v":157191097.65000001},{"$f":"'REVRUNS 12ME0921'!E333","v":202929224.097},{"$f":"'REVRUNS 12ME0921'!F333","v":266233832.708},{"$f":"'REVRUNS 12ME0921'!G333","v":264341796.26100001},{"$f":"'REVRUNS 12ME0921'!H333","v":251228086.95700002},{"$f":"'REVRUNS 12ME0921'!I333","v":267228806.39899999},{"$f":"'REVRUNS 12ME0921'!J333","v":191332085.25199997},{"$f":"'REVRUNS 12ME0921'!K333","v":156354485.69299999},{"$f":"'REVRUNS 12ME0921'!L333","v":169560071.39500001},{"$f":"'REVRUNS 12ME0921'!M333","v":236523875.56387001},{"$f":"'REVRUNS 12ME0921'!N333","v":232267594.53211004},{"$f":"'REVRUNS 12ME0921'!O333","v":177986435.86899003},{"$f":"SUM(C13:N13)","v":2573177392.3769703}]
[null,"Difference",{"$f":"C13-C10","v":0},{"$f":"D13-D10","v":0},0,0,-3061.3799999952316,-144.53000003099442,-2064.3600000143051,-8636.9000000357628,0,0,-3204.3499999642372,0,{"$f":"SUM(C14:N14)","v":-17111.520000040531},{"$f":"O14/O13","v":-6.6499573837129747E-6}]
[]
[null,"Block 1",{"$f":"(C7/C$10)*C$14","v":0},{"$f":"(D7/D$10)*D$14","v":0},{"$f":"(E7/E$10)*E$14","v":0},{"$f":"(F7/F$10)*F$14","v":0},{"$f":"(G7/G$10)*G$14","v":-1748.0220558939852},{"$f":"(H7/H$10)*H$14","v":-89.286969803285956},-1481.5640776306454,-6949.840907008268,0,0,{"$f":"(M7/M$10)*M$14","v":-2044.9260816610038},0,{"$f":"SUM(C16:N16)","v":-12313.640091997189}]
[null,"Block 2",{"$f":"(C8/C$10)*C$14","v":0},0,0,0,{"$f":"(G8/G$10)*G$14","v":-730.8170092529482},-33.02408528639026,-406.31595919754824,-1308.7846438415902,0,0,-802.65941912012045,0,{"$f":"SUM(C17:N17)","v":-3281.6011166985973}]
[null,"Block 3",0,0,0,0,{"$f":"(G9/G$10)*G$14","v":-582.54093484829787},-22.218944941318199,-176.47996318611152,-378.27444918590362,0,0,-356.76449918311283,0,{"$f":"SUM(C18:N18)","v":-1516.2787913447439}]
[null,null,{"$f":"SUM(C16:C18)","v":0},0,0,0,-3061.3799999952316,-144.53000003099442,-2064.3600000143051,-8636.900000035761,0,0,-3204.3499999642372,0,-17111.520000040531]
[]
[null,"Block 1",{"$f":"C7+C16","v":126671526.79886},{"$f":"D7+D16","v":141161403.90276},{"$f":"E7+E16","v":153279164.25044999},{"$f":"F7+F16","v":145336918.74568},{"$f":"G7+G16","v":143449110.22531411},{"$f":"H7+H16","v":165087181.63979021},137316526.38375235,125813521.131303,131235812.11885001,148068257.98974001,148226648.77078834,133468353.58196001,{"$f":"SUM(C21:N21)","v":1699114425.539248}]
[null,"Block 2",{"$f":"C8+C17","v":24044218.450139999},42000514.480240002,64752272.93355,65236875.307320006,{"$f":"G8+G17","v":59973528.000620745},61059896.849154718,37658780.321210802,23693032.20714616,29451849.342149999,60647956.696079999,58180839.330800883,33362568.635029998,{"$f":"SUM(C22:N22)","v":560062332.55344331}]
[null,"Block 3",6475352.4009999996,19767305.714000002,48202395.524000004,53768002.208000004,{"$f":"G9+G18","v":47805448.731065154},41081727.910055056,16356778.547036815,6847932.3545508143,8872409.9340000004,27807660.878050003,25860106.430520818,11155513.652000001,{"$f":"SUM(C23:N23)","v":314000634.28427869}]
[null,null,{"$f":"SUM(C21:C23)","v":157191097.65000001},202929224.097,266233832.708,264341796.26100001,251228086.95700002,267228806.39899999,191332085.25199997,156354485.69299996,169560071.39499998,236523875.56387001,232267594.53211004,177986435.86899,2573177392.3769703]
[null,null,{"$f":"C24-C13","v":0},0,0,0,0,0,0,0,0,0,0,0,0]
[]
[null,"Schedule 011/012/013"]
[null,"Block 1",{"$f":"'REVRUNS 12ME0921'!D94+'REVRUNS 12ME0921'!D108","v":31887245.50567},{"$f":"'REVRUNS 12ME0921'!E94+'REVRUNS 12ME0921'!E108","v":35575368.430610001},{"$f":"'REVRUNS 12ME0921'!F94+'REVRUNS 12ME0921'!F108","v":40524759.180289999},{"$f":"'REVRUNS 12ME0921'!G94+'REVRUNS 12ME0921'!G108","v":39753604.686340004},{"$f":"'REVRUNS 12ME0921'!H94+'REVRUNS 12ME0921'!H108","v":38289981.495010003},{"$f":"'REVRUNS 12ME0921'!I94+'REVRUNS 12ME0921'!I108","v":43794756.621959999},{"$f":"'REVRUNS 12ME0921'!J94+'REVRUNS 12ME0921'!J108","v":35657898.426019996},{"$f":"'REVRUNS 12ME0921'!K94+'REVRUNS 12ME0921'!K108","v":32732346.973000001},{"$f":"'REVRUNS 12ME0921'!L94+'REVRUNS 12ME0921'!L108","v":33387045.87032},{"$f":"'REVRUNS 12ME0921'!M94+'REVRUNS 12ME0921'!M108","v":37069630.626989998},{"$f":"'REVRUNS 12ME0921'!N94+'REVRUNS 12ME0921'!N108","v":37557464.583039999},{"$f":"'REVRUNS 12ME0921'!O94+'REVRUNS 12ME0921'!O108","v":34716231.497359999},{"$f":"SUM(C28:N28)","v":440946333.89661002},null,null,0,{"$f":"R28/$R$30","v":{"$error":"#DIV/0!"}}]
[null,"Block 2",{"$f":"'REVRUNS 12ME0921'!D95+'REVRUNS 12ME0921'!D109","v":12384485.62133},{"$f":"'REVRUNS 12ME0921'!E95+'REVRUNS 12ME0921'!E109","v":14024186.47539},{"$f":"'REVRUNS 12ME0921'!F95+'REVRUNS 12ME0921'!F109","v":19110166.93871},{"$f":"'REVRUNS 12ME0921'!G95+'REVRUNS 12ME0921'!G109","v":19543107.867659997},{"$f":"'REVRUNS 12ME0921'!H95+'REVRUNS 12ME0921'!H109","v":18153821.389990002},{"$f":"'REVRUNS 12ME0921'!I95+'REVRUNS 12ME0921'!I109","v":19730891.200039998},{"$f":"'REVRUNS 12ME0921'!J95+'REVRUNS 12ME0921'!J109","v":14519399.24698},{"$f":"'REVRUNS 12ME0921'!K95+'REVRUNS 12ME0921'!K109","v":13292301.325000001},{"$f":"'REVRUNS 12ME0921'!L95+'REVRUNS 12ME0921'!L109","v":15996335.302679999},{"$f":"'REVRUNS 12ME0921'!M95+'REVRUNS 12ME0921'!M109","v":19079039.269269999},{"$f":"'REVRUNS 12ME0921'!N95+'REVRUNS 12ME0921'!N109","v":22711224.199310001},{"$f":"'REVRUNS 12ME0921'!O95+'REVRUNS 12ME0921'!O109","v":17596146.413650002},{"$f":"SUM(C29:N29)","v":206141105.25001001},null,null,0,{"$f":"R29/$R$30","v":{"$error":"#DIV/0!"}}]
["kWhs","Total",{"$f":"SUM(C28:C29)","v":44271731.127000004},49599554.906000003,59634926.119000003,59296712.554000005,56443802.885000005,63525647.821999997,{"$f":"SUM(I28:I29)","v":50177297.672999993},{"$f":"SUM(J28:J29)","v":46024648.298},49383381.173,56148669.896259993,60268688.782350004,52312377.911009997,647087439.14662004,null,null,{"$f":"SUM(R28:R29)","v":0},{"$f":"SUM(S28:S29)","v":{"$error":"#DIV/0!"}}]
[null,"Revenue Run Total",{"$f":"'REVRUNS 12ME0921'!D334","v":44271731.127000004},{"$f":"'REVRUNS 12ME0921'!E334","v":49599554.906000003},{"$f":"'REVRUNS 12ME0921'!F334","v":59634926.119000003},{"$f":"'REVRUNS 12ME0921'!G334","v":59296712.553999998},{"$f":"'REVRUNS 12ME0921'!H334","v":56442930.274999999},{"$f":"'REVRUNS 12ME0921'!I334","v":63525007.321999997},{"$f":"'REVRUNS 12ME0921'!J334","v":50175295.732999995},{"$f":"'REVRUNS 12ME0921'!K334","v":46024648.298},{"$f":"'REVRUNS 12ME0921'!L334","v":49395218.012999997},{"$f":"'REVRUNS 12ME0921'!M334","v":56156052.786260001},{"$f":"'REVRUNS 12ME0921'!N334","v":60285008.26235},{"$f":"'REVRUNS 12ME0921'!O334","v":52327493.871009998},{"$f":"SUM(C31:N31)","v":647134579.26661992}]
[null,null,{"$f":"C31-C30","v":0},0,0,0,-872.61000000685453,-640.5,-2001.9399999976158,0,11836.839999996126,7382.8900000080466,16319.479999996722,15115.960000000894,{"$f":"SUM(C32:N32)","v":47140.119999997318},{"$f":"O32/O31","v":7.2844384321758753E-5}]
[]
[null,"Block 1",{"$f":"(C28/C$30)*C$32","v":0},{"$f":"(D28/D$30)*D$32","v":0},0,0,-591.95552115257055,-441.56246458066045,-1422.654795802468,0,8002.6338952987762,4874.2206318626631,10169.763180462669,10031.453121048404,{"$f":"SUM(C34:N34)","v":30621.898047136812}]
[null,"Block 2",{"$f":"(C29/C$30)*C$32","v":0},0,0,0,-280.65447885428409,-198.93753541933961,-579.28520419514803,0,3834.2061046973495,2508.6693681453839,6149.7168195340528,5084.5068789524903,{"$f":"SUM(C35:N35)","v":16518.221952860506}]
[null,null,{"$f":"SUM(C34:C35)","v":0},{"$f":"SUM(D34:D35)","v":0},0,0,-872.61000000685465,-640.5,-2001.939999997616,0,11836.839999996126,7382.8900000080466,16319.479999996722,15115.960000000894,{"$f":"SUM(O34:O35)","v":47140.119999997318}]
[]
[null,"Block 1",{"$f":"C28+C34","v":31887245.50567},{"$f":"D28+D34","v":35575368.430610001},40524759.180289999,39753604.686340004,38289389.539488852,43794315.059495419,35656475.771224193,32732346.973000001,33395048.5042153,37074504.847621858,37567634.346220464,34726262.95048105,{"$f":"SUM(C38:N38)","v":440976955.79465711}]
[null,"Block 2",{"$f":"C29+C35","v":12384485.62133},{"$f":"D29+D35","v":14024186.47539},19110166.93871,19543107.867659997,18153540.735511146,19730692.262504578,14518819.961775806,13292301.325000001,16000169.508784696,19081547.938638143,22717373.916129533,17601230.920528956,{"$f":"SUM(C39:N39)","v":206157623.47196287}]
[null,null,{"$f":"SUM(C38:C39)","v":44271731.127000004},49599554.906000003,59634926.119000003,59296712.554000005,56442930.274999999,63525007.321999997,50175295.732999995,46024648.298,49395218.012999997,56156052.786260001,60285008.262349993,52327493.871010005,647134579.26661992]
[null,null,{"$f":"C40-C31","v":0},0,0,0,0,0,0,0,0,0,0,0,0]
[]
[null,"Schedule 011/012"]
[null,"Block 1",null,null,null,null,null,null,null,null,null,null,null,null,{"$f":"SUM(C44:N44)","v":0},null,null,0]
[null,"Block 2",{"$f":"('REVRUNS 12ME0921'!D424+'REVRUNS 12ME0921'!D429)/6.5","v":39171.455384615387},{"$f":"('REVRUNS 12ME0921'!E424+'REVRUNS 12ME0921'!E429)/6.5","v":41966.470769230771},{"$f":"('REVRUNS 12ME0921'!F424+'REVRUNS 12ME0921'!F429)/6.5","v":41467.489230769228},{"$f":"('REVRUNS 12ME0921'!G424+'REVRUNS 12ME0921'!G429)/6.5","v":39369.426153846151},{"$f":"('REVRUNS 12ME0921'!H424+'REVRUNS 12ME0921'!H429)/6.5","v":41340.24461538461},{"$f":"('REVRUNS 12ME0921'!I424+'REVRUNS 12ME0921'!I429)/6.5","v":49154.340000000004},{"$f":"('REVRUNS 12ME0921'!J424+'REVRUNS 12ME0921'!J429)/6.5","v":43209.286153846151},{"$f":"('REVRUNS 12ME0921'!K424+'REVRUNS 12ME0921'!K429)/6.5","v":43592.115384615383},{"$f":"('REVRUNS 12ME0921'!L424+'REVRUNS 12ME0921'!L429)/6.5","v":52171.287692307691},{"$f":"('REVRUNS 12ME0921'!M424+'REVRUNS 12ME0921'!M429)/6.5","v":52912.404615384614},{"$f":"('REVRUNS 12ME0921'!N424+'REVRUNS 12ME0921'!N429)/6.5","v":59857.629230769227},{"$f":"('REVRUNS 12ME0921'!O424+'REVRUNS 12ME0921'!O429)/6.5","v":51324.556923076925},{"$f":"SUM(C45:N45)","v":555536.70615384611},{"$f":"(O45-(('REVRUNS 12ME0921'!P424+'REVRUNS 12ME0921'!P429)/6.5))","v":-1.1641532182693481E-10},null,0]
["kW","Total",{"$f":"SUM(C44:C45)","v":39171.455384615387},41966.470769230771,41467.489230769228,39369.426153846151,41340.24461538461,49154.340000000004,{"$f":"SUM(I44:I45)","v":43209.286153846151},{"$f":"SUM(J44:J45)","v":43592.115384615383},52171.287692307691,52912.404615384614,59857.629230769227,51324.556923076925,555536.70615384611,null,null,{"$f":"SUM(R44:R45)","v":0}]
[]
[null,"Schedule 011/012"]
[null,"kVar",{"$f":"('REVRUNS 12ME0921'!D425+'REVRUNS 12ME0921'!D430)/0.5","v":0},{"$f":"('REVRUNS 12ME0921'!E425+'REVRUNS 12ME0921'!E430)/0.5","v":0},{"$f":"('REVRUNS 12ME0921'!F425+'REVRUNS 12ME0921'!F430)/0.5","v":0},{"$f":"('REVRUNS 12ME0921'!G425+'REVRUNS 12ME0921'!G430)/0.5","v":0},{"$f":"('REVRUNS 12ME0921'!H425+'REVRUNS 12ME0921'!H430)/0.5","v":0},{"$f":"('REVRUNS 12ME0921'!I425+'REVRUNS 12ME0921'!I430)/0.5","v":0},{"$f":"('REVRUNS 12ME0921'!J425+'REVRUNS 12ME0921'!J430)/0.5","v":0},{"$f":"('REVRUNS 12ME0921'!K425+'REVRUNS 12ME0921'!K430)/0.5","v":0},{"$f":"('REVRUNS 12ME0921'!L425+'REVRUNS 12ME0921'!L430)/0.5","v":0},{"$f":"('REVRUNS 12ME0921'!M425+'REVRUNS 12ME0921'!M430)/0.5","v":0},{"$f":"('REVRUNS 12ME0921'!N425+'REVRUNS 12ME0921'!N430)/0.5","v":0},{"$f":"('REVRUNS 12ME0921'!O425+'REVRUNS 12ME0921'!O430)/0.5","v":0},{"$f":"SUM(C49:N49)","v":0},null,null,0]
[null,"pf Charge",0.5,0.5,0.5,0.5,0.5,0.5,0.5,0.5,0.5,0.5,0.5,0.5,0.5]
[null,"pf Revenue",{"$f":"C49*C50","v":0},0,0,0,0,0,0,0,0,0,0,0,0,{"$f":"O51-'REVRUNS 12ME0921'!P425-'REVRUNS 12ME0921'!P430","v":0}]
[]
[null,"Schedule 013"]
[null,"Block 1",0,0,0,0,0,0,0,0,0,0,0,0,{"$f":"SUM(C54:N54)","v":0},null,null,0,{"$f":"R54/$R$30","v":{"$error":"#DIV/0!"}}]
[null,"Block 2",0,0,0,0,0,0,0,0,0,0,0,0,{"$f":"SUM(C55:N55)","v":0},null,null,0,{"$f":"R55/$R$30","v":{"$error":"#DIV/0!"}}]
["kWhs","Total",{"$f":"SUM(C54:C55)","v":0},0,0,0,0,0,{"$f":"SUM(I54:I55)","v":0},{"$f":"SUM(J54:J55)","v":0},0,0,0,0,0,null,null,{"$f":"SUM(R54:R55)","v":0},{"$f":"SUM(S54:S55)","v":{"$error":"#DIV/0!"}}]
[null,"Revenue Run Total",{"$f":"'REVRUNS 12ME0921'!D335","v":0},{"$f":"'REVRUNS 12ME0921'!E335","v":0},{"$f":"'REVRUNS 12ME0921'!F335","v":0},{"$f":"'REVRUNS 12ME0921'!G335","v":0},{"$f":"'REVRUNS 12ME0921'!H335","v":0},{"$f":"'REVRUNS 12ME0921'!I335","v":0},{"$f":"'REVRUNS 12ME0921'!J335","v":0},{"$f":"'REVRUNS 12ME0921'!K335","v":0},{"$f":"'REVRUNS 12ME0921'!L335","v":0},{"$f":"'REVRUNS 12ME0921'!M335","v":0},{"$f":"'REVRUNS 12ME0921'!N335","v":0},{"$f":"'REVRUNS 12ME0921'!O335","v":0},{"$f":"SUM(C57:N57)","v":0}]
[null,null,{"$f":"C57-C56","v":0},0,0,0,0,0,0,0,0,0,0,0,{"$f":"SUM(C58:N58)","v":0},{"$f":"O58/O57","v":{"$error":"#DIV/0!"}}]
[]
[null,"Block 1",{"$f":"IF(C56=0,0,(C54/C$57)*C$58)","v":0},{"$f":"IF(D56=0,0,(D54/D$57)*D$58)","v":0},0,0,0,0,0,0,0,0,0,0,{"$f":"SUM(C60:N60)","v":0}]
[null,"Block 2",{"$f":"IF(C56=0,0,(C55/C$57)*C$58)","v":0},{"$f":"IF(D56=0,0,(D55/D$57)*D$58)","v":0},0,0,0,0,0,0,0,0,0,0,{"$f":"SUM(C61:N61)","v":0}]
[null,null,{"$f":"SUM(C60:C61)","v":0},{"$f":"SUM(D60:D61)","v":0},0,0,0,0,0,0,0,0,0,0,{"$f":"SUM(O60:O61)","v":0}]
[]
[null,"Block 1",{"$f":"C54+C60","v":0},{"$f":"D54+D60","v":0},0,0,0,0,0,0,0,0,0,0,{"$f":"SUM(C64:N64)","v":0}]
[null,"Block 2",{"$f":"C55+C61","v":0},{"$f":"D55+D61","v":0},0,0,0,0,0,0,0,0,0,0,{"$f":"SUM(C65:N65)","v":0}]
[null,null,{"$f":"SUM(C64:C65)","v":0},0,0,0,0,0,0,0,0,0,0,0,0]
[null,null,{"$f":"C66-C57","v":0},0,0,0,0,0,0,0,0,0,0,0,0]
[]
[null,"Schedule 013"]
[null,"Block 1",null,null,null,null,null,null,null,null,null,null,null,null,{"$f":"SUM(C70:N70)","v":0},null,null,0]
[null,"Block 2",{"$f":"'REVRUNS 12ME0921'!D434/'REVRUNS 12ME0921'!D436","v":0},{"$f":"'REVRUNS 12ME0921'!E434/'REVRUNS 12ME0921'!E436","v":0},{"$f":"'REVRUNS 12ME0921'!F434/'REVRUNS 12ME0921'!F436","v":0},{"$f":"'REVRUNS 12ME0921'!G434/'REVRUNS 12ME0921'!G436","v":0},{"$f":"'REVRUNS 12ME0921'!H434/'REVRUNS 12ME0921'!H436","v":0},{"$f":"'REVRUNS 12ME0921'!I434/'REVRUNS 12ME0921'!I436","v":0},{"$f":"'REVRUNS 12ME0921'!J434/'REVRUNS 12ME0921'!J436","v":0},{"$f":"'REVRUNS 12ME0921'!K434/'REVRUNS 12ME0921'!K436","v":0},{"$f":"'REVRUNS 12ME0921'!L434/'REVRUNS 12ME0921'!L436","v":0},{"$f":"'REVRUNS 12ME0921'!M434/'REVRUNS 12ME0921'!M436","v":0},{"$f":"'REVRUNS 12ME0921'!N434/'REVRUNS 12ME0921'!N436","v":0},{"$f":"'REVRUNS 12ME0921'!O434/'REVRUNS 12ME0921'!O436","v":0},{"$f":"SUM(C71:N71)","v":0},{"$f":"(O71-'REVRUNS 12ME0921'!D434/6.5)","v":0},null,0]
["kW","Total",{"$f":"SUM(C70:C71)","v":0},0,0,0,0,0,{"$f":"SUM(I70:I71)","v":0},{"$f":"SUM(J70:J71)","v":0},0,0,0,0,0,null,null,{"$f":"SUM(R70:R71)","v":0}]
[]
[null,"Schedule 013"]
[null,"kVar",{"$f":"'REVRUNS 12ME0921'!D435/'REVRUNS 12ME0921'!D437","v":0},{"$f":"'REVRUNS 12ME0921'!E435/'REVRUNS 12ME0921'!E437","v":0},{"$f":"'REVRUNS 12ME0921'!F435/'REVRUNS 12ME0921'!F437","v":0},{"$f":"'REVRUNS 12ME0921'!G435/'REVRUNS 12ME0921'!G437","v":0},{"$f":"'REVRUNS 12ME0921'!H435/'REVRUNS 12ME0921'!H437","v":0},{"$f":"'REVRUNS 12ME0921'!I435/'REVRUNS 12ME0921'!I437","v":0},{"$f":"'REVRUNS 12ME0921'!J435/'REVRUNS 12ME0921'!J437","v":0},{"$f":"'REVRUNS 12ME0921'!K435/'REVRUNS 12ME0921'!K437","v":0},{"$f":"'REVRUNS 12ME0921'!L435/'REVRUNS 12ME0921'!L437","v":0},{"$f":"'REVRUNS 12ME0921'!M435/'REVRUNS 12ME0921'!M437","v":0},{"$f":"'REVRUNS 12ME0921'!N435/'REVRUNS 12ME0921'!N437","v":0},{"$f":"'REVRUNS 12ME0921'!O435/'REVRUNS 12ME0921'!O437","v":0},{"$f":"SUM(C75:N75)","v":0},null,null,0]
[null,"pf Charge",0.5,0.5,0.5,0.5,0.5,0.5,0.5,0.5,0.5,0.5,0.5,0.5,0.5]
[null,"pf Revenue",{"$f":"C75*C76","v":0},0,0,0,0,0,0,0,0,0,0,0,0,{"$f":"'REVRUNS 12ME0921'!P435-O77","v":0}]
[]
[null,"Schedule 021/022/23"]
[null,"Block 1",{"$f":"'REVRUNS 12ME0921'!D138+'REVRUNS 12ME0921'!D152","v":93603641.795999989},{"$f":"'REVRUNS 12ME0921'!E138+'REVRUNS 12ME0921'!E152","v":91251241.268000007},{"$f":"'REVRUNS 12ME0921'!F138+'REVRUNS 12ME0921'!F152","v":101399678.682},{"$f":"'REVRUNS 12ME0921'!G138+'REVRUNS 12ME0921'!G152","v":99080351.245000005},{"$f":"'REVRUNS 12ME0921'!H138+'REVRUNS 12ME0921'!H152","v":92688027.354000002},{"$f":"'REVRUNS 12ME0921'!I138+'REVRUNS 12ME0921'!I152","v":107998787.38600001},{"$f":"'REVRUNS 12ME0921'!J138+'REVRUNS 12ME0921'!J152","v":92212015.991329998},{"$f":"'REVRUNS 12ME0921'!K138+'REVRUNS 12ME0921'!K152","v":88713277.826330006},{"$f":"'REVRUNS 12ME0921'!L138+'REVRUNS 12ME0921'!L152","v":97225277.773000002},{"$f":"'REVRUNS 12ME0921'!M138+'REVRUNS 12ME0921'!M152","v":107763025.97707},{"$f":"'REVRUNS 12ME0921'!N138+'REVRUNS 12ME0921'!N152","v":105007276.80667001},{"$f":"'REVRUNS 12ME0921'!O138+'REVRUNS 12ME0921'!O152","v":97912961.724999994},{"$f":"SUM(C80:N80)","v":1174855563.8304},null,null,0,{"$f":"R80/$R$82","v":{"$error":"#DIV/0!"}}]
[null,"Block 2",{"$f":"'REVRUNS 12ME0921'!D139+'REVRUNS 12ME0921'!D153","v":10683414.68},{"$f":"'REVRUNS 12ME0921'!E139+'REVRUNS 12ME0921'!E153","v":9618325.75},{"$f":"'REVRUNS 12ME0921'!F139+'REVRUNS 12ME0921'!F153","v":10592258.869999999},{"$f":"'REVRUNS 12ME0921'!G139+'REVRUNS 12ME0921'!G153","v":12488597.02},{"$f":"'REVRUNS 12ME0921'!H139+'REVRUNS 12ME0921'!H153","v":10688745.700000001},{"$f":"'REVRUNS 12ME0921'!I139+'REVRUNS 12ME0921'!I153","v":11101388.15},{"$f":"'REVRUNS 12ME0921'!J139+'REVRUNS 12ME0921'!J153","v":9390246.5766700003},{"$f":"'REVRUNS 12ME0921'!K139+'REVRUNS 12ME0921'!K153","v":9761943.4966700003},{"$f":"'REVRUNS 12ME0921'!L139+'REVRUNS 12ME0921'!L153","v":11338462.880000001},{"$f":"'REVRUNS 12ME0921'!M139+'REVRUNS 12ME0921'!M153","v":15871872.29001},{"$f":"'REVRUNS 12ME0921'!N139+'REVRUNS 12ME0921'!N153","v":15675387.853329999},{"$f":"'REVRUNS 12ME0921'!O139+'REVRUNS 12ME0921'!O153","v":12670777.289999999},{"$f":"SUM(C81:N81)","v":139881420.55667999},null,null,0,{"$f":"R81/$R$82","v":{"$error":"#DIV/0!"}}]
["kWhs","Total",{"$f":"SUM(C80:C81)","v":104287056.47599998},100869567.01800001,111991937.552,111568948.265,103376773.05400001,119100175.53600001,{"$f":"SUM(I80:I81)","v":101602262.568},{"$f":"SUM(J80:J81)","v":98475221.323000014},108563740.653,123634898.26708001,120682664.66000001,110583739.01499999,1314736984.38708,null,null,{"$f":"SUM(R80:R81)","v":0},{"$f":"SUM(S80:S81)","v":{"$error":"#DIV/0!"}}]
[null,"Revenue Run Total",{"$f":"'REVRUNS 12ME0921'!D336","v":104287056.476},{"$f":"'REVRUNS 12ME0921'!E336","v":100869567.01800001},{"$f":"'REVRUNS 12ME0921'!F336","v":111991937.552},{"$f":"'REVRUNS 12ME0921'!G336","v":111568948.265},{"$f":"'REVRUNS 12ME0921'!H336","v":103376773.05399999},{"$f":"'REVRUNS 12ME0921'!I336","v":119100175.536},{"$f":"'REVRUNS 12ME0921'!J336","v":101602262.568},{"$f":"'REVRUNS 12ME0921'!K336","v":98477284.443000004},{"$f":"'REVRUNS 12ME0921'!L336","v":108575433.53299999},{"$f":"'REVRUNS 12ME0921'!M336","v":123641112.42707999},{"$f":"'REVRUNS 12ME0921'!N336","v":120692566.97999999},{"$f":"'REVRUNS 12ME0921'!O336","v":110590885.53499998},{"$f":"SUM(C83:N83)","v":1314774003.38708}]
[null,null,{"$f":"C83-C82","v":0},0,0,0,0,0,0,2063.1199999898672,11692.879999995232,6214.1599999815226,9902.3199999779463,7146.5199999958277,{"$f":"SUM(C84:N84)","v":37018.999999940395},{"$f":"O84/O83","v":2.8156169733028792E-5}]
[]
[null,"Block 1",{"$f":"(C80/C$82)*C$84","v":0},{"$f":"(D80/D$82)*D$84","v":0},0,0,0,0,0,1858.6009281241513,10471.66852512536,5416.4050352277127,8616.1145032336462,6327.6657622475896,{"$f":"SUM(C86:N86)","v":32690.45475395846}]
[null,"Block 2",{"$f":"(C81/C$82)*C$84","v":0},{"$f":"(D81/D$82)*D$84","v":0},0,0,0,0,0,204.51907186571566,1221.2114748698714,797.75496475380976,1286.2054967442994,818.85423774823823,{"$f":"SUM(C87:N87)","v":4328.5452459819344}]
[null,null,{"$f":"SUM(C86:C87)","v":0},0,0,0,0,0,0,2063.1199999898672,11692.879999995232,6214.1599999815226,9902.3199999779463,7146.5199999958277,37018.999999940395]
[]
[null,"Block 1",{"$f":"C80+C86","v":93603641.795999989},{"$f":"D80+D86","v":91251241.268000007},101399678.682,99080351.245000005,92688027.354000002,107998787.38600001,92212015.991329998,88715136.427258134,97235749.441525131,107768442.38210523,105015892.92117324,97919289.39076224,{"$f":"SUM(C90:N90)","v":1174888254.2851541}]
[null,"Block 2",{"$f":"C81+C87","v":10683414.68},{"$f":"D81+D87","v":9618325.75},10592258.869999999,12488597.02,10688745.700000001,11101388.15,9390246.5766700003,9762148.0157418661,11339684.09147487,15872670.044974754,15676674.058826745,12671596.144237747,{"$f":"SUM(C91:N91)","v":139885749.101926}]
[null,null,{"$f":"SUM(C90:C91)","v":104287056.47599998},100869567.01800001,111991937.552,111568948.265,103376773.05400001,119100175.53600001,101602262.568,98477284.443000004,108575433.53300001,123641112.42707999,120692566.97999999,110590885.53499998,1314774003.3870802]
[null,null,{"$f":"C92-C83","v":0},0,0,0,0,0,0,0,0,0,0,0,0]
[]
[null,"Schedule 021/022"]
[null,"Block 1",null,null,null,null,null,null,null,null,null,null,null,null,{"$f":"SUM(C96:N96)","v":0},null,null,0]
[null,"Block 2",{"$f":"('REVRUNS 12ME0921'!D439+'REVRUNS 12ME0921'!D446)/6.5","v":244472.72923076924},{"$f":"('REVRUNS 12ME0921'!E439+'REVRUNS 12ME0921'!E446)/6.5","v":215069.29538461537},{"$f":"('REVRUNS 12ME0921'!F439+'REVRUNS 12ME0921'!F446)/6.5","v":208309.66153846154},{"$f":"('REVRUNS 12ME0921'!G439+'REVRUNS 12ME0921'!G446)/6.5","v":205974.6046153846},{"$f":"('REVRUNS 12ME0921'!H439+'REVRUNS 12ME0921'!H446)/6.5","v":200734.24307692304},{"$f":"('REVRUNS 12ME0921'!I439+'REVRUNS 12ME0921'!I446)/6.5","v":244440.53230769231},{"$f":"('REVRUNS 12ME0921'!J439+'REVRUNS 12ME0921'!J446)/6.5","v":213338.41846153844},{"$f":"('REVRUNS 12ME0921'!K439+'REVRUNS 12ME0921'!K446)/6.5","v":221849.7276923077},{"$f":"('REVRUNS 12ME0921'!L439+'REVRUNS 12ME0921'!L446)/6.5","v":248953.02000000002},{"$f":"('REVRUNS 12ME0921'!M439+'REVRUNS 12ME0921'!M446)/6.5","v":291830.54923076922},{"$f":"('REVRUNS 12ME0921'!N439+'REVRUNS 12ME0921'!N446)/6.5","v":266156.29230769229},{"$f":"('REVRUNS 12ME0921'!O439+'REVRUNS 12ME0921'!O446)/6.5","v":243728.63999999998},{"$f":"SUM(C97:N97)","v":2804857.7138461536},{"$f":"('REVRUNS 12ME0921'!P439+'REVRUNS 12ME0921'!P446)/6.5-O97","v":0},null,0]
["kW","Total",{"$f":"SUM(C96:C97)","v":244472.72923076924},215069.29538461537,208309.66153846154,205974.6046153846,200734.24307692304,244440.53230769231,213338.41846153844,221849.7276923077,248953.02000000002,291830.54923076922,266156.29230769229,243728.63999999998,2804857.7138461536,null,null,{"$f":"SUM(R96:R97)","v":0}]
[]
[null,"Schedule 021/022"]
[null,"kVar",{"$f":"('REVRUNS 12ME0921'!D440+'REVRUNS 12ME0921'!D447)/0.5","v":31536.560000000001},{"$f":"('REVRUNS 12ME0921'!E440+'REVRUNS 12ME0921'!E447)/0.5","v":27633.16},{"$f":"('REVRUNS 12ME0921'!F440+'REVRUNS 12ME0921'!F447)/0.5","v":24076.720000000001},{"$f":"('REVRUNS 12ME0921'!G440+'REVRUNS 12ME0921'!G447)/0.5","v":22595.599999999999},{"$f":"('REVRUNS 12ME0921'!H440+'REVRUNS 12ME0921'!H447)/0.5","v":22444.16},{"$f":"('REVRUNS 12ME0921'!I440+'REVRUNS 12ME0921'!I447)/0.5","v":28374.44},{"$f":"('REVRUNS 12ME0921'!J440+'REVRUNS 12ME0921'!J447)/0.5","v":27212.38},{"$f":"('REVRUNS 12ME0921'!K440+'REVRUNS 12ME0921'!K447)/0.5","v":32534.46},{"$f":"('REVRUNS 12ME0921'!L440+'REVRUNS 12ME0921'!L447)/0.5","v":31869.48},{"$f":"('REVRUNS 12ME0921'!M440+'REVRUNS 12ME0921'!M447)/0.5","v":33300.22},{"$f":"('REVRUNS 12ME0921'!N440+'REVRUNS 12ME0921'!N447)/0.5","v":33900.980000000003},{"$f":"('REVRUNS 12ME0921'!O440+'REVRUNS 12ME0921'!O447)/0.5","v":33677.380000000005},{"$f":"SUM(C101:N101)","v":349155.54000000004},null,null,0]
[null,"pf Charge",0.5,0.5,0.5,0.5,0.5,0.5,0.5,0.5,0.5,0.5,0.5,0.5,0.5]
[null,"pf Revenue",{"$f":"C101*C102","v":15768.28},13816.58,12038.36,11297.8,11222.08,14187.22,{"$f":"I101*I102","v":13606.19},{"$f":"J101*J102","v":16267.23},15934.74,16650.11,16950.490000000002,16838.690000000002,174577.77000000002,{"$f":"O103-'REVRUNS 12ME0921'!P440-'REVRUNS 12ME0921'!P447","v":9.2938989837421104E-12}]
[]
[null,"Schedule 023"]
[null,"Block 1",0,0,0,0,0,0,0,0,0,0,0,0,{"$f":"SUM(C106:N106)","v":0},null,null,0,{"$f":"R106/$R$82","v":{"$error":"#DIV/0!"}}]
[null,"Block 2",0,0,0,0,0,0,0,0,0,0,0,0,{"$f":"SUM(C107:N107)","v":0},null,null,0,{"$f":"R107/$R$82","v":{"$error":"#DIV/0!"}}]
["kWhs","Total",{"$f":"SUM(C106:C107)","v":0},0,0,0,0,0,{"$f":"SUM(I106:I107)","v":0},{"$f":"SUM(J106:J107)","v":0},0,0,0,0,0,null,null,{"$f":"SUM(R106:R107)","v":0},{"$f":"SUM(S106:S107)","v":{"$error":"#DIV/0!"}}]
[null,"Revenue Run Total",{"$f":"'REVRUNS 12ME0921'!D337","v":0},{"$f":"'REVRUNS 12ME0921'!E337","v":0},{"$f":"'REVRUNS 12ME0921'!F337","v":0},{"$f":"'REVRUNS 12ME0921'!G337","v":0},{"$f":"'REVRUNS 12ME0921'!H337","v":0},{"$f":"'REVRUNS 12ME0921'!I337","v":0},{"$f":"'REVRUNS 12ME0921'!J337","v":0},{"$f":"'REVRUNS 12ME0921'!K337","v":0},{"$f":"'REVRUNS 12ME0921'!L337","v":0},{"$f":"'REVRUNS 12ME0921'!M337","v":0},{"$f":"'REVRUNS 12ME0921'!N337","v":0},{"$f":"'REVRUNS 12ME0921'!O337","v":0},{"$f":"SUM(C109:N109)","v":0}]
[null,null,{"$f":"C109-C108","v":0},0,0,0,0,0,0,0,0,0,0,0,{"$f":"SUM(C110:N110)","v":0},{"$f":"O110/O109","v":{"$error":"#DIV/0!"}}]
[]
[null,"Block 1",{"$f":"IF(C108=0,0,(C106/C$108)*C$111)","v":0},{"$f":"IF(D108=0,0,(D106/D$108)*D$111)","v":0},0,0,0,0,0,0,0,0,0,0,{"$f":"SUM(C112:N112)","v":0}]
[null,"Block 2",{"$f":"IF(C108=0,0,(C107/C$108)*C$111)","v":0},{"$f":"IF(D108=0,0,(D107/D$108)*D$111)","v":0},0,0,0,0,0,0,0,0,0,0,{"$f":"SUM(C113:N113)","v":0}]
[null,null,{"$f":"SUM(C112:C113)","v":0},0,0,0,0,0,0,0,0,0,0,0,0]
[]
[null,"Block 1",{"$f":"C106+C112","v":0},{"$f":"D106+D112","v":0},0,0,0,0,0,0,0,0,0,0,{"$f":"SUM(C116:N116)","v":0}]
[null,"Block 2",{"$f":"C107+C113","v":0},{"$f":"D107+D113","v":0},0,0,0,0,0,0,0,0,0,0,{"$f":"SUM(C117:N117)","v":0}]
[null,null,{"$f":"SUM(C116:C117)","v":0},0,0,0,0,0,0,0,0,0,0,0,0]
[null,null,{"$f":"C118-C109","v":0},0,0,0,0,0,0,0,0,0,0,0,0]
[]
[null,"Schedule 023"]
[null,"Block 1",null,null,null,null,null,null,null,null,null,null,null,null,{"$f":"SUM(C122:N122)","v":0},null,null,0]
[null,"Block 2",{"$f":"'REVRUNS 12ME0921'!D453/'REVRUNS 12ME0921'!D456","v":0},{"$f":"'REVRUNS 12ME0921'!E453/'REVRUNS 12ME0921'!E456","v":0},{"$f":"'REVRUNS 12ME0921'!F453/'REVRUNS 12ME0921'!F456","v":0},{"$f":"'REVRUNS 12ME0921'!G453/'REVRUNS 12ME0921'!G456","v":0},{"$f":"'REVRUNS 12ME0921'!H453/'REVRUNS 12ME0921'!H456","v":0},{"$f":"'REVRUNS 12ME0921'!I453/'REVRUNS 12ME0921'!I456","v":0},{"$f":"'REVRUNS 12ME0921'!J453/'REVRUNS 12ME0921'!J456","v":0},{"$f":"'REVRUNS 12ME0921'!K453/'REVRUNS 12ME0921'!K456","v":0},{"$f":"'REVRUNS 12ME0921'!L453/'REVRUNS 12ME0921'!L456","v":0},{"$f":"'REVRUNS 12ME0921'!M453/'REVRUNS 12ME0921'!M456","v":0},{"$f":"'REVRUNS 12ME0921'!N453/'REVRUNS 12ME0921'!N456","v":0},{"$f":"'REVRUNS 12ME0921'!O453/'REVRUNS 12ME0921'!O456","v":0},{"$f":"SUM(C123:N123)","v":0},{"$f":"'REVRUNS 12ME0921'!P453/6.5-O123","v":0},null,0]
["kW","Total",{"$f":"SUM(C122:C123)","v":0},0,0,0,0,0,0,0,0,0,0,0,0,null,null,{"$f":"SUM(R122:R123)","v":0}]
[]
[null,"Schedule 023"]
[null,"kVar",{"$f":"'REVRUNS 12ME0921'!D454/'REVRUNS 12ME0921'!D457","v":0},{"$f":"'REVRUNS 12ME0921'!E454/'REVRUNS 12ME0921'!E457","v":0},{"$f":"'REVRUNS 12ME0921'!F454/'REVRUNS 12ME0921'!F457","v":0},{"$f":"'REVRUNS 12ME0921'!G454/'REVRUNS 12ME0921'!G457","v":0},{"$f":"'REVRUNS 12ME0921'!H454/'REVRUNS 12ME0921'!H457","v":0},{"$f":"'REVRUNS 12ME0921'!I454/'REVRUNS 12ME0921'!I457","v":0},{"$f":"'REVRUNS 12ME0921'!J454/'REVRUNS 12ME0921'!J457","v":0},{"$f":"'REVRUNS 12ME0921'!K454/'REVRUNS 12ME0921'!K457","v":0},{"$f":"'REVRUNS 12ME0921'!L454/'REVRUNS 12ME0921'!L457","v":0},{"$f":"'REVRUNS 12ME0921'!M454/'REVRUNS 12ME0921'!M457","v":0},{"$f":"'REVRUNS 12ME0921'!N454/'REVRUNS 12ME0921'!N457","v":0},{"$f":"'REVRUNS 12ME0921'!O454/'REVRUNS 12ME0921'!O457","v":0},{"$f":"SUM(C127:N127)","v":0},null,null,0]
[null,"pf Charge",0.5,0.5,0.5,0.5,0.5,0.5,0.5,0.5,0.5,0.5,0.5,0.5,0.5]
[null,"pf Revenue",{"$f":"C127*C128","v":0},0,0,0,0,0,{"$f":"I127*I128","v":0},{"$f":"J127*J128","v":0},0,0,0,0,0,{"$f":"O129-'REVRUNS 12ME0921'!P454","v":0}]
[]
[null,"Schedule 30/31/32"]
[null,"Block 1",{"$f":"'REVRUNS 12ME0921'!D224+'REVRUNS 12ME0921'!D237","v":3680066.3613399998},{"$f":"'REVRUNS 12ME0921'!E224+'REVRUNS 12ME0921'!E237","v":2200450.2938300003},{"$f":"'REVRUNS 12ME0921'!F224+'REVRUNS 12ME0921'!F237","v":1657773.4566499998},{"$f":"'REVRUNS 12ME0921'!G224+'REVRUNS 12ME0921'!G237","v":1549256.3176599999},{"$f":"'REVRUNS 12ME0921'!H224+'REVRUNS 12ME0921'!H237","v":1598409.9576699999},{"$f":"'REVRUNS 12ME0921'!I224+'REVRUNS 12ME0921'!I237","v":2112099.7893399997},{"$f":"'REVRUNS 12ME0921'!J224+'REVRUNS 12ME0921'!J237","v":2618756.7036599996},{"$f":"'REVRUNS 12ME0921'!K224+'REVRUNS 12ME0921'!K237","v":3817482.0986600001},{"$f":"'REVRUNS 12ME0921'!L224+'REVRUNS 12ME0921'!L237","v":4787806.1341599999},{"$f":"'REVRUNS 12ME0921'!M224+'REVRUNS 12ME0921'!M237","v":4985347.5385999996},{"$f":"'REVRUNS 12ME0921'!N224+'REVRUNS 12ME0921'!N237","v":5163291.5768999998},{"$f":"'REVRUNS 12ME0921'!O224+'REVRUNS 12ME0921'!O237","v":4749338.0183300003},{"$f":"SUM(C132:N132)","v":38920078.246799998},null,null,0,{"$f":"R132/$R$135","v":{"$error":"#DIV/0!"}}]
[null,"Block 2",{"$f":"'REVRUNS 12ME0921'!D225+'REVRUNS 12ME0921'!D238","v":951506.29165999999},{"$f":"'REVRUNS 12ME0921'!E225+'REVRUNS 12ME0921'!E238","v":484942.89467000001},{"$f":"'REVRUNS 12ME0921'!F225+'REVRUNS 12ME0921'!F238","v":496229.94835000002},{"$f":"'REVRUNS 12ME0921'!G225+'REVRUNS 12ME0921'!G238","v":457541.01433999999},{"$f":"'REVRUNS 12ME0921'!H225+'REVRUNS 12ME0921'!H238","v":488456.86483000003},{"$f":"'REVRUNS 12ME0921'!I225+'REVRUNS 12ME0921'!I238","v":610315.73765999998},{"$f":"'REVRUNS 12ME0921'!J225+'REVRUNS 12ME0921'!J238","v":740572.92951000005},{"$f":"'REVRUNS 12ME0921'!K225+'REVRUNS 12ME0921'!K238","v":1319292.6776700001},{"$f":"'REVRUNS 12ME0921'!L225+'REVRUNS 12ME0921'!L238","v":1733575.5426699999},{"$f":"'REVRUNS 12ME0921'!M225+'REVRUNS 12ME0921'!M238","v":1875773.9539600001},{"$f":"'REVRUNS 12ME0921'!N225+'REVRUNS 12ME0921'!N238","v":1866779.10014},{"$f":"'REVRUNS 12ME0921'!O225+'REVRUNS 12ME0921'!O238","v":1565268.5896699999},{"$f":"SUM(C133:N133)","v":12590255.54513},null,null,0,{"$f":"R133/$R$135","v":{"$error":"#DIV/0!"}}]
[null,"Block 3",{"$f":"'REVRUNS 12ME0921'!D226+'REVRUNS 12ME0921'!D239+'REVRUNS 12ME0921'!D212","v":9928352.9230000004},{"$f":"'REVRUNS 12ME0921'!E226+'REVRUNS 12ME0921'!E239+'REVRUNS 12ME0921'!E212","v":2552287.8744999999},{"$f":"'REVRUNS 12ME0921'!F226+'REVRUNS 12ME0921'!F239+'REVRUNS 12ME0921'!F212","v":2166109.7149999999},{"$f":"'REVRUNS 12ME0921'!G226+'REVRUNS 12ME0921'!G239+'REVRUNS 12ME0921'!G212","v":1722844.2439999999},{"$f":"'REVRUNS 12ME0921'!H226+'REVRUNS 12ME0921'!H239+'REVRUNS 12ME0921'!H212","v":2054433.1785000002},{"$f":"'REVRUNS 12ME0921'!I226+'REVRUNS 12ME0921'!I239+'REVRUNS 12ME0921'!I212","v":2770457.0540000005},{"$f":"'REVRUNS 12ME0921'!J226+'REVRUNS 12ME0921'!J239+'REVRUNS 12ME0921'!J212","v":4502947.3918300001},{"$f":"'REVRUNS 12ME0921'!K226+'REVRUNS 12ME0921'!K239+'REVRUNS 12ME0921'!K212","v":9778654.5916699991},{"$f":"'REVRUNS 12ME0921'!L226+'REVRUNS 12ME0921'!L239+'REVRUNS 12ME0921'!L212","v":15846945.56617},{"$f":"'REVRUNS 12ME0921'!M226+'REVRUNS 12ME0921'!M239+'REVRUNS 12ME0921'!M212","v":21332377.491689999},{"$f":"'REVRUNS 12ME0921'!N226+'REVRUNS 12ME0921'!N239+'REVRUNS 12ME0921'!N212","v":22876981.704970002},{"$f":"'REVRUNS 12ME0921'!O226+'REVRUNS 12ME0921'!O239+'REVRUNS 12ME0921'!O212","v":17225094.520999998},{"$f":"SUM(C134:N134)","v":112757486.25633},null,null,0,{"$f":"R134/$R$135","v":{"$error":"#DIV/0!"}}]
["kWhs","Total",{"$f":"SUM(C132:C134)","v":14559925.576000001},5237681.0630000001,4320113.1199999992,3729641.5759999999,4141300.0010000002,5492872.5810000002,7862277.0250000004,14915429.367999999,22368327.243000001,28193498.984249998,29907052.382010002,23539701.128999997,164267820.04826,null,null,{"$f":"SUM(R132:R134)","v":0},{"$f":"SUM(S132:S134)","v":{"$error":"#DIV/0!"}}]
[null,"Revenue Run Total",{"$f":"'REVRUNS 12ME0921'!D340","v":14559925.575999999},{"$f":"'REVRUNS 12ME0921'!E340","v":5237681.0630000001},{"$f":"'REVRUNS 12ME0921'!F340","v":4320113.1199999992},{"$f":"'REVRUNS 12ME0921'!G340","v":3729641.5759999999},{"$f":"'REVRUNS 12ME0921'!H340","v":4141300.0010000002},{"$f":"'REVRUNS 12ME0921'!I340","v":5492872.5810000002},{"$f":"'REVRUNS 12ME0921'!J340","v":7862277.0249999994},{"$f":"'REVRUNS 12ME0921'!K340","v":14915429.368000001},{"$f":"'REVRUNS 12ME0921'!L340","v":22368327.243000001},{"$f":"'REVRUNS 12ME0921'!M340","v":28193498.984249998},{"$f":"'REVRUNS 12ME0921'!N340","v":29907052.382009998},{"$f":"'REVRUNS 12ME0921'!O340","v":23539701.129000001},{"$f":"SUM(C136:N136)","v":164267820.04826}]
[null,null,{"$f":"C136-C135","v":0},0,0,0,0,0,0,0,0,0,0,0,{"$f":"SUM(C137:N137)","v":0},{"$f":"O137/O136","v":0}]
[]
[null,"Block 1",{"$f":"(C132/C$135)*C$137","v":0},{"$f":"(D132/D$135)*D$137","v":0},0,0,0,0,0,0,0,{"$f":"(L132/L$135)*L$137","v":0},0,0,{"$f":"SUM(C139:N139)","v":0}]
[null,"Block 2",{"$f":"(C133/C$135)*C$137","v":0},0,0,0,0,0,0,0,0,0,0,0,{"$f":"SUM(C140:N140)","v":0}]
[null,"Block 3",0,0,0,0,0,0,0,0,0,0,0,0,{"$f":"SUM(C141:N141)","v":0}]
[null,null,{"$f":"SUM(C139:C141)","v":0},0,0,0,0,0,0,0,0,0,0,0,0]
[]
[null,"Block 1",{"$f":"C132+C139","v":3680066.3613399998},{"$f":"D132+D139","v":2200450.2938300003},1657773.4566499998,1549256.3176599999,1598409.9576699999,2112099.7893399997,2618756.7036599996,3817482.0986600001,4787806.1341599999,{"$f":"L132+L139","v":4985347.5385999996},5163291.5768999998,4749338.0183300003,{"$f":"SUM(C144:N144)","v":38920078.246799998},{"$f":"O144/$O$147","v":0.23693063093773159}]
[null,"Block 2",{"$f":"C133+C140","v":951506.29165999999},484942.89467000001,496229.94835000002,457541.01433999999,488456.86483000003,610315.73765999998,740572.92951000005,1319292.6776700001,1733575.5426699999,1875773.9539600001,1866779.10014,1565268.5896699999,{"$f":"SUM(C145:N145)","v":12590255.54513},{"$f":"O145/$O$147","v":7.6644686350808858E-2}]
[null,"Block 3",9928352.9230000004,2552287.8744999999,2166109.7149999999,1722844.2439999999,2054433.1785000002,2770457.0540000005,4502947.3918300001,9778654.5916699991,15846945.56617,21332377.491689999,22876981.704970002,17225094.520999998,{"$f":"SUM(C146:N146)","v":112757486.25633},{"$f":"O146/$O$147","v":0.68642468271145951}]
[null,null,{"$f":"SUM(C144:C146)","v":14559925.576000001},5237681.0630000001,4320113.1199999992,3729641.5759999999,4141300.0010000002,5492872.5810000002,7862277.0250000004,14915429.367999999,22368327.243000001,28193498.984249998,29907052.382010002,23539701.128999997,164267820.04826,{"$f":"O147/$O$147","v":1}]
[null,null,{"$f":"C147-C136","v":0},0,0,0,0,0,0,0,0,0,0,0,0]
[]
[null,"Schedule 31/32"]
[null,"kVar",{"$f":"('REVRUNS 12ME0921'!D478+'REVRUNS 12ME0921'!D481+'REVRUNS 12ME0921'!D484)/0.5","v":0},{"$f":"('REVRUNS 12ME0921'!E478+'REVRUNS 12ME0921'!E481+'REVRUNS 12ME0921'!E484)/0.5","v":0},{"$f":"('REVRUNS 12ME0921'!F478+'REVRUNS 12ME0921'!F481+'REVRUNS 12ME0921'!F484)/0.5","v":0},{"$f":"('REVRUNS 12ME0921'!G478+'REVRUNS 12ME0921'!G481+'REVRUNS 12ME0921'!G484)/0.5","v":0},{"$f":"('REVRUNS 12ME0921'!H478+'REVRUNS 12ME0921'!H481+'REVRUNS 12ME0921'!H484)/0.5","v":0},{"$f":"('REVRUNS 12ME0921'!I478+'REVRUNS 12ME0921'!I481+'REVRUNS 12ME0921'!I484)/0.5","v":0},{"$f":"('REVRUNS 12ME0921'!J478+'REVRUNS 12ME0921'!J481+'REVRUNS 12ME0921'!J484)/0.5","v":0},{"$f":"('REVRUNS 12ME0921'!K478+'REVRUNS 12ME0921'!K481+'REVRUNS 12ME0921'!K484)/0.5","v":0},{"$f":"('REVRUNS 12ME0921'!L478+'REVRUNS 12ME0921'!L481+'REVRUNS 12ME0921'!L484)/0.5","v":0},{"$f":"('REVRUNS 12ME0921'!M478+'REVRUNS 12ME0921'!M481+'REVRUNS 12ME0921'!M484)/0.5","v":0},{"$f":"('REVRUNS 12ME0921'!N478+'REVRUNS 12ME0921'!N481+'REVRUNS 12ME0921'!N484)/0.5","v":0},{"$f":"('REVRUNS 12ME0921'!O478+'REVRUNS 12ME0921'!O481+'REVRUNS 12ME0921'!O484)/0.5","v":0},{"$f":"SUM(C151:N151)","v":0},null,null,0]
[null,"pf Charge",0.5,0.5,0.5,0.5,0.5,0.5,0.5,0.5,0.5,0.5,0.5,0.5,0.5]
[null,"pf Revenue",{"$f":"C151*C152","v":0},0,0,0,0,0,{"$f":"I151*I152","v":0},{"$f":"J151*J152","v":0},0,0,0,0,0,{"$f":"O153-'REVRUNS 12ME0921'!P478-'REVRUNS 12ME0921'!P481-'REVRUNS 12ME0921'!P484","v":0}]

{"sheet":"REVRUNS 12ME0921","index":14,"n_rows":485,"n_cols":17,"rows_kept":485,"cut":false,"hidden":false,"merged":[[388,1,389,1],[391,0,391,2],[352,0,389,0],[352,1,353,1],[355,1,356,1],[358,1,359,1],[361,1,362,1],[367,1,368,1],[370,1,371,1],[376,1,377,1],[382,1,383,1],[385,1,386,1],[364,1,365,1],[373,1,374,1],[379,1,380,1]]}
[]
[]
["\"Rev Norm Bill Determininant 12 ME Report\" for Report Date : '09/30/2021'"]
[]
["State Cde:WA"]
[]
[null,null,"Meters"]
[null,"Period",202010,{"$f":"C8+1","v":202011},{"$f":"D8+1","v":202012},202101,{"$f":"F8+1","v":202102},202103,202104,202105,202106,202107,202108,202109,"12 Month Average","Total"]
["Rate Schedule Num"]
["0001",null,221504,221521,222513,208615,210079,249973,223523,223080,223210,223403,223824,224044,{"$f":"AVERAGE(C10:N10)","v":222940.75},{"$f":"SUM(C10:N10)","v":2675289}]
["0002",null,449,482,482,473,502,574,540,549,560,555,524,573,{"$f":"AVERAGE(C11:N11)","v":521.91666666666663},{"$f":"SUM(C11:N11)","v":6263}]
["0011",null,23375,23357,23486,22183,22142,26006,23574,23463,23656,23596,23588,23644,23505.833333333332,282070]
["0012",null,10052,10013,10078,9584,9500,11146,10027,10071,10165,10189,10207,10218,10104.166666666666,121250]
[13,null,0,0,0,0,0,0,0,0,9,7,9,10,2.9166666666666665,35]
["0021",null,1831,1757,1805,1733,1655,2009,1832,1750,1782,1765,1725,1730,1781.1666666666667,21374]
["0022",null,47,41,47,47,46,50,50,44,45,44,44,44,45.75,549]
[23,null,0,0,0,0,0,0,0,2,3,2,4,2,{"$f":"AVERAGE(C17:N17)","v":1.0833333333333333},{"$f":"SUM(C17:N17)","v":13}]
["0025",null,23,23,23,23,23,23,23,22,22,22,22,22,22.583333333333332,271]
["25I",null,0,0,0,0,0,0,0,0,0,0,0,0,{"$f":"AVERAGE(C19:N19)","v":0},{"$f":"SUM(C19:N19)","v":0}]
["0030",null,54,55,55,54,54,54,55,55,55,55,57,56,54.916666666666664,659]
["0031",null,1221,1229,1234,1153,1185,1352,1242,1214,1243,1230,1238,1232,1231.0833333333333,14773]
["0032",null,1215,1272,1244,1158,1213,1341,1240,1221,1263,1254,1253,1225,1241.5833333333333,14899]
["0041",null,3,3,3,3,2,5,4,4,4,4,4,4,3.5833333333333335,43]
["0042",null,400,401,398,364,270,583,410,409,409,410,412,449,409.58333333333331,4915]
["0044",null,12,12,12,11,8,17,12,12,12,12,12,12,12,144]
["0045",null,8,8,8,8,8,8,8,8,8,8,8,8,8,96]
["0046",null,50,23,50,47,49,55,51,51,51,51,51,51,48.333333333333336,580]
["0047",null,0,0,0,0,0,0,0,0,0,0,0,0,0]
["0048",null,0,0,0,0,0,0,0,0,0,0,0,0,0]
["0058",null,0,0,0,0,0,0,0,0,0,0,0,0,0]
["0058A",null,0,0,0,0,0,0,0,0,0,0,0,0,0]
["0095",null,0,0,0,0,0,0,0,0,0,0,0,0,0]
["0099",null,0,0,0,0,0,0,0,0,0,0,0,0,0]
["025B",null,0,0,0,0,0,0,0,0,0,0,0,0,0]
["Total for WA",null,{"$f":"SUM(C10:C34)","v":260244},{"$f":"SUM(D10:D34)","v":260197},261438,245456,246736,293196,262591,261955,262497,262607,262982,263324,null,3143223]
[]
[]
["Total Meters Billed",null,null,null,null,null,null,null,null,null,null,null,null,null,"Average","Total"]
[null,"001/002",{"$f":"C10+C11","v":221953},{"$f":"D10+D11","v":222003},222995,209088,210581,250547,224063,223629,223770,223958,224348,224617,{"$f":"AVERAGE(C39:N39)","v":223462.66666666666},{"$f":"SUM(C39:N39)","v":2681552}]
[null,"011/012",{"$f":"C12+C13","v":33427},{"$f":"D12+D13","v":33370},33564,31767,31642,37152,33601,33534,33821,33785,33795,33862,33610,403320]
[null,13,{"$f":"C14","v":0},{"$f":"D14","v":0},0,0,0,0,0,0,9,7,9,10,2.9166666666666665,35]
[null,"021/022",{"$f":"C15+C16","v":1878},{"$f":"D15+D16","v":1798},1852,1780,1701,2059,1882,1794,1827,1809,1769,1774,1826.9166666666667,21923]
[null,23,{"$f":"C17","v":0},{"$f":"D17","v":0},0,0,0,0,0,2,3,2,4,2,1.0833333333333333,13]
[null,"025",{"$f":"C18","v":23},{"$f":"D18","v":23},23,23,23,23,23,22,22,22,22,22,22.583333333333332,271]
[null,"25I",{"$f":"C19","v":0},{"$f":"D19","v":0},0,0,0,0,0,0,0,0,0,0,0,0]
[null,"030/031/032",{"$f":"C20+C21+C22","v":2490},{"$f":"D20+D21+D22","v":2556},2533,2365,2452,2747,2537,2490,2561,2539,2548,2513,2527.5833333333335,30331]
[null,"04X",{"$f":"SUM(C23:C29)","v":473},{"$f":"SUM(D23:D29)","v":447},471,433,337,668,485,484,484,485,487,524,481.5,5778]
[null,"Total",{"$f":"SUM(C39:C47)","v":260244},{"$f":"SUM(D39:D47)","v":260197},261438,245456,246736,293196,262591,261955,262497,262607,262982,263324,261935.25,3143223]
[]
[]
[]
[]
["\"Rev Norm Bill Determininant 12 ME Report\" for Report Date : '09/30/2021'"]
[]
["State Cde:WA"]
[]
[null,null,null,"Usage"]
[null,null,"Period",202010,{"$f":"D58+1","v":202011},{"$f":"E58+1","v":202012},202101,{"$f":"G58+1","v":202102},202103,202104,202105,202106,202107,202108,202109,"12 Month Total"]
["Rate Schedule Num","Billing Determinant"]
["0001","BASIC CHARGE ELE",null,0,0,0,0,0,0,0,0,0,0,0,0,0]
[null,"KWH BLOCK 1",null,126405443.53719001,140824890.27610001,152919276.62445,144981840.01001,143075800.82137001,164669109.32076001,136944384.43382999,125480929.87554,130893949.55185001,147701171.63655001,147887643.98653001,133131158.84596001,{"$f":"SUM(D61:O61)","v":1694915598.92014}]
[null,"KWH BLOCK 2",null,23993897.59581,41865326.177900001,64557558.312550001,65034880.213990003,59764999.31363,60852901.142240003,37520727.883170001,23616941.672460001,29382819.899149999,60531393.970990002,58081591.439560004,33295882.146019999,{"$f":"SUM(D62:O62)","v":558498919.76747}]
[null,"KWH BLOCK 3",null,6466737.0439999998,19695168.544,48013860.729000002,53532179.240000002,47574216.43,40884900.662,16277699.706,6826543.875,8855416.4350000005,27762982.850000001,25818792.07502,11128060.719000001,312836558.30902004]
[null,"NA",null,0,0,0,0,0,0,0,0,0,0,0,0,{"$f":"SUM(D64:O64)","v":0}]
[null,"RIDER 59",null,0,0,0,0,0,0,0,0,0,0,0,0,{"$f":"SUM(D65:O65)","v":0}]
[null,"RIDER 74",null,0,0,0,0,0,0,0,0,0,0,0,0,{"$f":"SUM(D66:O66)","v":0}]
[null,"RIDER 75",null,0,0,0,0,0,0,0,0,0,0,0,0,0]
[null,"RIDER 91",null,0,0,0,0,-3061.38,-144.53,-2064.36,-8636.9,0,0,-3204.35,0,-17111.52]
[null,"RIDER 92",null,0,0,0,0,0,0,0,0,0,0,0,0,0]
[null,"RIDER 93",null,0,0,0,0,0,0,0,0,0,0,0,0,0]
[null,"RIDER 94",null,0,0,0,0,0,0,0,0,0,0,0,0,0]
[null,"RIDER 98",null,null,null,null,null,0,0,0,0,0,0,0,0,0]
[null,"AMI OPT OUT",null,null,null,null,null,null,null,null,null,null,null,0,0,0]
[null,"Total",null,{"$f":"SUM(D60:D73)","v":156866078.17700002},{"$f":"SUM(E60:E73)","v":202385384.998},265490695.66600001,263548899.46400002,250411955.185,266406766.595,190740747.66299999,155915778.523,169132185.88600001,235995548.45754001,231784823.15111002,177555101.71098003,2566233965.4766302]
["0002","BASIC CHARGE ELE",null,0,0,0,0,0,0,0,0,0,0,0,0,0]
[null,"KWH BLOCK 1",null,266083.26166999998,336513.62666000001,359887.62599999999,355078.73567000002,375057.42599999998,418161.60600000003,373623.51400000002,339541.09667,341862.56699999998,367086.35318999999,341049.71033999999,337194.73599999998,{"$f":"SUM(D76:O76)","v":4211140.2591999993}]
[null,"KWH BLOCK 2",null,50320.854330000002,135188.30233999999,194714.62100000001,201995.09333,209259.50399999999,207028.731,138458.75399999999,77399.319329999998,69029.442999999999,116562.72509000001,100050.55065999999,66686.489010000005,{"$f":"SUM(D77:O77)","v":1566694.3870900001}]
[null,"KWH BLOCK 3",null,8615.357,72137.17,188534.79500000001,235822.96799999999,231814.842,196849.467,79255.320999999996,21766.754000000001,16993.499,44678.028050000001,41671.120000000003,27452.933000000001,1165592.2540500001]
[null,"NA",null,0,0,0,0,0,0,0,0,0,0,0,0,0]
[null,"RIDER 59",null,0,0,0,0,0,0,0,0,0,0,0,0,0]
[null,"RIDER 75",null,0,0,0,0,0,0,0,0,0,0,0,0,0]
[null,"RIDER 89",null,0,0,0,0,0,0,0,0,0,0,0,0,0]
[null,"RIDER 91",null,0,0,0,0,0,0,0,0,0,0,0,0,0]
[null,"RIDER 92",null,0,0,0,0,0,0,0,0,0,0,0,0,0]
[null,"RIDER 93",null,0,0,0,0,0,0,0,0,0,0,0,0,0]
[null,"RIDER 94",null,0,0,0,0,0,0,0,0,0,0,0,0,0]
[null,"RIDER 98",null,0,0,0,0,0,0,0,0,0,0,0,0,0]
[null,"RIDER 74",null,null,null,null,null,0,0,0,0,0,0,0,0,0]
[null,"Total",null,{"$f":"SUM(D75:D88)","v":325019.473},{"$f":"SUM(E75:E88)","v":543839.09900000005},743137.04200000002,792896.79700000002,816131.77199999988,822039.804,591337.58900000004,438707.17,427885.50900000002,528327.10632999998,482771.38099999999,431334.15801000001,6943426.9003400002]
["0011","3 PHASE",null,0,0,0,0,0,0,0,0,0,0,0,0,{"$f":"SUM(D90:O90)","v":0}]
[null,"BASIC CHARGE ELE",null,0,0,0,0,0,0,0,0,0,0,0,0,0]
[null,"KVAR",null,0,0,0,0,0,0,0,0,0,0,0,0,0]
[null,"KW BLOCK 2",null,0,0,0,0,0,0,0,0,0,0,0,0,0]
[null,"KWH BLOCK 1",null,28407452.515000001,30951067.243280001,34532669.851290002,33690866.027010001,32587654.498679999,37423316.810630001,31126532.762019999,29061991.81233,29819430.941319998,33252926.97036,33653356.453029998,31082042.627360001,{"$f":"SUM(D94:O94)","v":385589308.51230991}]
[null,"KWH BLOCK 2",null,12057875.965,13548250.36772,18331569.39971,18682441.367989998,17396655.928320002,18841748.084369998,13994410.41298,12951338.397670001,15526680.36468,18451378.49419,22031279.225310002,17009508.225650001,{"$f":"SUM(D95:O95)","v":198823136.23359004}]
[null,"NA",null,0,0,0,0,0,0,0,0,0,0,0,0,0]
[null,"RIDER 75",null,0,0,0,0,0,0,0,0,0,0,0,0,0]
[null,"RIDER 91",null,0,0,0,0,0,0,-206.2,0,0,0,0,0,-206.2]
[null,"RIDER 92",null,0,0,0,0,0,0,0,0,0,0,0,0,0]
[null,"RIDER 93",null,0,0,0,0,0,0,0,0,0,0,0,0,0]
[null,"RIDER 94",null,0,0,0,0,0,0,0,0,0,0,0,0,0]
[null,"RIDER 98",null,0,0,0,0,0,0,0,0,0,0,0,0,0]
[null,"RIDER 74",null,null,null,null,null,0,0,0,0,0,0,0,0,0]
[null,"Total",null,{"$f":"SUM(D90:D103)","v":40465328.480000004},{"$f":"SUM(E90:E103)","v":44499317.611000001},52864239.251000002,52373307.394999996,49984310.427000001,56265064.894999996,45120736.974999994,42013330.210000001,45346111.305999994,51704305.464550003,55684635.678340003,48091550.853009999,{"$f":"SUM(P90:P103)","v":584412238.54589987}]
["0012","3 PHASE",null,0,0,0,0,0,0,0,0,0,0,0,0,{"$f":"SUM(D105:O105)","v":0}]
[null,"BASIC CHARGE ELE",null,0,0,0,0,0,0,0,0,0,0,0,0,0]
[null,"KW BLOCK 2",null,0,0,0,0,0,0,0,0,0,0,0,0,0]
[null,"KWH BLOCK 1",null,3479792.9906700002,4624301.1873300001,5992089.3289999999,6062738.6593300002,5702326.9963300005,6371439.8113299999,4531365.6639999999,3670355.1606700001,3567614.929,3816703.6566300001,3904108.13001,3634188.87,{"$f":"SUM(D108:O108)","v":55357025.384299994}]
[null,"KWH BLOCK 2",null,326609.65633000003,475936.10767,778597.53899999999,860666.49967000005,757165.46166999999,889143.11566999997,524988.83400000003,340962.92732999998,469654.93800000002,627660.77508000005,679944.97400000005,586638.18799999997,{"$f":"SUM(D109:O109)","v":7317969.0164200012}]
[null,"NA",null,0,0,0,0,0,0,0,0,0,0,0,0,0]
[null,"RIDER 59",null,0,0,0,0,0,0,0,0,0,0,0,0,0]
[null,"RIDER 75",null,0,0,0,0,0,0,0,0,0,0,0,0,0]
[null,"RIDER 91",null,0,0,0,0,-872.61,-640.5,-1795.74,0,0,0,0,0,-3308.8500000000004]
[null,"RIDER 92",null,0,0,0,0,0,0,0,0,0,0,0,0,0]
[null,"RIDER 93",null,0,0,0,0,0,0,0,0,0,0,0,0,0]
[null,"RIDER 94",null,0,0,0,0,0,0,0,0,0,0,0,0,0]
[null,"RIDER 98",null,0,0,0,0,0,0,0,0,0,0,0,0,0]
[null,"RIDER 74",null,null,null,null,null,0,0,0,0,0,0,0,0,0]
[null,"Total",null,{"$f":"SUM(D105:D118)","v":3806402.6470000003},{"$f":"SUM(E105:E118)","v":5100237.2949999999},6770686.8679999998,6923405.159,6458619.8480000002,7259942.4270000001,5054558.7579999994,4011318.088,4037269.8670000001,4444364.4317100001,4584053.1040099999,4220827.0580000002,{"$f":"SUM(P105:P118)","v":62671685.550719991}]
[13,"3 PHASE",null,0,0,0,0,0,0,0,0,0,0,0,0,{"$f":"SUM(D120:O120)","v":0}]
[null,"BASIC CHARGE ELE",null,0,0,0,0,0,0,0,0,0,0,0,0,0]
[null,"KW BLOCK 2",null,0,0,0,0,0,0,0,0,0,0,0,0,0]
[null,"KWH BLOCK 1",null,null,null,null,null,null,null,null,null,11836.84,7382.89,16319.48,15115.96,{"$f":"SUM(D123:O123)","v":50655.17}]
[null,"KWH BLOCK 2",null,0,0,0,0,0,0,0,0,0,0,0,0,{"$f":"SUM(D124:O124)","v":0}]
[null,"NA",null,0,0,0,0,0,0,0,0,0,0,0,0,0]
[null,"RIDER 59",null,0,0,0,0,0,0,0,0,0,0,0,0,0]
[null,"RIDER 75",null,0,0,0,0,0,0,0,0,0,0,0,0,0]
[null,"RIDER 91",null,0,0,0,0,0,0,0,0,0,0,0,0,0]
[null,"RIDER 92",null,0,0,0,0,0,0,0,0,0,0,0,0,0]
[null,"RIDER 93",null,0,0,0,0,0,0,0,0,0,0,0,0,0]
[null,"RIDER 94",null,0,0,0,0,0,0,0,0,0,0,0,0,0]
[null,"RIDER 98",null,0,0,0,0,0,0,0,0,0,0,0,0,0]
[null,"RIDER 74",null,null,null,null,null,0,0,0,0,0,0,0,0,0]
[null,"Total",null,{"$f":"SUM(D120:D133)","v":0},{"$f":"SUM(E120:E133)","v":0},0,0,0,0,0,0,11836.84,7382.89,16319.48,15115.96,{"$f":"SUM(P120:P133)","v":50655.17}]
["0021","BASIC CHARGE ELE",null,0,0,0,0,0,0,0,0,0,0,0,0,{"$f":"SUM(D135:O135)","v":0}]
[null,"KVAR",null,0,0,0,0,0,0,0,0,0,0,0,0,0]
[null,"KW BLOCK 2",null,0,0,0,0,0,0,0,0,0,0,0,0,0]
[null,"KWH BLOCK 1",null,91409929.835999995,89039288.348000005,98181963.601999998,95596385.525000006,89523107.873999998,104885309.206,89638803.631329998,86732460.626330003,95024244.033000007,105215223.69707,102396420.46667001,95655112.224999994,{"$f":"SUM(D138:O138)","v":1143298249.0704}]
[null,"KWH BLOCK 2",null,10662526.08,9618325.75,10592258.869999999,12454529.66,10673491.460000001,11051081.189999999,9390246.5766700003,9761943.4966700003,11338462.880000001,15843600.69001,15673675.25333,12670777.289999999,{"$f":"SUM(D139:O139)","v":139730919.19667998}]
[null,"NA",null,0,0,0,0,0,0,0,0,0,0,0,0,0]
[null,"PVD 11",null,0,0,0,0,0,0,0,0,0,0,0,0,0]
[null,"RIDER 75",null,0,0,0,0,0,0,0,0,0,0,0,0,0]
[null,"RIDER 91",null,0,0,0,0,0,0,0,0,0,0,0,0,0]
[null,"RIDER 92",null,0,0,0,0,0,0,0,0,0,0,0,0,0]
[null,"RIDER 93",null,0,0,0,0,0,0,0,0,0,0,0,0,0]
[null,"RIDER 94",null,0,0,0,0,0,0,0,0,0,0,0,0,0]
[null,"RIDER 98",null,0,0,0,0,0,0,0,0,0,0,0,0,0]
[null,"RIDER 74",null,null,null,null,null,0,0,0,0,0,0,0,0,0]
[null,"Total",null,{"$f":"SUM(D135:D148)","v":102072455.91599999},{"$f":"SUM(E135:E148)","v":98657614.098000005},108774222.472,108050915.185,100196599.33399999,115936390.396,99029050.208000004,96494404.122999996,106362706.913,121058824.38708,118070095.72,108325889.51499999,1283029168.2670801]
["0022","BASIC CHARGE ELE",null,0,0,0,0,0,0,0,0,0,0,0,0,0]
[null,"KW BLOCK 2",null,0,0,0,0,0,0,0,0,0,0,0,0,0]
[null,"KWH BLOCK 1",null,2193711.96,2211952.92,3217715.08,3483965.72,3164919.48,3113478.18,2573212.36,1980817.2,2201033.7400000002,2547802.2799999998,2610856.34,2257849.5,{"$f":"SUM(D152:O152)","v":31557314.760000002}]
[null,"KWH BLOCK 2",null,20888.599999999999,0,0,34067.360000000001,15254.24,50306.96,0,0,0,28271.599999999999,1712.6,0,{"$f":"SUM(D153:O153)","v":150501.36000000002}]
[null,"NA",null,0,0,0,0,0,0,0,0,0,0,0,0,0]
[null,"RIDER 59",null,0,0,0,0,0,0,0,0,0,0,0,0,0]
[null,"RIDER 75",null,0,0,0,0,0,0,0,0,0,0,0,0,0]
[null,"RIDER 91",null,0,0,0,0,0,0,0,0,0,0,0,0,0]
[null,"RIDER 92",null,0,0,0,0,0,0,0,0,0,0,0,0,0]
[null,"RIDER 93",null,0,0,0,0,0,0,0,0,0,0,0,0,0]
[null,"RIDER 94",null,0,0,0,0,0,0,0,0,0,0,0,0,0]
[null,"RIDER 98",null,0,0,0,0,0,0,0,0,0,0,0,0,0]
[null,"KVAR",null,null,null,null,null,0,0,0,0,0,0,0,0,0]
[null,"RIDER 74",null,null,null,null,null,0,0,0,0,0,0,0,0,0]
[null,"Total",null,{"$f":"SUM(D150:D163)","v":2214600.56},{"$f":"SUM(E150:E163)","v":2211952.92},3217715.08,3518033.08,3180173.72,3163785.14,2573212.36,1980817.2,2201033.7400000002,2576073.88,2612568.94,2257849.5,31707816.120000001]
[23,"BASIC CHARGE ELE",null,0,0,0,0,0,0,0,0,0,0,0,0,0]
[null,"KW BLOCK 2",null,0,0,0,0,0,0,0,0,0,0,0,0,0]
[null,"KWH BLOCK 1",null,null,null,null,null,null,null,null,2063.12,11692.88,6214.16,9902.32,7146.52,{"$f":"SUM(D167:O167)","v":37019}]
[null,"KWH BLOCK 2",null,0,0,0,0,0,0,0,0,0,0,0,0,{"$f":"SUM(D168:O168)","v":0}]
[null,"NA",null,0,0,0,0,0,0,0,0,0,0,0,0,0]
[null,"RIDER 59",null,0,0,0,0,0,0,0,0,0,0,0,0,0]
[null,"RIDER 75",null,0,0,0,0,0,0,0,0,0,0,0,0,0]
[null,"RIDER 91",null,0,0,0,0,0,0,0,0,0,0,0,0,0]
[null,"RIDER 92",null,0,0,0,0,0,0,0,0,0,0,0,0,0]
[null,"RIDER 93",null,0,0,0,0,0,0,0,0,0,0,0,0,0]
[null,"RIDER 94",null,0,0,0,0,0,0,0,0,0,0,0,0,0]
[null,"RIDER 98",null,0,0,0,0,0,0,0,0,0,0,0,0,0]
[null,"KVAR",null,null,null,null,null,0,0,0,0,0,0,0,0,0]
[null,"RIDER 74",null,null,null,null,null,0,0,0,0,0,0,0,0,0]
[null,"Total",null,{"$f":"SUM(D165:D178)","v":0},{"$f":"SUM(E165:E178)","v":0},0,0,0,0,0,2063.12,11692.88,6214.16,9902.32,7146.52,37019]
["0025","BASIC CHARGE ELE",null,0,0,0,0,0,0,0,0,0,0,0,0,{"$f":"SUM(D180:O180)","v":0}]
[null,"KW BLOCK 2",null,0,0,0,0,0,0,0,0,0,0,0,0,0]
[null,"KWH BLOCK 1",null,11500000,11500000,11457528.4,11268716,11500000,11500000,11500000,11000000,11000000,11000000,11000000,11000000,{"$f":"SUM(D182:O182)","v":135226244.40000001}]
[null,"KWH BLOCK 2",null,41157455.542000003,41922588.502999999,37598463.630000003,38313491.43,39615165.57,38742567.619999997,42629110.342,40010901.365000002,41803956.859999999,45018213.030000001,46436945.189999998,46654192.568000004,{"$f":"SUM(D183:O183)","v":499903051.6500001}]
[null,"KWH BLOCK 3",null,33406300,33072646,31955142,33841864,33435656,29292188,34784468,32726952,28594216,31627620,31858230,34324196,388919478]
[null,"NA",null,0,0,0,0,0,0,0,0,0,0,0,0,0]
[null,"PVD 11",null,0,0,0,0,0,0,0,0,0,0,0,0,0]
[null,"RIDER 75",null,0,0,0,0,0,0,0,0,0,0,0,0,0]
[null,"RIDER 91",null,0,0,0,0,0,0,0,0,0,0,0,0,0]
[null,"RIDER 92",null,0,0,0,0,0,0,0,0,0,0,0,0,0]
[null,"RIDER 93",null,0,0,0,0,0,0,0,0,0,0,0,0,0]
[null,"RIDER 94",null,0,0,0,0,0,0,0,0,0,0,0,0,0]
[null,"RIDER 98",null,0,0,0,0,0,0,0,0,0,0,0,0,0]
[null,"RIDER 74",null,null,null,null,null,null,0,0,0,0,0,0,0,0]
[null,"Total",null,{"$f":"SUM(D180:D193)","v":86063755.541999996},{"$f":"SUM(E180:E193)","v":86495234.502999991},81011134.030000001,83424071.430000007,84550821.569999993,79534755.620000005,88913578.342000008,83737853.36500001,81398172.859999999,87645833.030000001,89295175.189999998,91978388.568000004,1024048774.0500001]
["0025I","BASIC CHARGE ELE",null,0,0,0,0,0,0,0,0,0,0,0,0,{"$f":"SUM(D195:O195)","v":0}]
[null,"KW BLOCK 2",null,0,0,0,0,0,0,0,0,0,0,0,0,0]
[null,"KWH BLOCK 1",null,0,0,0,0,0,0,0,0,0,0,0,0,{"$f":"SUM(D197:O197)","v":0}]
[null,"KWH BLOCK 2",null,0,0,0,0,0,0,0,0,0,0,0,0,{"$f":"SUM(D198:O198)","v":0}]
[null,"KWH BLOCK 3",null,0,0,0,0,0,0,0,0,0,0,0,0,0]
[null,"NA",null,0,0,0,0,0,0,0,0,0,0,0,0,0]
[null,"PVD 11",null,0,0,0,0,0,0,0,0,0,0,0,0,0]
[null,"RIDER 75",null,0,0,0,0,0,0,0,0,0,0,0,0,0]
[null,"RIDER 91",null,0,0,0,0,0,0,0,0,0,0,0,0,0]
[null,"RIDER 92",null,0,0,0,0,0,0,0,0,0,0,0,0,0]
[null,"RIDER 93",null,0,0,0,0,0,0,0,0,0,0,0,0,0]
[null,"RIDER 94",null,0,0,0,0,0,0,0,0,0,0,0,0,0]
[null,"RIDER 98",null,0,0,0,0,0,0,0,0,0,0,0,0,0]
[null,"RIDER 74",null,null,null,null,null,null,0,0,0,0,0,0,0,0]
[null,"Total",null,{"$f":"SUM(D195:D208)","v":0},{"$f":"SUM(E195:E208)","v":0},0,0,0,0,0,0,0,0,0,0,{"$f":"SUM(P195:P208)","v":0}]
["0030","BASIC CHARGE ELE",null,0,0,0,0,0,0,0,0,0,0,0,0,{"$f":"SUM(D210:O210)","v":0}]
[null,"KVAR",null,0,0,0,0,0,0,0,0,0,0,0,0,0]
[null,"KWH BLOCK 1",null,3286472.5120000001,319130.81900000002,20397.651999999998,14218.388999999999,9956.4419999999991,263501.40399999998,2183781.1230000001,4684114.5389999999,6286333.801,6734210.6579999998,6859169.3650000002,5524638.6220000004,{"$f":"SUM(D212:O212)","v":36185925.325999998}]
[null,"NA",null,0,0,0,0,0,0,0,0,0,0,0,0,{"$f":"SUM(D213:O213)","v":0}]
[null,"RIDER 75",null,0,0,0,0,0,0,0,0,0,0,0,0,0]
[null,"RIDER 91",null,0,0,0,0,0,0,0,0,0,0,0,0,0]
[null,"RIDER 92",null,0,0,0,0,0,0,0,0,0,0,0,0,0]
[null,"RIDER 93",null,0,0,0,0,0,0,0,0,0,0,0,0,0]
[null,"RIDER 94",null,0,0,0,0,0,0,0,0,0,0,0,0,0]
[null,"RIDER 98",null,0,0,0,0,0,0,0,0,0,0,0,0,0]
[null,"RIDER 74",null,null,null,null,null,0,0,0,0,0,0,0,0,0]
[null,"Total",null,{"$f":"SUM(D210:D220)","v":3286472.5120000001},{"$f":"SUM(E210:E220)","v":319130.81900000002},20397.651999999998,14218.388999999999,9956.4419999999991,263501.40399999998,2183781.1230000001,4684114.5389999999,6286333.801,6734210.6579999998,6859169.3650000002,5524638.6220000004,36185925.325999998]
["0031","BASIC CHARGE ELE",null,0,0,0,0,0,0,0,0,0,0,0,0,{"$f":"SUM(D222:O222)","v":0}]
[null,"KVAR",null,0,0,0,0,0,0,0,0,0,0,0,0,0]
[null,"KWH BLOCK 1",null,3371252.2793399999,2037278.9595000001,1527927.5853299999,1418557.80899,1462823.4615,1955351.5319999999,2395923.6531699998,3442741.5156700001,4274890.11766,4414268.7607699996,4610880.2310600001,4304592.3590000002,{"$f":"SUM(D224:O224)","v":35216488.26399}]
[null,"KWH BLOCK 2",null,824706.96366000001,419003.56800000003,422784.01467,380638.94800999999,406198.83750000002,520301.61599999998,651284.43700000003,1116696.6436600001,1408665.29767,1478653.1562900001,1489683.46798,1309852.4169999999,{"$f":"SUM(D225:O225)","v":10428469.36744}]
[null,"KWH BLOCK 3",null,6433874.9790000003,2129171.2004999998,2025452.3130000001,1585834.47,1924796.111,2385461.6690000002,2136673.7738299998,4737690.6606700001,8828733.3296700008,13326647.595559999,14898728.857969999,11161158.414999999,71574223.375200003]
[null,"NA",null,0,0,0,0,0,0,0,0,0,0,0,0,0]
[null,"RIDER 75",null,0,0,0,0,0,0,0,0,0,0,0,0,0]
[null,"RIDER 91",null,0,0,0,0,0,0,0,0,0,0,0,0,0]
[null,"RIDER 92",null,0,0,0,0,0,0,0,0,0,0,0,0,0]
[null,"RIDER 93",null,0,0,0,0,0,0,0,0,0,0,0,0,0]
[null,"RIDER 94",null,0,0,0,0,0,0,0,0,0,0,0,0,0]
[null,"RIDER 98",null,0,0,0,0,0,0,0,0,0,0,0,0,0]
[null,"RIDER 74",null,null,null,null,null,0,0,0,0,0,0,0,0,0]
[null,"Total",null,{"$f":"SUM(D222:D234)","v":10629834.221999999},{"$f":"SUM(E222:E234)","v":4585453.7280000001},3976163.9129999997,3385031.227,3793818.41,4861114.8169999998,5183881.8640000001,9297128.8200000003,14512288.745000001,19219569.512619998,20999292.557009999,16775603.191,117219181.00663]
["0032","BASIC CHARGE ELE",null,0,0,0,0,0,0,0,0,0,0,0,0,{"$f":"SUM(D236:O236)","v":0}]
[null,"KWH BLOCK 1",null,308814.08199999999,163171.33433000001,129845.87132000001,130698.50867,135586.49617,156748.25734000001,222833.05048999999,374740.58299000002,512916.01650000003,571078.77783000004,552411.34583999997,444745.65932999999,{"$f":"SUM(D237:O237)","v":3703589.9828100004}]
[null,"KWH BLOCK 2",null,126799.32799999999,65939.326669999995,73445.933680000002,76902.066330000001,82258.027329999997,90014.121660000004,89288.492509999996,202596.03401,324910.245,397120.79767,377095.63215999998,255416.17267,{"$f":"SUM(D238:O238)","v":2161786.1776899998}]
[null,"KWH BLOCK 3",null,208005.432,103985.855,120259.75,122791.38499999999,119680.62549999999,121493.981,182492.495,356849.39199999999,731878.43550000002,1271519.23813,1119083.4820000001,539297.48400000005,4997337.5551300002]
[null,"NA",null,0,0,0,0,0,0,0,0,0,0,0,0,0]
[null,"RIDER 59",null,0,0,0,0,0,0,0,0,0,0,0,0,0]
[null,"RIDER 75",null,0,0,0,0,0,0,0,0,0,0,0,0,0]
[null,"RIDER 91",null,0,0,0,0,0,0,0,0,0,0,0,0,0]
[null,"RIDER 92",null,0,0,0,0,0,0,0,0,0,0,0,0,0]
[null,"RIDER 93",null,0,0,0,0,0,0,0,0,0,0,0,0,0]
[null,"RIDER 94",null,0,0,0,0,0,0,0,0,0,0,0,0,0]
[null,"RIDER 98",null,0,0,0,0,0,0,0,0,0,0,0,0,0]
[null,"RIDER 74",null,null,null,null,null,0,0,0,0,0,0,0,0,0]
[null,"Total",null,{"$f":"SUM(D236:D248)","v":643618.84199999995},{"$f":"SUM(E236:E248)","v":333096.516},{"$f":"SUM(F236:F248)","v":323551.55499999999},330391.96000000002,337525.14899999998,368256.36,494614.038,934186.00900000008,1569704.6970000002,2239718.8136299998,2048590.46,1239459.3160000001,10862713.71563]
["0041","LIGHTS",null,0,0,0,0,0,0,0,0,0,0,0,0,{"$f":"SUM(D250:O250)","v":0}]
[null,"NA",null,1141.6669999999999,1152.028,1302.067,1228.5329999999999,262,2129.933,1232.568,1215.0999999999999,1323.3340000000001,1291.934,1227.9670000000001,1326.1669999999999,{"$f":"SUM(D251:O251)","v":14833.298000000001}]
[null,"RIDER 91",null,0,0,0,0,0,0,0,0,0,0,0,0,{"$f":"SUM(D252:O252)","v":0}]
[null,"RIDER 92",null,0,0,0,0,0,0,0,0,0,0,0,0,0]
[null,"RIDER 93",null,0,0,0,0,0,0,0,0,0,0,0,0,0]
[null,"RIDER 94",null,0,0,0,0,0,0,0,0,0,0,0,0,0]
[null,"RIDER 98",null,0,0,0,0,0,0,0,0,0,0,0,0,0]
[null,"RIDER 74",null,null,null,null,null,0,0,0,0,0,0,0,0,0]
[null,"Total",null,{"$f":"SUM(D250:D257)","v":1141.6669999999999},{"$f":"SUM(E250:E257)","v":1152.028},1302.067,1228.5329999999999,262,2129.933,1232.568,1215.0999999999999,1323.3340000000001,1291.934,1227.9670000000001,1326.1669999999999,14833.298000000001]
["0042","LIGHTS",null,0,0,0,0,0,0,0,0,0,0,0,0,{"$f":"SUM(D259:O259)","v":0}]
[null,"NA",null,733983.40335000004,726490.06200000003,802326.41099999996,688428.478,685208.61199999996,878838.56599999999,713315.06559999997,715599.76100000006,771649.64800000004,731007.66799999995,737115.67700000003,772660.52500000002,{"$f":"SUM(D260:O260)","v":8956623.8769499995}]
[null,"RIDER 91",null,0,0,0,0,0,0,0,0,0,0,0,0,0]
[null,"RIDER 92",null,0,0,0,0,0,0,0,0,0,0,0,0,0]
[null,"RIDER 93",null,0,0,0,0,0,0,0,0,0,0,0,0,0]
[null,"RIDER 94",null,0,0,0,0,0,0,0,0,0,0,0,0,0]
[null,"RIDER 98",null,0,0,0,0,0,0,0,0,0,0,0,0,0]
[null,"RIDER 74",null,null,null,null,null,0,0,0,0,0,0,0,0,0]
[null,"Total",null,{"$f":"SUM(D259:D266)","v":733983.40335000004},{"$f":"SUM(E259:E266)","v":726490.06200000003},802326.41099999996,688428.478,685208.61199999996,878838.56599999999,713315.06559999997,715599.76100000006,771649.64800000004,731007.66799999995,737115.67700000003,772660.52500000002,8956623.8769499995]
["0044","LIGHTS",null,0,0,0,0,0,0,0,0,0,0,0,0,{"$f":"SUM(D268:O268)","v":0}]
[null,"NA",null,13827.699000000001,14032.512000000001,15339.550999999999,14589.398999999999,10822.741,16511.863000000001,12081.364,12212.332,12551.465,12435.099,12431.198,12500.465,{"$f":"SUM(D269:O269)","v":159335.68799999999}]
[null,"RIDER 91",null,0,0,0,0,0,0,0,0,0,0,0,0,{"$f":"SUM(D270:O270)","v":0}]
[null,"RIDER 92",null,0,0,0,0,0,0,0,0,0,0,0,0,0]
[null,"RIDER 93",null,0,0,0,0,0,0,0,0,0,0,0,0,0]
[null,"RIDER 94",null,0,0,0,0,0,0,0,0,0,0,0,0,0]
[null,"RIDER 98",null,0,0,0,0,0,0,0,0,0,0,0,0,0]
[null,"RIDER 74",null,null,null,null,null,0,0,0,0,0,0,0,0,0]
[null,"Total",null,{"$f":"SUM(D268:D275)","v":13827.699000000001},{"$f":"SUM(E268:E275)","v":14032.512000000001},15339.550999999999,14589.398999999999,10822.741,16511.863000000001,12081.364,12212.332,12551.465,12435.099,12431.198,12500.465,159335.68799999999]
["0045","LIGHTS",null,0,0,0,0,0,0,0,0,0,0,0,0,{"$f":"SUM(D277:O277)","v":0}]
[null,"NA",null,34479.300000000003,35551.648999999998,36009.277999999998,37978.567000000003,34687.733,33449.567000000003,35503.699999999997,33620.233999999997,34685.065999999999,38708.601000000002,31607.133999999998,34770.400000000001,{"$f":"SUM(D278:O278)","v":421051.22900000005}]
[null,"RIDER 91",null,0,0,0,0,0,0,0,0,0,0,0,0,{"$f":"SUM(D279:O279)","v":0}]
[null,"RIDER 92",null,0,0,0,0,0,0,0,0,0,0,0,0,0]
[null,"RIDER 93",null,0,0,0,0,0,0,0,0,0,0,0,0,0]
[null,"RIDER 94",null,0,0,0,0,0,0,0,0,0,0,0,0,0]
[null,"RIDER 98",null,0,0,0,0,0,0,0,0,0,0,0,0,0]
[null,"RIDER 74",null,null,null,null,null,0,0,0,0,0,0,0,0,0]
[null,"Total",null,{"$f":"SUM(D277:D284)","v":34479.300000000003},{"$f":"SUM(E277:E284)","v":35551.648999999998},36009.277999999998,37978.567000000003,34687.733,33449.567000000003,35503.699999999997,33620.233999999997,34685.065999999999,38708.601000000002,31607.133999999998,34770.400000000001,421051.22900000005]
["0046","LIGHTS",null,0,0,0,0,0,0,0,0,0,0,0,0,{"$f":"SUM(D286:O286)","v":0}]
[null,"NA",null,83956.900999999998,-86283.237999999998,84819.025999999998,60163.072999999997,79105.701000000001,80115.536999999997,76939.135999999999,75269.835999999996,81384.869000000006,80564.934999999998,75848.701000000001,80523.399000000005,{"$f":"SUM(D287:O287)","v":772407.87600000005}]
[null,"RIDER 91",null,0,0,0,0,0,0,0,0,0,0,0,0,{"$f":"SUM(D288:O288)","v":0}]
[null,"RIDER 92",null,0,0,0,0,0,0,0,0,0,0,0,0,0]
[null,"RIDER 93",null,0,0,0,0,0,0,0,0,0,0,0,0,0]
[null,"RIDER 94",null,0,0,0,0,0,0,0,0,0,0,0,0,0]
[null,"RIDER 98",null,0,0,0,0,0,0,0,0,0,0,0,0,0]
[null,"RIDER 74",null,null,null,null,null,0,0,0,0,0,0,0,0,0]
[null,"Total",null,{"$f":"SUM(D286:D293)","v":83956.900999999998},{"$f":"SUM(E286:E293)","v":-86283.237999999998},84819.025999999998,60163.072999999997,79105.701000000001,80115.536999999997,76939.135999999999,75269.835999999996,81384.869000000006,80564.934999999998,75848.701000000001,80523.399000000005,{"$f":"SUM(P286:P293)","v":772407.87600000005}]
["0047","LIGHTS",null,0,0,0,0,0,0,0,0,0,0,0,0,{"$f":"SUM(D295:O295)","v":0}]
[null,"NA",null,364550.58,362305.728,394682.17300000001,371383.15,325567.33601999999,401490.73353000003,354669.587,354774.15399999998,348468.81173999998,369109.288,360899.24300000002,362975.603,{"$f":"SUM(D296:O296)","v":4370876.38729}]
[null,"RIDER 91",null,0,0,0,0,0,0,0,0,0,0,0,0,{"$f":"SUM(D297:O297)","v":0}]
[null,"RIDER 92",null,0,0,0,0,0,0,0,0,0,0,0,0,0]
[null,"RIDER 93",null,0,0,0,0,0,0,0,0,0,0,0,0,0]
[null,"RIDER 94",null,0,0,0,0,0,0,0,0,0,0,0,0,0]
[null,"RIDER 98",null,0,0,0,0,0,0,0,0,0,0,0,0,0]
[null,"RIDER 74",null,null,null,null,null,0,0,0,0,0,0,0,0,0]
[null,"Total",null,{"$f":"SUM(D295:D302)","v":364550.58},{"$f":"SUM(E295:E302)","v":362305.728},394682.17300000001,371383.15,325567.33601999999,401490.73353000003,354669.587,354774.15399999998,348468.81173999998,369109.288,360899.24300000002,362975.603,4370876.38729]
["0048","LIGHTS",null,0,0,0,0,0,0,0,0,0,0,0,0,{"$f":"SUM(D304:O304)","v":0}]
[null,"NA",null,189396.13295999999,190563.78,204423.31899999999,193638.20600000001,171913.228,211597.68900000001,176108.89,177987.70993000001,191584.38699999999,192769.35,190589.16766000001,194096.266,{"$f":"SUM(D305:O305)","v":2284668.1255500005}]
[null,"RIDER 59",null,0,0,0,0,0,0,0,0,0,0,0,0,{"$f":"SUM(D306:O306)","v":0}]
[null,"RIDER 91",null,0,0,0,0,0,0,0,0,0,0,0,0,0]
[null,"RIDER 92",null,0,0,0,0,0,0,0,0,0,0,0,0,0]
[null,"RIDER 93",null,0,0,0,0,0,0,0,0,0,0,0,0,0]
[null,"RIDER 94",null,0,0,0,0,0,0,0,0,0,0,0,0,0]
[null,"RIDER 98",null,0,0,0,0,0,0,0,0,0,0,0,0,0]
[null,"RIDER 74",null,null,null,null,null,0,0,0,0,0,0,0,0,0]
[null,"Total",null,{"$f":"SUM(D304:D312)","v":189396.13295999999},{"$f":"SUM(E304:E312)","v":190563.78},204423.31899999999,193638.20600000001,171913.228,211597.68900000001,176108.89,177987.70993000001,191584.38699999999,192769.35,190589.16766000001,194096.266,2284668.1255500005]
["0058","RIDER 58",null,0,0,0,0,0,0,0,0,0,0,0,0,0]
[null,"NA",null,null,null,0,0,0,0,0,0,0,0,0,0,0]
[null,"Total",null,0,0,0,0,0,0,0,0,0,0,0,0,0]
["0058A","RIDER 58",null,0,0,0,0,0,0,0,0,0,0,0,0,0]
[null,"Total",null,0,0,0,0,0,0,0,0,0,0,0,0,0]
["0095","NA",null,0,0,0,0,0,0,0,0,0,0,0,0,0]
[null,"Total",null,0,0,0,0,0,0,0,0,0,0,0,0,0]
["0099","NA",null,0,0,0,0,0,0,0,0,0,0,0,0,0]
[null,"Total",null,0,0,0,0,0,0,0,0,0,0,0,0,0]
["025B","PVD 115",null,0,0,0,0,0,0,0,0,0,0,0,0,0]
[null,"PVD 60",null,0,0,0,0,0,0,0,0,0,0,0,0,0]
[null,"Total",null,0,0,0,0,0,0,0,0,0,0,0,0,0]
["Total",null,null,{"$f":"D74+D89+D104+D119+D149+D164+D194+D221+D235+D249+D258+D267+D276+D285+D294+D303+D313+D134+D179","v":407794902.05431008},446375074.10799998,524730845.35399991,523728579.49199986,501047479.20801991,536505751.3465299,441255349.2306,{"$f":"K74+K89+K104+K119+K149+K164+K194+K221+K235+K249+K258+K267+K276+K285+K294+K303+K313+K134+K179","v":400880380.29392999},{"$f":"L74+L89+L104+L119+L149+L164+L194+L221+L235+L249+L258+L267+L276+L285+L294+L303+L313+L134+L179","v":432738870.62474},533586259.66645998,533857116.43413001,457881757.79699981,5740382365.6097212]
[]
[]
[]
[]
[]
["Total Usage",null,null,202010,{"$f":"D332+1","v":202011},{"$f":"E332+1","v":202012},202101,{"$f":"G332+1","v":202102},202103,202104,202105,202106,202107,202108,202109]
[null,null,"001/002",{"$f":"D74+D89","v":157191097.65000001},{"$f":"E74+E89","v":202929224.097},266233832.708,264341796.26100001,251228086.95700002,267228806.39899999,191332085.25199997,156354485.69299999,169560071.39500001,236523875.56387001,232267594.53211004,177986435.86899003,{"$f":"SUM(D333:O333)","v":2573177392.3769703}]
[null,null,"011/012/13",{"$f":"D104+D119+D134","v":44271731.127000004},{"$f":"E104+E119+E134","v":49599554.906000003},59634926.119000003,59296712.553999998,56442930.274999999,63525007.321999997,50175295.732999995,46024648.298,49395218.012999997,56156052.786260001,60285008.26235,52327493.871009998,{"$f":"SUM(D334:O334)","v":647134579.26661992}]
[null,null,null,0,0,0,0,0,0,0,0,0,0,0,0,0]
[null,null,"021/022/23",{"$f":"D149+D164+D179","v":104287056.476},{"$f":"E149+E164+E179","v":100869567.01800001},111991937.552,111568948.265,103376773.05399999,119100175.536,101602262.568,98477284.443000004,108575433.53299999,123641112.42707999,120692566.97999999,110590885.53499998,1314774003.38708]
[null,null,null,0,0,0,0,0,0,0,0,0,0,0,0,0]
[null,null,"025",{"$f":"D194","v":86063755.541999996},{"$f":"E194","v":86495234.502999991},81011134.030000001,83424071.430000007,84550821.569999993,79534755.620000005,88913578.342000008,83737853.36500001,81398172.859999999,87645833.030000001,89295175.189999998,91978388.568000004,1024048774.0499998]
[null,null,"25I",{"$f":"D209","v":0},{"$f":"E209","v":0},0,0,0,0,0,0,0,0,0,0,0]
[null,null,"030/031/032",{"$f":"D221+D235+D249","v":14559925.575999999},{"$f":"E221+E235+E249","v":5237681.0630000001},4320113.1199999992,3729641.5759999999,4141300.0010000002,5492872.5810000002,7862277.0249999994,14915429.368000001,22368327.243000001,28193498.984249998,29907052.382009998,23539701.129000001,164267820.04826]
[null,null,"04X",{"$f":"D258+D267+D285+D276+D294+D313+D303","v":1421335.6833100002},{"$f":"E258+E267+E285+E276+E294+E313+E303","v":1243812.5210000002},1538901.825,1367409.406,1307567.3510199999,1624133.8885300001,1369850.3105999997,1370679.12693,1441647.5807399999,1425886.875,1409719.08766,1458852.8250000002,{"$f":"SUM(D341:O341)","v":16979796.48079}]
[null,null,"Total",{"$f":"SUM(D333:D341)","v":407794902.05430996},{"$f":"SUM(E333:E341)","v":446375074.1080001},524730845.35400003,523728579.49199998,501047479.20801997,536505751.34652996,441255349.23059994,400880380.29393005,432738870.62474,533586259.66645998,533857116.43413007,457881757.79700005,5740382365.6097202]
[]
[null,null,null,{"$f":"D326-D342","v":0},{"$f":"E326-E342","v":0},0,0,0,0,0,{"$f":"K326-K342","v":0},{"$f":"L326-L342","v":0},{"$f":"M326-M342","v":0},0,{"$f":"O326-O342","v":0}]
[]
["\"Rev Norm Unbill 12 ME Report\" for Report Date : '09/30/2021'"]
[]
["Jurisdiction:WA"]
[]
[null,null,null,"Unbilled Usage"]
[null,null,"Period",202010,{"$f":"D351+1","v":202011},{"$f":"E351+1","v":202012},202101,{"$f":"G351+1","v":202102},202103,202104,202105,202106,202107,202108,202109,"12 Month Total"]
["Source Id","Rate Schedule Num"]
["WA","001","REVUNBL-E",100735426,128171879,136611134,124982746,116926382,80053124,63981548,72781216,98594747,114322308,95611507,72836685,1205608702]
[null,null,"REVUNBL-ER",-84266206,-100735426,-128171879,-136611134,-124982746,-116926382,-80053124,-63981548,-72781216,-98594747,-114322308,-95611507,-1217038223]
[null,null,"Total",16469220,27436453,8439255,-11628388,-8056364,-36873258,-16071576,8799668,25813531,15727561,-18710801,-22774822,-11429521]
[null,"002","REVUNBL-E",208716,344421,382397,376025,381104,247024,198362,204789,249435,255935,0,176943,3025151]
[null,null,"REVUNBL-ER",-162424,-208716,-344421,-382397,-376025,-381104,-247024,-198362,-204789,-249435,-255935,0,-3010632]
[null,null,"Total",46292,135705,37976,-6372,5079,-134080,-48662,6427,44646,6500,-255935,176943,14519]
[null,"011","REVUNBL-E",25891714,28066325,27078217,24722190,23226839,16832797,15065503,19536845,26351097,24973929,22853486,19654342,274253284]
[null,null,"REVUNBL-ER",-20566795,-25891714,-28066325,-27078217,-24722190,-23226839,-16832797,-15065503,-19536845,-26351097,-24973929,-22853486,-275165737]
[null,null,"Total",5324919,2174611,-988108,-2356027,-1495351,-6394042,-1767294,4471342,6814252,-1377168,-2120443,-3199144,-912453]
[null,"012","REVUNBL-E",2444850,3230051,3483601,3283372,3015938,2181620,1695529,1872487,2353512,2152958,1887000,1731473,29332391]
[null,null,"REVUNBL-ER",-1781581,-2444850,-3230051,-3483601,-3283372,-3015938,-2181620,-1695529,-1872487,-2353512,-2152958,-1887000,-29382499]
[null,null,"Total",663269,785201,253550,-200229,-267434,-834318,-486091,176958,481025,-200554,-265958,-155527,-50108]
[null,13,"REVUNBL-E",0,0,0,0,0,0,0,0,0,0,0,0,0]
[null,null,"REVUNBL-ER",0,0,0,0,0,0,0,0,0,0,0,0,0]
[null,null,"Total",16469220,27436453,8439255,-11628388,-8056364,-36873258,-16071576,8799668,25813531,15727561,-18710801,-22774822,-11429521]
[null,"021","REVUNBL-E",65171080,62097810,55604776,50907879,46440782,34637872,33007907,44769147,61643136,58358513,48341458,44179689,605160049]
[null,null,"REVUNBL-ER",-47191078,-65171080,-62097810,-55604776,-50907879,-46440782,-34637872,-33007907,-44769147,-61643136,-58358513,-48341458,-608171438]
[null,null,"Total",17980002,-3073270,-6493034,-4696897,-4467097,-11802910,-1629965,11761240,16873989,-3284623,-10017055,-4161769,-3011389]
[null,"022","REVUNBL-E",1422135,1400862,1655745,1668401,1485025,950721,863173,924648,1283086,1247914,1075450,926219,14903379]
[null,null,"REVUNBL-ER",-1064599,-1422135,-1400862,-1655745,-1668401,-1485025,-950721,-863173,-924648,-1283086,-1247914,-1075450,-15041759]
[null,null,"Total",357536,-21273,254883,12656,-183376,-534304,-87548,61475,358438,-35172,-172464,-149231,-138380]
[null,23,"REVUNBL-E",0,0,0,0,0,0,0,0,0,0,0,0,0]
[null,null,"REVUNBL-ER",0,0,0,0,0,0,0,0,0,0,0,0,0]
[null,null,"Total",16469220,27436453,8439255,-11628388,-8056364,-36873258,-16071576,8799668,25813531,15727561,-18710801,-22774822,-11429521]
[null,"025","REVUNBL-E",86330392,80668735,83626479,83625209,79439138,88665576,84356951,80807475,87774134,89259226,92631840,88547307,1025732462]
[null,null,"REVUNBL-ER",-85477326,-86330392,-80668735,-83626479,-83625209,-79439138,-88665576,-84356951,-80807475,-87774134,-89259226,-92631840,-1022662481]
[null,null,"Total",853066,-5661657,2957744,-1270,-4186071,9226438,-4308625,-3549476,6966659,1485092,3372614,-4084533,3069981]
[null,"025I","REVUNBL-E",0,0,0,0,0,0,0,0,0,0,0,0,0]
[null,null,"REVUNBL-ER",0,0,0,0,0,0,0,0,0,0,0,0,0]
[null,null,"Total",0,0,0,0,0,0,0,0,0,0,-18710801,0,0]
[null,"031","REVUNBL-E",5915234,2636657,1936911,1500953,1677482,1383352,1396566,3175628,6559713,7265086,7055042,5844965,46347589]
[null,null,"REVUNBL-ER",-6714341,-5915234,-2636657,-1936911,-1500953,-1677482,-1383352,-1396566,-3175628,-6559713,-7265086,-7055042,-47216965]
[null,null,"Total",-799107,-3278577,-699746,-435958,176529,-294130,13214,1779062,3384085,705373,-210044,-1210077,-869376]
[null,"032","REVUNBL-E",283923,178871,154834,145341,148175,103939,106407,260896,617006,804209,607526,362226,3773353]
[null,null,"REVUNBL-ER",-483784,-283923,-178871,-154834,-145341,-148175,-103939,-106407,-260896,-617006,-804209,-607526,-3894911]
[null,null,"Total",-199861,-105052,-24037,-9493,2834,-44236,2468,154489,356110,187203,-196683,-245300,-121558]
[null,"0032","REVUNBL-E",null,null,null,null,null,0,0,0,0,0,0,0,0]
[null,null,"REVUNBL-ER",null,null,null,null,null,null,0,0,0,0,0,0,0]
[null,null,"Total",0,0,0,0,0,0,0,0,0,0,0,0,0]
["Total",null,null,40695336,18392141,3738483,-19321978,-18471251,-47684840,-24384079,23661185,61092735,13214212,-28576769,-35803460,-13448285]
[]
[]
[null,null,"001/002",{"$f":"SUM(D353:D354,D356:D357)","v":16515512},{"$f":"SUM(E353:E354,E356:E357)","v":27572158},8477231,-11634760,-8051285,-37007338,-16120238,8806095,25858177,15734061,-18966736,-22597879,{"$f":"SUM(D395:O395)","v":-11415002}]
[null,null,"011/012",{"$f":"SUM(D359:D360,D362:D363,D365:D366)-D397","v":5988188},{"$f":"SUM(E359:E360,E362:E363,E365:E366)-E397","v":2959812},-734558,-2556256,-1762785,-7228360,-2253385,4648300,7295277,-1577722,-2386401,-3354671,{"$f":"SUM(D396:O396)","v":-962561}]
[null,null,13,{"$f":"SUM(D365:D366)","v":0},{"$f":"SUM(E365:E366)","v":0},0,0,0,0,0,0,0,0,0,0,0]
[null,null,"021/022",{"$f":"SUM(D368:D369,D371:D372,D374:D375)-D399","v":18337538},{"$f":"SUM(E368:E369,E371:E372,E374:E375)-E399","v":-3094543},-6238151,-4684241,-4650473,-12337214,-1717513,11822715,17232427,-3319795,-10189519,-4311000,-3149769]
[null,null,23,{"$f":"SUM(D374:D375)","v":0},{"$f":"SUM(E374:E375)","v":0},0,0,0,0,0,0,0,0,0,0,0]
[null,null,"025",{"$f":"SUM(D377:D378)","v":853066},{"$f":"SUM(E377:E378)","v":-5661657},2957744,-1270,-4186071,9226438,-4308625,-3549476,6966659,1485092,3372614,-4084533,3069981]
[null,null,"25I",{"$f":"SUM(D380:D381)","v":0},{"$f":"SUM(E380:E381)","v":0},0,0,0,0,0,0,0,0,0,0,0]
[null,null,"030/031/032",{"$f":"SUM(D383:D384,D386:D387,D389:D390)","v":-998968},{"$f":"SUM(E383:E384,E386:E387,E389:E390)","v":-3383629},-723783,-445451,179363,-338366,15682,1933551,3740195,892576,-406727,-1455377,-990934]
[null,null,null,{"$f":"SUM(D395:D402)","v":40695336},{"$f":"SUM(E395:E402)","v":18392141},{"$f":"SUM(F395:F402)","v":3738483},-19321978,-18471251,-47684840,-24384079,23661185,61092735,13214212,-28576769,-35803460,{"$f":"SUM(D403:O403)","v":-13448285}]
[null,null,null,{"$f":"D392-D403","v":0},{"$f":"E392-E403","v":0},{"$f":"F392-F403","v":0},0,0,0,0,0,0,0,0,0,{"$f":"SUM(P395:P402)","v":-13448285},"Total"]
[]
[null,null,null,null,null,null,null,null,null,null,null,null,null,null,null,{"$f":"P404-P392","v":0}]
[]
[]
[]
[]
[]
[]
[]
[]
["\"Rev Norm Bill Determininant 12 ME Report\" for Report Date : '09/30/2021'"]
[]
["State Cde:WA"]
[]
[null,null,null,"Revenue Amt"]
[null,null,"Period",202010,{"$f":"D420+1","v":202011},{"$f":"E420+1","v":202012},202101,{"$f":"G420+1","v":202102},202103,202104,202105,202106,202107,202108,202109,"12 Month Total"]
[]
["Demand, PF and PVD Calc Support"]
["Schedule 11"]
[null,"Block 2 Demand Revenue",null,247870.31,264144.65999999997,259132.49,245103.55,258004.24,307184.59000000003,272079.98,276441.92,331450.92,335700.08,380171.99,325668.44,{"$f":"SUM(D424:O424)","v":3502953.1700000004}]
[null,"Power Factor Revenue",null,0,0,0,0,0,0,0,0,0,0,0,0,{"$f":"SUM(D425:O425)","v":0}]
[null,"Block 2 Demand Rate",null,6.5,{"$f":"D426","v":6.5},{"$f":"E426","v":6.5},6.5,6.5,6.5,6.5,6.5,6.5,6.5,6.5,6.5]
[null,"Power Factor Rate",null,0.5,{"$f":"D427","v":0.5},0.5,0.5,0.5,0.5,0.5,0.5,0.5,0.5,0.5,0.5]
["Schedule 12"]
[null,"Block 2 Demand Revenue",null,6744.15,8637.4,10406.19,10797.72,10707.35,12318.62,8780.3799999999992,6906.83,7662.45,8230.5499999999993,8902.6,7941.18,{"$f":"SUM(D429:O429)","v":108035.42000000001}]
[null,"Power Factor Revenue",null,0,0,0,0,0,0,0,0,0,0,0,0,0]
[null,"Block 2 Demand Rate",null,6.5,{"$f":"D431","v":6.5},{"$f":"E431","v":6.5},6.5,6.5,6.5,6.5,6.5,6.5,6.5,6.5,6.5]
[null,"Power Factor Rate",null,0.5,{"$f":"D432","v":0.5},0.5,0.5,0.5,0.5,0.5,0.5,0.5,0.5,0.5,0.5]
["Schedule 13"]
[null,"Block 2 Demand Revenue",null,0,0,0,0,0,0,0,0,0,0,0,0,{"$f":"SUM(D434:O434)","v":0}]
[null,"Power Factor Revenue",null,0,0,0,0,0,0,0,0,0,0,0,0,0]
[null,"Block 2 Demand Rate",null,6.5,{"$f":"D436","v":6.5},{"$f":"E436","v":6.5},{"$f":"F436","v":6.5},{"$f":"G436","v":6.5},{"$f":"H436","v":6.5},{"$f":"I436","v":6.5},{"$f":"J436","v":6.5},{"$f":"K436","v":6.5},{"$f":"L436","v":6.5},{"$f":"M436","v":6.5},{"$f":"N436","v":6.5}]
[null,"Power Factor Rate",null,0.5,{"$f":"D437","v":0.5},0.5,0.5,0.5,0.5,0.5,0.5,0.5,0.5,0.5,0.5]
["Schedule 21"]
[null,"Block 2 Demand Revenue",null,1565484.69,1368803.64,1323381.07,1306632.17,1268545.44,1554125.82,1359088.71,1421000.03,1593822.03,1865695.92,1702451.88,1560680.26,{"$f":"SUM(D439:O439)","v":17889711.66}]
[null,"Power Factor Revenue",null,15753.08,13798.19,12038.36,11297.8,11222.08,14187.22,13606.19,16251.77,15920.15,16629.54,16910.59,16810.29,174425.26]
[null,"Prim. Volt. Disc. Revenue",null,-6554.71,-3702.32,-4540.07,-3894.86,-4875.96,-5098.18,-4195.1899999999996,-4974.09,-5098.93,-6345.9,-6099.51,-5453.15,-60832.87000000001]
[null,"Block 2 Demand Rate",null,6.5,{"$f":"D442","v":6.5},{"$f":"E442","v":6.5},6.5,6.5,6.5,6.5,6.5,6.5,6.5,6.5,6.5]
[null,"Power Factor Rate",null,0.5,{"$f":"D443","v":0.5},0.5,0.5,0.5,0.5,0.5,0.5,0.5,0.5,0.5,0.5]
[null,"Prim. Volt. Disc. Rate",null,-0.2,{"$f":"D444","v":-0.2},-0.2,-0.2,-0.2,-0.2,-0.2,-0.2,-0.2,-0.2,-0.2,-0.2]
["Schedule 22"]
[null,"Block 2 Demand Revenue",null,23588.05,29146.78,30631.73,32202.76,36227.14,34737.64,27611.01,21023.200000000001,24372.6,31202.65,27564.02,23555.9,{"$f":"SUM(D446:O446)","v":341863.48000000004}]
[null,"Power Factor Revenue",null,15.2,18.39,0,null,null,null,null,15.46,14.59,20.57,39.9,28.4,152.51000000000002]
[null,"Prim. Volt. Disc. Revenue",null,0,0,0,0,0,0,0,0,0,0,0,0,0]
[null,"Block 2 Demand Rate",null,6.5,{"$f":"D449","v":6.5},{"$f":"E449","v":6.5},6.5,6.5,6.5,6.5,6.5,6.5,6.5,6.5,6.5]
[null,"Power Factor Rate",null,0.5,{"$f":"D450","v":0.5},0.5,0.5,0.5,0.5,0.5,0.5,0.5,0.5,0.5,0.5]
[null,"Prim. Volt. Disc. Rate",null,-0.2,{"$f":"D451","v":-0.2},-0.2,-0.2,-0.2,-0.2,-0.2,-0.2,-0.2,-0.2,-0.2,-0.2]
["Schedule 23"]
[null,"Block 2 Demand Revenue",null,0,0,0,0,0,0,0,0,0,0,0,0,{"$f":"SUM(D453:O453)","v":0}]
[null,"Power Factor Revenue",null,0,0,0,0,0,0,0,0,0,0,0,0,0]
[null,"Prim. Volt. Disc. Revenue",null,0,0,0,0,0,0,0,0,0,0,0,0,0]
[null,"Block 2 Demand Rate",null,6.5,{"$f":"D456","v":6.5},{"$f":"E456","v":6.5},{"$f":"F456","v":6.5},{"$f":"G456","v":6.5},{"$f":"H456","v":6.5},{"$f":"I456","v":6.5},{"$f":"J456","v":6.5},{"$f":"K456","v":6.5},{"$f":"L456","v":6.5},{"$f":"M456","v":6.5},{"$f":"N456","v":6.5}]
[null,"Power Factor Rate",null,0.5,{"$f":"D457","v":0.5},0.5,0.5,0.5,0.5,0.5,0.5,0.5,0.5,0.5,0.5]
[null,"Prim. Volt. Disc. Rate",null,-0.2,{"$f":"D458","v":-0.2},-0.2,-0.2,-0.2,-0.2,-0.2,-0.2,-0.2,-0.2,-0.2,-0.2]
["Schedule 25"]
[null,"Block 2 Demand Revenue",null,845158.69,847374.72,723087.72,739307.73,774119.29,753806.07,755592.44,787555.08,786563.67,884949.53,871829.04,928627.41,{"$f":"SUM(D460:O460)","v":9697971.3900000006}]
[null,"Prim. Volt. Disc. >11 Revenue",null,-16779,-16424.98,-14795.29,-14978.59,-15189.57,-15578.24,-15567.99,-15187.1,-15645.84,-17414.169999999998,-16881.07,-17010.060000000001,-191451.90000000002]
[null,"Prim. Volt. Disc. >60 Revenue",null,-16054.51,-13465.35,-13565.82,-16362.37,-13516.28,-14817.9,-13962.51,-18562.98,-14632.25,-14450.34,-15074.34,-15103.12,-179567.76999999996]
[null,"Prim. Volt. Disc. >115 Revenue",null,-101206.38,-100907.54,-102233.01,-99857.33,-109461.32,-97401.45,-98184.25,-101391.78,-98322.92,-101995.13,-102171.52,-101587.46,-1214720.0900000001]
[null,"Block 2 Demand Rate",null,6.5,{"$f":"D464","v":6.5},6.5,6.5,6.5,6.5,6.5,6.5,6.5,6.5,6.5,6.5]
[null,"Prim. Volt. Disc. >11 Rate",null,-0.2,-0.2,-0.2,-0.2,-0.2,-0.2,-0.2,-0.2,-0.2,-0.2,-0.2,-0.2]
[null,"Prim. Volt. Disc. >60 Rate",null,-1.52,-1.52,-1.52,-1.52,-1.52,-1.52,-1.52,-1.52,-1.52,-1.52,-1.52,-1.52]
[null,"Prim. Volt. Disc. >115 Rate",null,-1.93,-1.93,-1.93,-1.93,-1.93,-1.93,-1.93,-1.93,-1.93,-1.93,-1.93,-1.93]
["Schedule 25I"]
[null,"Block 2 Demand Revenue",null,0,0,0,0,0,0,0,0,0,0,0,0,{"$f":"SUM(D469:O469)","v":0}]
[null,"Prim. Volt. Disc. >11 Revenue",null,0,0,0,0,0,0,0,0,0,0,0,0,0]
[null,"Prim. Volt. Disc. >60 Revenue",null,0,0,0,0,0,0,0,0,0,0,0,0,0]
[null,"Prim. Volt. Disc. >115 Revenue",null,0,0,0,0,0,0,0,0,0,0,0,0,0]
[null,"Block 2 Demand Rate",null,6.5,{"$f":"D473","v":6.5},{"$f":"E473","v":6.5},{"$f":"F473","v":6.5},{"$f":"G473","v":6.5},{"$f":"H473","v":6.5},{"$f":"I473","v":6.5},{"$f":"J473","v":6.5},{"$f":"K473","v":6.5},{"$f":"L473","v":6.5},{"$f":"M473","v":6.5},{"$f":"N473","v":6.5}]
[null,"Prim. Volt. Disc. >11 Rate",null,-0.2,-0.2,-0.2,-0.2,-0.2,-0.2,-0.2,-0.2,-0.2,-0.2,-0.2,-0.2]
[null,"Prim. Volt. Disc. >60 Rate",null,-1.52,-1.52,-1.52,-1.52,-1.52,-1.52,-1.52,-1.52,-1.52,-1.52,-1.52,-1.52]
[null,"Prim. Volt. Disc. >115 Rate",null,-1.93,-1.93,-1.93,-1.93,-1.93,-1.93,-1.93,-1.93,-1.93,-1.93,-1.93,-1.93]
["Schedule 30"]
[null,"Power Factor Revenue",null,0,0,0,0,0,0,0,0,0,0,0,0,{"$f":"SUM(D478:O478)","v":0}]
[null,"Power Factor Rate",null,0.5,{"$f":"D479","v":0.5},{"$f":"E479","v":0.5},0.5,0.5,0.5,0.5,0.5,0.5,0.5,0.5,0.5]
["Schedule 31"]
[null,"Power Factor Revenue",null,0,0,0,0,0,0,0,0,0,0,0,0,{"$f":"SUM(D481:O481)","v":0}]
[null,"Power Factor Rate",null,0.5,{"$f":"D482","v":0.5},{"$f":"E482","v":0.5},0.5,0.5,0.5,0.5,0.5,0.5,0.5,0.5,0.5]
["Schedule 32"]
[null,"Power Factor Revenue",null,0,0,0,0,0,0,0,0,0,0,0,0,{"$f":"SUM(D484:O484)","v":0}]
[null,"Power Factor Rate",null,0.5,{"$f":"D485","v":0.5},{"$f":"E485","v":0.5},0.5,0.5,0.5,0.5,0.5,0.5,0.5,0.5,0.5]