{"text_format":"1","workbook":"xlsx","n_sheets":15,"sheets":["Pres & Prop Rev","Rate Design","Att A pg 1","Att A pg 3","Colstrip","Rate Spread GRC","Bill Determ","Sp Cnt Exh B","Bill Impact","WA Sch 25","Lighting summary","St Lts","Area Lts","Block Data","REVRUNS 12ME0921"],"not_rendered":{"charts":0,"images":0,"macros":1,"external_links":1,"defined_names":41,"comments":8,"pivot_tables":0},"unopened":[],"bounds":{"document_bytes":16777216,"sheet_cells":100000,"rows_first":2000,"rows_last":500,"rows_between":2000,"halvings":0,"cell_chars":16384,"cell_head_chars":4096},"cells_cut":0,"cells_raw":0,"read":"whole","date_system":"1900"}

{"sheet":"Pres & Prop Rev","index":0,"n_rows":305,"n_cols":19,"rows_kept":305,"cut":false,"hidden":false,"merged":[[5,18,10,20],[94,1,95,10]]}
[]
[null,{"$f":"IF(Base1_Billing2=2,\"BILLED\",\"\")","v":""}]
[]
[null,null," ","RESIDENTIAL","GENERAL SVC. ","GENERAL SVC. ","LG. GEN. SVC.","LG. GEN. SVC.","EX LG GEN SVC","EX LG GEN SVC","PUMPING","ST & AREA LTG"]
[null,null,"TOTAL","SCHEDULE 1,2","SCH. 11,12","SCH. 13","SCH. 21,22","SCH. 23","SCHEDULE 25","SCHEDULE 25I","SCH. 30, 31, 32","SCH. 41-48",null,null,null,null,null,null,"Print Header for all printed pages on this worksheet:"]
[null,"PRESENT BILL DETERMINANTS",null,null,null,null,null,null,null,null,null,null,null,null,"Calculate all revenue exhibits using  ____ rates:",null,null,null,{"$f":"\"AVISTA UTILITIES\nWASHINGTON ELECTRIC\nPRO FORMA REVENUE UNDER PRESENT AND PROPOSED \"&Q9&\" RATES\n12 MONTHS ENDED SEPTEMBER 30, 2021\"","v":"AVISTA UTILITIES\nWASHINGTON ELECTRIC\nPRO FORMA REVENUE UNDER PRESENT AND PROPOSED BASE TARIFF RATES\n12 MONTHS ENDED SEPTEMBER 30, 2021"}]
[null,"KILOWATT HOURS (KWHS)",null,null,null,null,null,null,null,null,null,null,null,"1)","BASE TARIFF"]
[null,"BLOCK 1",null,{"$f":"'Bill Determ'!$B$9","v":1699114425.539248},{"$f":"'Bill Determ'!$B$17","v":440976955.79465711},{"$f":"'Bill Determ'!$B$27","v":0},{"$f":"'Bill Determ'!$B$38","v":1176388254.2851541},{"$f":"'Bill Determ'!$B$49","v":0},{"$f":"'Bill Determ'!$B$58","v":125726244.40000001},{"$f":"'Bill Determ'!$B$62","v":6000000},{"$f":"SUM('Bill Determ'!$B$68:$C$68)","v":51510333.791929998},null,null,null,"or",null,1]
{"$rows_left_out":298}
{"sheet":"Rate Design","index":1,"n_rows":127,"n_cols":29,"rows_kept":127,"cut":false,"hidden":false,"merged":[]}
["PRESENT RATES",null,null,1,2,3,4,5,6,7,8,9,null,null,null,null,"Tiers - used for bill comparisons"]
[null,null,"TOTAL","SCH. 1,2","SCH. 11,12","SCH. 13","SCH. 21,22","SCH. 23","SCH. 25","SCH. 25I","SCH. 30, 31, 32",null,null,null,"Range Name",null,"SCHEDULE 1,2","SCH. 11,12","SCH. 13","SCH. 21,22","SCH. 23","SCHEDULE 25","SCHEDULE 25I","SCH. 30, 31, 32"]
[null,"Base Tariff Rates"]
[1,"BASIC CHARGE",null,9,21,21,0,600,0,0,21]
[2,"BLOCK 1 PER KWH",null,9.4860000000000007,12.379,21.89,7.9269999999999996,16.783999999999999,5.9059999999999997,4.782,11.763,null,null,null,null,null,800,3650,3650,250000,250000,500000,500000]
[3,"BLOCK 2 PER KWH",null,11.035,9.0960000000000001,8.9060000000000006,7.0919999999999996,6.9279999999999999,5.3129999999999997,4.3029999999999999,8.4009999999999998,null,null,null,null,null,1500,9999999,9999999,9999999,9999999,9999999,9999999]
[4,"BLOCK 3 PER KWH",null,12.94,0,0,0,0,4.3520000000000003,3.6789999999999998,0,null,null,null,"Rates_Base_Present",null,9999999,9999999,9999999,9999999,9999999,9999999,9999999]
[5,"BLOCK 4 PER KWH"]
{"$rows_left_out":120}
{"sheet":"Att A pg 1","index":2,"n_rows":114,"n_cols":28,"rows_kept":114,"cut":false,"hidden":false,"merged":[[0,0,0,18],[1,0,1,18],[2,0,2,18],[3,0,3,18],[4,0,4,18]]}
["AVISTA UTILITIES"]
["WASHINGTON ELECTRIC"]
["PROPOSED INCREASE BY SERVICE SCHEDULE"]
["12 MONTHS ENDED SEPTEMBER 30, 2021"]
["(000s of Dollars)"]
["Rate Year 1"]
[]
[null,null,null,"Base Tariff",null,"Base Tariff","Base","Base Tariff","Total Billed",null,"Adjusted Billed","Base ","Sch 78",null,"Percent",null,null,null,"Percent "]
{"$rows_left_out":107}
{"sheet":"Att A pg 3","index":3,"n_rows":89,"n_cols":27,"rows_kept":89,"cut":false,"hidden":false,"merged":[[7,0,7,2],[3,0,3,13]]}
["AVISTA UTILITIES",null,null,null,null,null,null,null,null,null,null,null,null,null,null,null,null,null,null,null,null,null,"This worksheet uses Base & Billing rates from 'Rate Design' tab."]
["WASHINGTON ELECTRIC"]
["PRESENT AND PROPOSED RATE COMPONENTS BY SCHEDULE"]
["RATE YEAR 2"]
[]
[null,null,null,null,null,null,"Misc",null,null,"General ","Sch. 92","Sch. 78","Proposed ","Proposed ","Sch. 98","Sch. 93/94","Proposed Billing","Sch. 99","Revised"]
[null,null,null,"Base Tariff","Present","Present ","Rate","Adjusted",null,"Rate ","LIRAP Rate","Tax ","Billing ","Base Tariff","REC Revenue","ERM/BPA","Rate With","Colstrip","Base Tariff"]
["Type of Service",null,null,"Sch. Rate","Other Adj.(1)","Billing Rate","Adjustment","Billing Rate",null,"Inc/Dec","Increase","Credit","Rate","Rate","Decrease","Increase","ERM Decrease (2)","Rates","Rate",null,null,"non-printing",null,null,"Present","Proposed","Proposed "]
{"$rows_left_out":82}
{"sheet":"Colstrip","index":4,"n_rows":48,"n_cols":18,"rows_kept":48,"cut":false,"hidden":false,"merged":[[47,1,47,9],[0,0,0,11],[1,0,1,11],[2,0,2,11],[3,0,3,11],[4,0,4,11]]}
["AVISTA UTILITIES"]
["WASHINGTON ELECTRIC"]
["PROPOSED INCREASE BY SERVICE SCHEDULE"]
["12 MONTHS ENDED SEPTEMBER 30, 2021"]
["(000s of Dollars)"]
[]
[null,"Schedule 99 - Colstrip"]
[]
{"$rows_left_out":41}
{"sheet":"Rate Spread GRC","index":5,"n_rows":79,"n_cols":17,"rows_kept":79,"cut":false,"hidden":false,"merged":[]}
[]
[]
["Avista"]
["Electric"]
["Rate Spread"]
[]
[]
[]
{"$rows_left_out":72}
{"sheet":"Bill Determ","index":6,"n_rows":111,"n_cols":7,"rows_kept":111,"cut":false,"hidden":false,"merged":[]}
["AVISTA UTILITIES"]
["WASHINGTON ELECTRIC"]
["ACTUAL / PRO FORMA BILLING DETERMINANTS BY RATE SCHEDULE"]
["12 MONTHS ENDED SEPTEMBER 30, 2021"]
[]
[]
[]
["Schedule 1, 2","0-800 kWhs","801-1500 kWhs","over 1500 kWhs","Total kWhs","Total Billings(2)"]
{"$rows_left_out":104}
{"sheet":"Sp Cnt Exh B","index":7,"n_rows":24,"n_cols":27,"rows_kept":24,"cut":false,"hidden":false,"merged":[[4,3,4,5],[4,7,4,9]]}
["Inland Empire Paper"]
["Exhibit B - Rate Design"]
[]
[]
[null,null,null,"Schedule 25",null,null,null,"Special Contract"]
[null,null,null,"Present",2019,"Present ",null,"Proposed",2019,"Proposed",null,null,"Revised Base"]
[null,null,null,"Base Tariff","Billing ","Base",null,"Special Contract","Billing ","Special Contract",null,"Schedule 99","Rate With",null,null,"LIRAP ","DSM",null,null,null,"Rate Factor Calculation for future IEP Special Contract Rate Changes from UE-200900"]
[null,null,null,"Sch. Rate","Determinants","Revenue",null,"Rate","Determinants","Rate",null,"Colstrip Rates","Colstrip "]
{"$rows_left_out":17}
{"sheet":"Bill Impact","index":8,"n_rows":28,"n_cols":13,"rows_kept":28,"cut":false,"hidden":false,"merged":[]}
[]
[]
["Schedule 001 Bill Impact"]
[]
[]
[]
["Schedule 001 Present",null,null,null,null,null,"Schedule 001 Proposed"]
[null,"Basic Charge","Block 1","Block 2","Total Bill",null,"Basic Charge","Block 1","Block 2","Total Bill",null,"Bill Impact","% Change"]
{"$rows_left_out":21}
{"sheet":"WA Sch 25","index":9,"n_rows":189,"n_cols":23,"rows_kept":189,"cut":false,"hidden":false,"merged":[]}
["Washington Schedule 25 Billing Determinants",null,null,null,null,null,null,null,null,null,null,null,null,null,null,null,"1st",{"$f":"Q2","v":500000},{"$f":"R2","v":6000000}]
[null,null,null,null,null,null,null,null,null,null,null,null,null,null,null,"12-mo Ended",500000,6000000,99999999]
["KWHs",null,"Acct No.","2020-10-31",{"$f":"EOMONTH(D3,1)","v":"2020-11-30"},"2020-12-31","2021-01-31","2021-02-28","2021-03-31","2021-04-30","2021-05-31","2021-06-30","2021-07-31","2021-08-31","2021-09-30","Total","kwhs/mo","kwhs/mo","kwhs/mo"]
[1,"Goodrich - North 2311008572","2311008572",2458068.9,1544554.2,1189675.2,1511697.6,1882095.6,2261666.4,1799479.5,2309876.1,2695404.6,2647274.7000000002,2478096.6,3166680.3,{"$f":"SUM(D4:O4)","v":25944569.700000003},{"$f":"Q$2*12-SUMPRODUCT(--($D4:$O4<=Q$2),Q$2-$D4:$O4)","v":6000000},{"$f":"R$2*12-SUM($Q4:Q4)-SUMPRODUCT(--($D4:$O4<=R$2),R$2-$D4:$O4)","v":19944569.700000003},{"$f":"S$2*12-SUM($Q4:R4)-SUMPRODUCT(--($D4:$O4<=S$2),S$2-$D4:$O4)","v":0}]
[2,"Boise Cascade Plywood","8920023327",3024031.5,2843954.4,2473554.2999999998,2885658.3,2744878.5,2980838.7,2910555.9,2901796.8,2761634.4,2818435.2,2414878.2000000002,2830543.8,33590759.999999993,{"$f":"Q$2*12-SUMPRODUCT(--($D5:$O5<=Q$2),Q$2-$D5:$O5)","v":6000000},{"$f":"R$2*12-SUM($Q5:Q5)-SUMPRODUCT(--($D5:$O5<=R$2),R$2-$D5:$O5)","v":27590759.999999993},{"$f":"S$2*12-SUM($Q5:R5)-SUMPRODUCT(--($D5:$O5<=S$2),S$2-$D5:$O5)","v":0}]
[3,"Boise Cascade Sawmill","9920023116",1281416.5,1231090.7,1371597.5,1378001.1,1276487.1000000001,1360394,1246655.2,1204011.2,1244033.7,1159707.5,1143046.8,1107361.5,15003802.799999999,6000000,{"$f":"R$2*12-SUM($Q6:Q6)-SUMPRODUCT(--($D6:$O6<=R$2),R$2-$D6:$O6)","v":9003802.799999997},{"$f":"S$2*12-SUM($Q6:R6)-SUMPRODUCT(--($D6:$O6<=S$2),S$2-$D6:$O6)","v":0}]
[4,"City of Spokane","8970099313",1273549.2,1311429,1427570.55,1480744.65,1399653.15,1642623.15,1599610.95,1655249.4,1732733.1,1807320.9,1615553.1,1391827.5,18337864.650000002,6000000,{"$f":"R$2*12-SUM($Q7:Q7)-SUMPRODUCT(--($D7:$O7<=R$2),R$2-$D7:$O7)","v":12337864.649999999},{"$f":"S$2*12-SUM($Q7:R7)-SUMPRODUCT(--($D7:$O7<=S$2),S$2-$D7:$O7)","v":0}]
[5,"Empire Health Services","0080095044",1565237.1,1501969.35,1579521.3,1563613.8,1462822.2,1593162.9,1625069.25,1785898.8,1999167.45,2213329.65,2118270,1807545.6,20815607.400000002,6000000,{"$f":"R$2*12-SUM($Q8:Q8)-SUMPRODUCT(--($D8:$O8<=R$2),R$2-$D8:$O8)","v":14815607.399999999},{"$f":"S$2*12-SUM($Q8:R8)-SUMPRODUCT(--($D8:$O8<=S$2),S$2-$D8:$O8)","v":0}]
{"$rows_left_out":182}
{"sheet":"Lighting summary","index":10,"n_rows":55,"n_cols":17,"rows_kept":55,"cut":false,"hidden":false,"merged":[[6,2,6,3],[6,5,6,6]]}
[null,"AVISTA UTILITIES"]
[null,"WASHINGTON ELECTRIC"]
[null,"STREET & AREA LIGHT REVENUE UNDER PRESENT & PROPOSED RATES"]
[null,"12 MONTHS ENDED SEPTEMBER 30, 2021"]
[]
[]
[null,null,{"$f":"\"Present \"&IF(Base1_Billing2=2,\"Billing \",\"\")&\"Rates(1)\"","v":"Present Rates(1)"},{"$f":"\"Present \"&IF(Base1_Billing2=2,\"Billing\",\"\")&\" Rates\"","v":"Present  Rates"},null,{"$f":"\"Proposed \"&IF(Base1_Billing2=2,\"Billing \",\"\")&\"Rates(2)\"","v":"Proposed Rates(2)"},{"$f":"\"Proposed \"&IF(Base1_Billing2=2,\"Billing \",\"\")&\"Rates\"","v":"Proposed Rates"},null,"% Revenue Change"]
[null,null,"Monthly ","Annual",null,"Monthly ","Annual",null,null,null,null,"Target Base",null,"Annual","Present","Proposed"]
{"$rows_left_out":48}
{"sheet":"St Lts","index":11,"n_rows":160,"n_cols":75,"rows_kept":160,"cut":false,"hidden":false,"merged":[]}
["Street Light Summary",null,null,null,null,null,null,null,"WASHINGTON Street Lights (Schedule 41 - 46 Rates)",null,null,null,null,null,null,null,null,null,null,null,null,null,null,null,null,null,null,null,null,null,null,null,null,null,null,"% rate increase -->",{"$f":"'Lighting summary'!L11","v":2.3800000000000002E-2},{"$f":"'Lighting summary'!L12","v":2.2499999999999999E-2},{"$f":"'Lighting summary'!L13","v":2.3800000000000002E-2},{"$f":"'Lighting summary'!L14","v":2.3800000000000002E-2},{"$f":"'Lighting summary'!L15","v":2.3800000000000002E-2},null,null,null,null,null,null,null,null,null,null,null,null,null,null,null,{"$f":"-0.00789-0.00045-0.00339","v":-1.1730000000000001E-2},"compare input Present Billing Rates to calculated Present Billing Rates",null,null,null,null,null,null,{"$f":"BF2","v":1.0150999999999999}]
["MDM-10069 Report as of 9/30/21",null,null,null,null,null,null,null,null,null,null,null,"Number of Lights(1)",null,null,null,null,null,"Present Rates",null,null,null,null,null,"Monthly Revenue at Present Rates",null,null,null,null,null,"Number of Lights",null,null,null,null,null,"Proposed Rates",null,null,null,null,null,"Monthly Revenue at Proposed Rates",null,null,null,null,null,null,null,"Present Billing Rates",null,null,null,null,null,1.3939999999999999E-2,{"$f":"1+0.0151","v":1.0150999999999999},"Sch 91 & 92",null,null,null,null,null,"New Billing Rates",null,null,null,null,null,"Increase"]
[null,null,null,null,null,null,null,null,"Fixture Type","Pole Facility","Size","Sched","041","042","044","045","046",null,"041","042","044","045","046",null,"041","042","044","045","046",null,"041","042","044","045","046",null,"041","042","044","045","046",null,"041","042","044","045","046",null,null,"kwh","041","042","044","045","046",null,"Sch 93/94","041","042","044","045","046",null,null,"041","042","044","045","046",null,"041","042","044","045","046"]
[null,null,null,null,null,null,null,null,"LED (Dusk to Dawn)","Dusk to Dawn","5W","005L",{"$f":"SUMIF($G:$G,TEXT(M$3,\"000\")&TEXT($L4,\"000\"),$E:$E)","v":0},0,0,0,0,{"$f":"IF(SUM(M4:Q4)>0,0,1)","v":1},0,null,0,0,0.23,null,{"$f":"IF(AND(M4<>0,S4=0),#VALUE!,M4*S4)","v":0},{"$f":"IF(AND(N4<>0,T4=0),#VALUE!,N4*T4)","v":0},{"$f":"IF(AND(O4<>0,U4=0),#VALUE!,O4*U4)","v":0},{"$f":"IF(AND(P4<>0,V4=0),#VALUE!,P4*V4)","v":0},{"$f":"IF(AND(Q4<>0,W4=0),#VALUE!,Q4*W4)","v":0},null,{"$f":"SUMIF($G:$G,TEXT(AE$3,\"000\")&TEXT($L4,\"000\"),$E:$E)","v":0},0,0,0,0,null,{"$f":"ROUND(S4*(1+AK$1),2)","v":0},null,{"$f":"ROUND(U4*(1+AM$1),2)","v":0},{"$f":"ROUND(V4*(1+AN$1),2)","v":0},{"$f":"ROUND(W4*(1+AO$1),2)","v":0.24},null,{"$f":"IF(AND(AE4<>0,AK4=0),#VALUE!,AE4*AK4)","v":0},{"$f":"IF(AND(AF4<>0,AL4=0),#VALUE!,AF4*AL4)","v":0},{"$f":"IF(AND(AG4<>0,AM4=0),#VALUE!,AG4*AM4)","v":0},{"$f":"IF(AND(AH4<>0,AN4=0),#VALUE!,AH4*AN4)","v":0},{"$f":"IF(AND(AI4<>0,AO4=0),#VALUE!,AI4*AO4)","v":0},null,null,2,null,null,null,null,0.23347299999999999,null,{"$f":"ROUND(AX4*$BE$2,2)+ROUND(AX4*$BE$1,2)","v":9.9999999999999985E-3},null,null,null,null,{"$f":"ROUND((W4*$BF$2)+$BE4-BC4,2)","v":0.01},null,null,{"$f":"AK4*$BM$1","v":0},{"$f":"AL4*$BM$1","v":0},{"$f":"AM4*$BM$1","v":0},{"$f":"AN4*$BM$1","v":0},{"$f":"AO4*$BM$1","v":0.24362399999999995},null,{"$f":"BM4-AY4","v":0},{"$f":"BN4-AZ4","v":0},{"$f":"BO4-BA4","v":0},{"$f":"BP4-BB4","v":0},{"$f":"BQ4-BC4","v":1.0150999999999966E-2}]
[null,"State","Sched","Rate Sub","# of Lights",null,null,null,"LED (Dusk to Dawn)","Dusk to Dawn","5W","015L",0,0,0,0,42,{"$f":"IF(SUM(M5:Q5)>0,0,1)","v":0},0,null,0,0,0.56000000000000005,null,{"$f":"IF(AND(M5<>0,S5=0),#VALUE!,M5*S5)","v":0},{"$f":"IF(AND(N5<>0,T5=0),#VALUE!,N5*T5)","v":0},{"$f":"IF(AND(O5<>0,U5=0),#VALUE!,O5*U5)","v":0},{"$f":"IF(AND(P5<>0,V5=0),#VALUE!,P5*V5)","v":0},{"$f":"IF(AND(Q5<>0,W5=0),#VALUE!,Q5*W5)","v":23.520000000000003},null,0,0,0,0,42,null,{"$f":"ROUND(S5*(1+AK$1),2)","v":0},null,{"$f":"ROUND(U5*(1+AM$1),2)","v":0},{"$f":"ROUND(V5*(1+AN$1),2)","v":0},{"$f":"ROUND(W5*(1+AO$1),2)","v":0.56999999999999995},null,{"$f":"IF(AND(AE5<>0,AK5=0),#VALUE!,AE5*AK5)","v":0},{"$f":"IF(AND(AF5<>0,AL5=0),#VALUE!,AF5*AL5)","v":0},{"$f":"IF(AND(AG5<>0,AM5=0),#VALUE!,AG5*AM5)","v":0},{"$f":"IF(AND(AH5<>0,AN5=0),#VALUE!,AH5*AN5)","v":0},{"$f":"IF(AND(AI5<>0,AO5=0),#VALUE!,AI5*AO5)","v":23.939999999999998},null,null,5,null,null,null,null,0.56845599999999996,null,{"$f":"ROUND(AX5*$BE$2,2)+ROUND(AX5*$BE$1,2)","v":1.0000000000000009E-2},null,null,null,null,{"$f":"ROUND((W5*$BF$2)+$BE5-BC5,2)","v":0.01},null,null,{"$f":"AK5*$BM$1","v":0},{"$f":"AL5*$BM$1","v":0},{"$f":"AM5*$BM$1","v":0},{"$f":"AN5*$BM$1","v":0},{"$f":"AO5*$BM$1","v":0.57860699999999987},null,{"$f":"BM5-AY5","v":0},{"$f":"BN5-AZ5","v":0},{"$f":"BO5-BA5","v":0},{"$f":"BP5-BB5","v":0},{"$f":"BQ5-BC5","v":1.015099999999991E-2}]
[null,null,null,null,null,null,null,null,"LED (Dusk to Dawn)","Dusk to Dawn","5W","025L",0,0,0,0,45,0,0,null,0,0,1.02,null,0,0,0,0,{"$f":"IF(AND(Q6<>0,W6=0),#VALUE!,Q6*W6)","v":45.9},null,0,0,0,0,45,null,0,null,0,0,1.04,null,0,{"$f":"IF(AND(AF6<>0,AL6=0),#VALUE!,AF6*AL6)","v":0},0,0,{"$f":"IF(AND(AI6<>0,AO6=0),#VALUE!,AI6*AO6)","v":46.800000000000004},null,null,9,null,null,null,null,1.0252509999999999,null,2.0000000000000004E-2,null,null,null,null,{"$f":"ROUND((W6*$BF$2)+$BE6-BC6,2)","v":0.03},null,null,0,0,0,0,1.055704,null,0,0,0,0,3.0453000000000063E-2]
[null,2,"041",214,0,null,{"$f":"IF(OR(ISBLANK(C7),ISBLANK(D7)),\"\",TEXT(C7,\"000\")&TEXT(D7,\"000\"))","v":"041214"},null,"LED (Dusk to Dawn)","Dusk to Dawn","5W","035L",0,0,0,0,0,1,0,null,0,0,1.46,null,0,0,0,0,0,null,0,0,0,0,0,null,0,null,0,0,1.49,null,0,0,0,0,0,null,null,13,null,null,null,null,1.4820459999999998,null,0.03,null,null,null,null,0.03,null,null,0,0,0,0,1.5124989999999998,null,0,0,0,0,3.0453000000000063E-2]
[null,2,"041",411,1,null,{"$f":"IF(OR(ISBLANK(C8),ISBLANK(D8)),\"\",TEXT(C8,\"000\")&TEXT(D8,\"000\"))","v":"041411"},null,"LED (Dusk to Dawn)","Dusk to Dawn","5W","045L",0,0,0,0,0,1,0,null,0,0,1.81,null,0,0,0,0,0,null,0,0,0,0,0,null,0,null,0,0,1.85,null,0,0,0,0,0,null,null,16,null,null,null,null,1.8271799999999998,null,0.03,null,null,null,null,0.04,null,null,0,0,0,0,1.8779349999999999,null,0,0,0,0,5.0755000000000106E-2]
{"$rows_left_out":153}
{"sheet":"Area Lts","index":12,"n_rows":104,"n_cols":34,"rows_kept":104,"cut":false,"hidden":false,"merged":[]}
["Area Light Summary",null,null,null,null,null,null,null,"WASHINGTON Area Lights (Schedule 47)",null,null,null,null,null,null,null,null,null,"Monthly Rev.",null,null,null,null,null,null,{"$f":"SL_RateIncr","v":0},null,null,"% rate increase -->",{"$f":"'Lighting summary'!L16","v":2.3800000000000002E-2},null,null,"Monthly Rev."]
[{"$f":"'St Lts'!A2","v":"MDM-10069 Report as of 9/30/21"},null,null,null,null,null,null,null,null,null,null,null,"# of Lights(1)",null,null,"Pres. Rates",null,null,"at Pres. Rates",null,null,"# of Lights(1)",null,null,null,null,"# of Lights",null,null,"Prop. Rates",null,null,"at Prop. Rates"]
[null,null,null,null,null,null,null,null,"Fixture Type","Pole Facility","Size","Sched","047","048",null,"047","048",null,"047","048",null,"047","048",null,null,null,"047","048",null,"047","048",null,"047","048"]
[null,null,null,null,null,null,null,null,"Sodium Vapor","Floodlight on existing standard","250W","HAH",{"$f":"SUMIF($G:$G,TEXT(M$3,\"000\")&TEXT($L4,\"000\"),$E:$E)","v":95},2,null,24.43,{"$f":"P4","v":24.43},null,{"$f":"IF(AND(M4<>0,P4=0),#VALUE!,M4*P4)","v":2320.85},{"$f":"IF(AND(N4<>0,Q4=0),#VALUE!,N4*Q4)","v":48.86},null,{"$f":"SUMIF($G:$G,TEXT(V$3,\"000\")&TEXT($L4,\"000\"),$E:$E)","v":95},2,null,null,null,{"$f":"M4","v":95},2,null,{"$f":"ROUND(P4*(1+AD$1),2)","v":25.01},{"$f":"AD4","v":25.01},null,{"$f":"IF(AND(AA4<>0,AD4=0),#VALUE!,AA4*AD4)","v":2375.9500000000003},{"$f":"IF(AND(AB4<>0,AE4=0),#VALUE!,AB4*AE4)","v":50.02}]
[null,"State","Sched","Rate Sub","# of Lights",null,null,null,"Sodium Vapor","Kim light w/25' fiberglass pole","100W","HAI",16,2,null,31.91,31.91,null,{"$f":"IF(AND(M5<>0,P5=0),#VALUE!,M5*P5)","v":510.56},63.82,null,16,2,null,null,null,16,2,null,32.67,{"$f":"AD5","v":32.67},null,522.72,65.34]
[null,null,null,null,null,null,null,null,"Sodium Vapor","on existing standard","100W","HPA",330,367,null,15.15,15.15,null,4999.5,{"$f":"IF(AND(N6<>0,Q6=0),#VALUE!,N6*Q6)","v":5560.05},null,330,367,null,null,null,330,367,null,15.51,15.51,null,5118.3,5692.17]
[null,"WA","047","HAGL",1,null,{"$f":"IF(OR(ISBLANK(C7),ISBLANK(D7)),\"\",TEXT(C7,\"000\")&TEXT(D7,\"000\"))","v":"047HAGL"},null,"Sodium Vapor","on existing standard","200W","HPB",785,361,null,21.51,21.51,null,16885.350000000002,7765.1100000000006,null,785,361,null,null,null,785,361,null,22.02,22.02,null,17285.7,7949.22]
[null,"WA","047","HAH",95,null,{"$f":"IF(OR(ISBLANK(C8),ISBLANK(D8)),\"\",TEXT(C8,\"000\")&TEXT(D8,\"000\"))","v":"047HAH"},null,"Sodium Vapor","on existing standard","400W","HPC",104,8,null,29.71,29.71,null,3089.84,237.68,null,104,8,null,null,null,104,8,null,{"$f":"ROUND(P8*(1+AD$1),2)","v":30.42},30.42,null,3163.6800000000003,243.36]
{"$rows_left_out":97}
{"sheet":"Block Data","index":13,"n_rows":153,"n_cols":19,"rows_kept":153,"cut":false,"hidden":false,"merged":[]}
[]
[]
["WASHINGTON ELECTRIC SYSTEM"]
[null,null,"October","November","December","January","February","March","April","May","June","July","August","September","Annual Total"]
["Rate Design Program Monthly Results"]
[null,"Schedule 001/002"]
[null,"Block 1",{"$f":"'REVRUNS 12ME0921'!D61+'REVRUNS 12ME0921'!D76","v":126671526.79886},{"$f":"'REVRUNS 12ME0921'!E61+'REVRUNS 12ME0921'!E76","v":141161403.90276},{"$f":"'REVRUNS 12ME0921'!F61+'REVRUNS 12ME0921'!F76","v":153279164.25044999},{"$f":"'REVRUNS 12ME0921'!G61+'REVRUNS 12ME0921'!G76","v":145336918.74568},{"$f":"'REVRUNS 12ME0921'!H61+'REVRUNS 12ME0921'!H76","v":143450858.24737},{"$f":"'REVRUNS 12ME0921'!I61+'REVRUNS 12ME0921'!I76","v":165087270.92676002},{"$f":"'REVRUNS 12ME0921'!J61+'REVRUNS 12ME0921'!J76","v":137318007.94782999},{"$f":"'REVRUNS 12ME0921'!K61+'REVRUNS 12ME0921'!K76","v":125820470.97221},{"$f":"'REVRUNS 12ME0921'!L61+'REVRUNS 12ME0921'!L76","v":131235812.11885001},{"$f":"'REVRUNS 12ME0921'!M61+'REVRUNS 12ME0921'!M76","v":148068257.98974001},{"$f":"'REVRUNS 12ME0921'!N61+'REVRUNS 12ME0921'!N76","v":148228693.69687},{"$f":"'REVRUNS 12ME0921'!O61+'REVRUNS 12ME0921'!O76","v":133468353.58196001},{"$f":"SUM(C7:N7)","v":1699126739.1793399},null,null,0,{"$f":"R7/$R$10","v":{"$error":"#DIV/0!"}}]
[null,"Block 2",{"$f":"'REVRUNS 12ME0921'!D62+'REVRUNS 12ME0921'!D77","v":24044218.450139999},{"$f":"'REVRUNS 12ME0921'!E62+'REVRUNS 12ME0921'!E77","v":42000514.480240002},{"$f":"'REVRUNS 12ME0921'!F62+'REVRUNS 12ME0921'!F77","v":64752272.93355},{"$f":"'REVRUNS 12ME0921'!G62+'REVRUNS 12ME0921'!G77","v":65236875.307320006},{"$f":"'REVRUNS 12ME0921'!H62+'REVRUNS 12ME0921'!H77","v":59974258.81763},{"$f":"'REVRUNS 12ME0921'!I62+'REVRUNS 12ME0921'!I77","v":61059929.873240001},{"$f":"'REVRUNS 12ME0921'!J62+'REVRUNS 12ME0921'!J77","v":37659186.637170002},{"$f":"'REVRUNS 12ME0921'!K62+'REVRUNS 12ME0921'!K77","v":23694340.99179},{"$f":"'REVRUNS 12ME0921'!L62+'REVRUNS 12ME0921'!L77","v":29451849.342149999},{"$f":"'REVRUNS 12ME0921'!M62+'REVRUNS 12ME0921'!M77","v":60647956.696079999},{"$f":"'REVRUNS 12ME0921'!N62+'REVRUNS 12ME0921'!N77","v":58181641.990220003},{"$f":"'REVRUNS 12ME0921'!O62+'REVRUNS 12ME0921'!O77","v":33362568.635029998},{"$f":"SUM(C8:N8)","v":560065614.15455997},null,null,0,{"$f":"R8/$R$10","v":{"$error":"#DIV/0!"}}]
{"$rows_left_out":146}
{"sheet":"REVRUNS 12ME0921","index":14,"n_rows":485,"n_cols":17,"rows_kept":485,"cut":false,"hidden":false,"merged":[[388,1,389,1],[391,0,391,2],[352,0,389,0],[352,1,353,1],[355,1,356,1],[358,1,359,1],[361,1,362,1],[367,1,368,1],[370,1,371,1],[376,1,377,1],[382,1,383,1],[385,1,386,1],[364,1,365,1],[373,1,374,1],[379,1,380,1]]}
[]
[]
["\"Rev Norm Bill Determininant 12 ME Report\" for Report Date : '09/30/2021'"]
[]
["State Cde:WA"]
[]
[null,null,"Meters"]
[null,"Period",202010,{"$f":"C8+1","v":202011},{"$f":"D8+1","v":202012},202101,{"$f":"F8+1","v":202102},202103,202104,202105,202106,202107,202108,202109,"12 Month Average","Total"]
{"$rows_left_out":477}