{"text_format":"1","workbook":"xlsx","n_sheets":10,"sheets":["Pres & Prop Rev","Rate Design","Att A pg 5","Att A pg 7","Rate Spread","Bill Impact","Bill Determ","Block Usage","Big Schedules","12MESEP21"],"not_rendered":{"charts":0,"images":0,"macros":1,"external_links":0,"defined_names":16,"comments":7,"pivot_tables":0},"unopened":[],"bounds":{"document_bytes":16777216,"sheet_cells":100000,"rows_first":2000,"rows_last":500,"rows_between":2000,"halvings":0,"cell_chars":16384,"cell_head_chars":4096},"cells_cut":0,"cells_raw":0,"read":"whole","date_system":"1900"}

{"sheet":"Pres & Prop Rev","index":0,"n_rows":283,"n_cols":17,"rows_kept":283,"cut":false,"hidden":false,"merged":[[5,16,10,18]]}
[]
[]
[null,null,null,null,null,null,null,null,null,"TRANSPORT"]
[null,null," ","GEN SERVICE","LRG GEN SVC",null,"INTERRUPTIBLE","TRANSPORT","TRANSPORT","SCH 148 - WSU"]
[null,null,"TOTAL","SCH. 101 & 102","SCH. 111,112&116","OPEN","SCH. 131&132","SCHEDULE 146","SCHEDULE 148","ANN. MINIMUM",null,null,null,null,null,null,"Print Header for all printed pages on this worksheet:"]
[null,"PRESENT BILL DETERMINANTS",null,null,null,null,null,null,null,null,null,null,"Calculate all revenue exhibits using  ____ rates:",null,null,null,{"$f":"\"AVISTA UTILITIES\nWASHINGTON NATURAL GAS\nPRO FORMA REVENUE UNDER PRESENT AND PROPOSED \"&O9&\" RATES\n12 MONTHS ENDED SEPTEMBER 30, 2021\"","v":"AVISTA UTILITIES\nWASHINGTON NATURAL GAS\nPRO FORMA REVENUE UNDER PRESENT AND PROPOSED BASE TARIFF RATES\n12 MONTHS ENDED SEPTEMBER 30, 2021"}]
[null,"THERMS",null,null,null,null,null,null,null,null,null,"1)","BASE TARIFF"]
[null,"BLOCK 1",null,{"$f":"'Bill Determ'!E7","v":80766205.381202027},{"$f":"'Bill Determ'!B18","v":6521234.7051644083},null,{"$f":"'Bill Determ'!B39","v":240000},{"$f":"'Bill Determ'!B43","v":7930946},{"$f":"'Bill Determ'!B49","v":19487326},{"$f":"'Bill Determ'!B55","v":10798113},null,null,"or",null,1]
[null,"BLOCK 2",null,{"$f":"'Bill Determ'!F7","v":47287211.036927991},{"$f":"'Bill Determ'!C18","v":16462319.308859199},null,{"$f":"'Bill Determ'!C39","v":306456.12400000001},{"$f":"'Bill Determ'!C43","v":7628283},{"$f":"'Bill Determ'!B50","v":5800449},null,null,"2)","BILLING",null,{"$f":"CHOOSE(Base1_Billing2,M7,M9)","v":"BASE TARIFF"}]
[null,"BLOCK 3",null,null,{"$f":"'Bill Determ'!D18","v":27222822.759964537},null,{"$f":"'Bill Determ'!D39","v":323177.79200000002},{"$f":"'Bill Determ'!D43","v":14073664},{"$f":"'Bill Determ'!B51","v":1764576},null,null,null,null,null,{"$f":"CHOOSE(Base1_Billing2,\"Base\",\"Billing\")","v":"Base"}]
{"$rows_left_out":274}
{"sheet":"Rate Design","index":1,"n_rows":122,"n_cols":22,"rows_kept":122,"cut":false,"hidden":false,"merged":[]}
["PRESENT RATES",null,null,1,2,3,4,5,null,null,null,"Tiers - used for bill comparisons"]
[null,null,"TOTAL","SCH. 101","SCH. 111,112,116","OPEN","SCH. 132","SCH. 146",null,"Range Name",null,"SCH. 101","SCH. 111,112","SCH. 121,122","SCH. 131,132","SCH. 146"]
[null,"Base Tariff Rates"]
[1,"BASIC CHARGE",null,9.5,0,0,0,700]
[2,"MONTHLY MINIMUM",null,0,128.72,0,0,0]
[3,"BLOCK 1 PER THERM",null,49.893000000000001,0,0,29.933,12.256,null,null,null,9999999,200,500,10000,20000]
[4,"BLOCK 2 PER THERM",null,64.843999999999994,38.311999999999998,0,24.029,10.904,{"$f":"H7/H6-1","v":-0.11031331592689297},null,null,9999999,1000,1000,25000,50000]
[5,"BLOCK 3 PER THERM",null,0,29.202999999999999,0,22.579000000000001,9.8320000000000007,{"$f":"H8/H7-1","v":-9.8312545854732147E-2},"Rates_Base_Present",null,9999999,9999999,10000,50000,300000]
[6,"BLOCK 4 PER THERM",null,0,24.917000000000002,0,20.173999999999999,9.093,{"$f":"H9/H8-1","v":-7.5162733930024483E-2},null,null,9999999,9999999,25000,9999999,500000]
[7,"BLOCK 5 PER THERM",null,0,17.48,0,0,6.8339999999999996,{"$f":"H10/H9-1","v":-0.24843286044209834},null,null,9999999,9999999,9999999,9999999,9999999]
{"$rows_left_out":113}
{"sheet":"Att A pg 5","index":2,"n_rows":69,"n_cols":26,"rows_kept":69,"cut":false,"hidden":false,"merged":[[49,0,50,7]]}
["AVISTA UTILITIES"]
["WASHINGTON NATURAL GAS"]
["PROPOSED INCREASE BY SERVICE SCHEDULE"]
["12 MONTHS ENDED SEPTEMBER 30, 2021"]
["(000s of Dollars)"]
[]
["Rate Year 1"]
[null,null,null,"Base Tariff",null,"Base Tariff","Base","Total Billed",null,null,null,"Percent "]
[null,null,null,"Distribution Revenue","Final","Distribution Revenue","Tariff","Revenue","Final","Sch. 192","Sch. 178","Increase"]
["Line","Type of","Schedule","Under Present","General","Under Proposed","Percent","at Present","General","LIRAP ","Tax Credit","on Billed"]
{"$rows_left_out":60}
{"sheet":"Att A pg 7","index":3,"n_rows":64,"n_cols":28,"rows_kept":64,"cut":false,"hidden":false,"merged":[[9,0,9,2],[14,23,14,24],[3,0,3,10]]}
["AVISTA UTILITIES",null,null,null,null,null,null,null,null,null,null,null,null,null,null,null,null,"This worksheet uses Base & Billing rates from 'Rate Design' tab."]
["WASHINGTON NATURAL GAS"]
["PRESENT AND PROPOSED RATE COMPONENTS BY SCHEDULE"]
["RATE YEAR 2"]
[]
[]
[null,null,null,null,null,null,null,"Sch 192","Sch 178",null,"Proposed"]
[null,null,null,"Present Base","Present",null,"General ","LIRAP","Tax","Proposed ","Base "]
[null,null,null,"Distribution","Billing","Present ","Rate ","Rate","Customer","Billing ","Distribution",null,null,null,"GRC"]
["Type of Service",null,null,"Rate","Rate Adj. (1)","Billing Rate","Increase","Increase","Credit","Rate(1)","Rate",null,"Base","Bill ","Revenue"]
{"$rows_left_out":55}
{"sheet":"Rate Spread","index":4,"n_rows":23,"n_cols":17,"rows_kept":23,"cut":false,"hidden":false,"merged":[]}
[]
["Avista"]
["Natural Gas"]
["Rate Spread"]
[]
[null,null,null,null,null,null,null,null,null,null,null,null,null,null,null,"Filed","Filed"]
[null,null,null,"Base Tariff",null,"Base",null,"Base Tariff","Total Billed",null,null,"Percent ",null,null,null,"Base","Percent "]
[null,null,null,"Distribution Revenue","Percentage ","Tariff","Proposed","Distribution Revenue","Revenue","Increase","Tax","Increase",null,null,null,"Tariff","Increase"]
["Line","Type of","Schedule","Under Present","of Base","Percent","General","Under Proposed","at Present","LIRAP","Customer","on Billed",null,null,null,"Percent","on Billed"]
["No.","Service","Number","Rates","Increase","Increase","Increase","Rates","Rates (1)","Funding","Credit","Revenue",null,null,null,"Increase","Revenue"]
{"$rows_left_out":14}
{"sheet":"Bill Impact","index":5,"n_rows":102,"n_cols":15,"rows_kept":102,"cut":false,"hidden":false,"merged":[]}
[]
["Schedule 101 Bill Impact"]
[]
[]
[]
["Schedule 101 Present",null,null,null,null,null,"Schedule 101 Proposed"]
[null,"Basic Charge","Block 1","Block 2","Total Bill",null,"Basic Charge","Block 1","Block 2","Total Bill",null,"Bill Impact","% Change"]
[null,{"$f":"'Rate Design'!D4","v":9.5},{"$f":"'Rate Design'!D16/100","v":0.82919000000000009},{"$f":"'Rate Design'!D17/100","v":0.96381000000000006},null,null,{"$f":"'Rate Design'!D26","v":9.5},{"$f":"'Att A pg 7'!J15","v":0.83695000000000008},{"$f":"'Att A pg 7'!J16","v":0.9739000000000001}]
[10,{"$f":"$B$8","v":9.5},{"$f":"A9*$C$8","v":8.2919000000000018},null,{"$f":"SUM(B9:D9)","v":17.791900000000002},null,{"$f":"$G$8","v":9.5},{"$f":"A9*$H$8","v":8.3695000000000004},null,{"$f":"SUM(G9:I9)","v":17.869500000000002},null,{"$f":"J9-E9","v":7.7600000000000335E-2},{"$f":"L9/E9","v":4.3615353053917975E-3}]
[{"$f":"A9+10","v":20},{"$f":"$B$8","v":9.5},16.583800000000004,null,{"$f":"SUM(B10:D10)","v":26.083800000000004},null,{"$f":"$G$8","v":9.5},{"$f":"A10*$H$8","v":16.739000000000001},null,26.239000000000001,null,0.15519999999999712,5.9500532897812852E-3]
{"$rows_left_out":93}
{"sheet":"Bill Determ","index":6,"n_rows":101,"n_cols":8,"rows_kept":101,"cut":false,"hidden":false,"merged":[]}
["AVISTA UTILITIES"]
["WASHINGTON GAS"]
["USAGE & BILLINGS BY RATE SCHEDULE"]
["12 MONTHS ENDED SEPTEMBER 30, 2021"]
[]
["Schedule 101/102","Total therms","Total Billings",null,"0-70",">70","Total Therms"]
["therms per Revenue Run(1)(2)",{"$f":"'12MESEP21'!P165","v":128053416.41812997},{"$f":"'12MESEP21'!O25","v":2040304},null,{"$f":"'Block Usage'!O17","v":80766205.381202027},{"$f":"'Block Usage'!O18","v":47287211.036927991},{"$f":"SUM(D7:F7)","v":128053416.41813001}]
[null,null,null,null,null,null,{"$f":"'12MESEP21'!P165","v":128053416.41812997}]
[null,null,null,null,null,null,{"$f":"G8-G7","v":0}]
[null,null,null,"1001-10000","10000-"]
{"$rows_left_out":92}
{"sheet":"Block Usage","index":7,"n_rows":72,"n_cols":16,"rows_kept":72,"cut":false,"hidden":false,"merged":[]}
["WASHINGTON NATURAL GAS SYSTEM"]
[null,null,"October","November","December","January","February","March","April","May","June","July","August","September","Annual Total"]
["Rate Design Program Monthly Results"]
[null,"Schedule 101/102"]
[null,"Block 1",{"$f":"'12MESEP21'!D53+'12MESEP21'!D66","v":3836733.97132},{"$f":"'12MESEP21'!E53+'12MESEP21'!E66","v":9353945.2905899994},{"$f":"'12MESEP21'!F53+'12MESEP21'!F66","v":10789713.34121},{"$f":"'12MESEP21'!G53+'12MESEP21'!G66","v":10527291.107690001},{"$f":"'12MESEP21'!H53+'12MESEP21'!H66","v":10533170.99432},{"$f":"'12MESEP21'!I53+'12MESEP21'!I66","v":11455655.93506},{"$f":"'12MESEP21'!J53+'12MESEP21'!J66","v":9101646.0843899995},{"$f":"'12MESEP21'!K53+'12MESEP21'!K66","v":5424169.4354800005},{"$f":"'12MESEP21'!L53+'12MESEP21'!L66","v":3469406.7827099999},{"$f":"'12MESEP21'!M53+'12MESEP21'!M66","v":2085311.89564},{"$f":"'12MESEP21'!N53+'12MESEP21'!N66","v":1914811.87359},{"$f":"'12MESEP21'!O53+'12MESEP21'!O66","v":2276855.71856},{"$f":"SUM(C5:N5)","v":80768712.430560008}]
[null,"Block 2",{"$f":"'12MESEP21'!D54+'12MESEP21'!D67","v":352324.59921999997},{"$f":"'12MESEP21'!E54+'12MESEP21'!E67","v":3786323.6968800002},{"$f":"'12MESEP21'!F54+'12MESEP21'!F67","v":9348393.3402800001},{"$f":"'12MESEP21'!G54+'12MESEP21'!G67","v":10346702.57983},{"$f":"'12MESEP21'!H54+'12MESEP21'!H67","v":10700982.13899},{"$f":"'12MESEP21'!I54+'12MESEP21'!I67","v":8519146.6244099997},{"$f":"'12MESEP21'!J54+'12MESEP21'!J67","v":2874879.8285699999},{"$f":"'12MESEP21'!K54+'12MESEP21'!K67","v":570961.54148000001},{"$f":"'12MESEP21'!L54+'12MESEP21'!L67","v":288340.02643000003},{"$f":"'12MESEP21'!M54+'12MESEP21'!M67","v":123511.22184},{"$f":"'12MESEP21'!N54+'12MESEP21'!N67","v":136990.16602},{"$f":"'12MESEP21'!O54+'12MESEP21'!O67","v":239640.22362},{"$f":"SUM(C6:N6)","v":47288195.987569995}]
["Therms","Total",{"$f":"SUM(C5:C6)","v":4189058.5705399998},13140268.987469999,20138106.68149,20873993.687520001,21234153.133309998,19974802.559469998,11976525.91296,5995130.9769600006,3757746.80914,2208823.11748,2051802.0396099999,2516495.9421799998,128056908.41813001]
[null,"Billed Customers",{"$f":"'12MESEP21'!C25","v":168858},{"$f":"'12MESEP21'!D25","v":168988},{"$f":"'12MESEP21'!E25","v":169632},{"$f":"'12MESEP21'!F25","v":163070},{"$f":"'12MESEP21'!G25","v":162865},{"$f":"'12MESEP21'!H25","v":184180},{"$f":"'12MESEP21'!I25","v":170295},{"$f":"'12MESEP21'!J25","v":170263},{"$f":"'12MESEP21'!K25","v":170396},{"$f":"'12MESEP21'!L25","v":170444},{"$f":"'12MESEP21'!M25","v":170724},{"$f":"'12MESEP21'!N25","v":170589},{"$f":"SUM(C8:N8)","v":2040304}]
[null,"Block 1 Limit",{"$f":"C8*70","v":11820060},{"$f":"D8*70","v":11829160},11874240,11414900,11400550,12892600,11920650,11918410,11927720,11931080,11950680,11941230,{"$f":"SUM(C9:N9)","v":142821280}]
[null,"Revenue Run Total",{"$f":"'12MESEP21'!D165","v":4188892.5705400002},{"$f":"'12MESEP21'!E165","v":13139925.987469999},{"$f":"'12MESEP21'!F165","v":20137931.68149},{"$f":"'12MESEP21'!G165","v":20873743.687520001},{"$f":"'12MESEP21'!H165","v":21233613.133309998},{"$f":"'12MESEP21'!I165","v":19974452.559470002},{"$f":"'12MESEP21'!J165","v":11975808.912959998},{"$f":"'12MESEP21'!K165","v":5994916.9769600006},{"$f":"'12MESEP21'!L165","v":3757561.80914},{"$f":"'12MESEP21'!M165","v":2208503.11748},{"$f":"'12MESEP21'!N165","v":2051764.0396100001},{"$f":"'12MESEP21'!O165","v":2516301.9421799998},{"$f":"SUM(C10:N10)","v":128053416.41812998}]
{"$rows_left_out":63}
{"sheet":"Big Schedules","index":8,"n_rows":109,"n_cols":46,"rows_kept":109,"cut":false,"hidden":false,"merged":[]}
[null,"Washington Gas Billing Determinants by Customer"]
[null,null,null,null,null,null,null,null,null,null,null,null,null,null,null,null,"1st",{"$f":"Q3","v":20000},{"$f":"R3","v":50000},{"$f":"S3","v":300000},{"$f":"T3","v":500000},null,"Present","Proposed"]
[null,"ANNUAL USAGE, Sch 146",null,null,null,null,null,null,null,null,null,null,null,null,"12-mo ended",null,20000,50000,300000,500000,99999999,null,"Annual","Annual","Present Base","Proposed Base"]
[null,"Washington","2020-10-31",{"$f":"EOMONTH(C4,1)","v":"2020-11-30"},{"$f":"EOMONTH(D4,1)","v":"2020-12-31"},"2021-01-31","2021-02-28","2021-03-31","2021-04-30","2021-05-31","2021-06-30","2021-07-31","2021-08-31","2021-09-30","Total",null,"thms/mo","thms/mo","thms/mo","thms/mo","thms/mo",null,"Minimum","Minimum","Revenue","Revenue"]
[1,"Deaconess Medical Center                          ",74764,104275,122430,150985,138075,145522,119752,108123,95889,80544,79484,13776,{"$f":"SUM(C5:N5)","v":1233619},null,{"$f":"Q$3*12-SUMPRODUCT(--($C5:$N5<=Q$3),Q$3-$C5:$N5)","v":233776},{"$f":"R$3*12-SUM($Q5:Q5)-SUMPRODUCT(--($C5:$N5<=R$3),R$3-$C5:$N5)","v":330000},{"$f":"S$3*12-SUM($Q5:R5)-SUMPRODUCT(--($C5:$N5<=S$3),S$3-$C5:$N5)","v":669843},{"$f":"T$3*12-SUM($Q5:S5)-SUMPRODUCT(--($C5:$N5<=T$3),T$3-$C5:$N5)","v":0},{"$f":"U$3*12-SUM($Q5:T5)-SUMPRODUCT(--($C5:$N5<=U$3),U$3-$C5:$N5)","v":0},null,{"$f":"IF(O5<250000,(250000-O5)*'Att A pg 7'!$E$56,0)","v":0},{"$f":"IF(O5<250000,(250000-O5)*'Att A pg 7'!$K$56,0)","v":0},{"$f":"Q5*'Att A pg 7'!$D$51+'Big Schedules'!R5*'Att A pg 7'!$D$52+'Big Schedules'!S5*'Att A pg 7'!$D$53+'Big Schedules'!T5*'Att A pg 7'!$D$54+'Big Schedules'!U5*'Att A pg 7'!$D$55+'Att A pg 7'!$D$49*12+W5","v":138893.75031999999},{"$f":"Q5*'Att A pg 7'!$K$51+'Big Schedules'!R5*'Att A pg 7'!$K$52+'Big Schedules'!S5*'Att A pg 7'!$K$53+'Big Schedules'!T5*'Att A pg 7'!$K$54+'Big Schedules'!U5*'Att A pg 7'!$K$55+'Att A pg 7'!$K$49*12+X5","v":140739.80233000001},{"$f":"Z5/Y5-1","v":1.3291109252553612E-2}]
[{"$f":"A5+1","v":2},"92 Ces/Cer-M (to Sch 112)                                     ",0,198368,322422,425484,403480,401058,284275,180978,89621,26204,11668,20809,{"$f":"SUM(C6:N6)","v":2364367},null,211668,{"$f":"R$3*12-SUM($Q6:Q6)-SUMPRODUCT(--($C6:$N6<=R$3),R$3-$C6:$N6)","v":247013},{"$f":"S$3*12-SUM($Q6:R6)-SUMPRODUCT(--($C6:$N6<=S$3),S$3-$C6:$N6)","v":1553242},{"$f":"T$3*12-SUM($Q6:S6)-SUMPRODUCT(--($C6:$N6<=T$3),T$3-$C6:$N6)","v":352444},{"$f":"U$3*12-SUM($Q6:T6)-SUMPRODUCT(--($C6:$N6<=U$3),U$3-$C6:$N6)","v":0},null,{"$f":"IF(O6<250000,(250000-O6)*'Att A pg 7'!$E$56,0)","v":0},{"$f":"IF(O6<250000,(250000-O6)*'Att A pg 7'!$K$56,0)","v":0},{"$f":"Q6*'Att A pg 7'!$D$51+'Big Schedules'!R6*'Att A pg 7'!$D$52+'Big Schedules'!S6*'Att A pg 7'!$D$53+'Big Schedules'!T6*'Att A pg 7'!$D$54+'Big Schedules'!U6*'Att A pg 7'!$D$55+'Att A pg 7'!$D$49*12+W6","v":246038.81396000003},{"$f":"Q6*'Att A pg 7'!$K$51+'Big Schedules'!R6*'Att A pg 7'!$K$52+'Big Schedules'!S6*'Att A pg 7'!$K$53+'Big Schedules'!T6*'Att A pg 7'!$K$54+'Big Schedules'!U6*'Att A pg 7'!$K$55+'Att A pg 7'!$K$49*12+X6","v":249397.65100000001},{"$f":"Z6/Y6-1","v":1.3651655143102959E-2}]
[{"$f":"A6+1","v":3},"Baker Commodities Inc.                            ",14471,15892,14495,17891,17755,17217,20948,18645,16633,12172,10352,9337,{"$f":"SUM(C7:N7)","v":185808},null,184860,{"$f":"R$3*12-SUM($Q7:Q7)-SUMPRODUCT(--($C7:$N7<=R$3),R$3-$C7:$N7)","v":948},{"$f":"S$3*12-SUM($Q7:R7)-SUMPRODUCT(--($C7:$N7<=S$3),S$3-$C7:$N7)","v":0},{"$f":"T$3*12-SUM($Q7:S7)-SUMPRODUCT(--($C7:$N7<=T$3),T$3-$C7:$N7)","v":0},{"$f":"U$3*12-SUM($Q7:T7)-SUMPRODUCT(--($C7:$N7<=U$3),U$3-$C7:$N7)","v":0},null,{"$f":"IF(O7<250000,(250000-O7)*'Att A pg 7'!$E$56,0)","v":6999.49568},{"$f":"IF(O7<250000,(250000-O7)*'Att A pg 7'!$K$56,0)","v":7098.3513599999997},{"$f":"Q7*'Att A pg 7'!$D$51+'Big Schedules'!R7*'Att A pg 7'!$D$52+'Big Schedules'!S7*'Att A pg 7'!$D$53+'Big Schedules'!T7*'Att A pg 7'!$D$54+'Big Schedules'!U7*'Att A pg 7'!$D$55+'Att A pg 7'!$D$49*12+W7","v":38159.307200000003},{"$f":"Q7*'Att A pg 7'!$K$51+'Big Schedules'!R7*'Att A pg 7'!$K$52+'Big Schedules'!S7*'Att A pg 7'!$K$53+'Big Schedules'!T7*'Att A pg 7'!$K$54+'Big Schedules'!U7*'Att A pg 7'!$K$55+'Att A pg 7'!$K$49*12+X7","v":38581.279199999997},{"$f":"Z7/Y7-1","v":1.105816721955577E-2}]
[4,"Ergon Asphalt (frmly Western States) - Valley",14766,12129,12793,15732,3029,496,1119,22343,17269,18823,21593,490026,630118,null,156156,{"$f":"R$3*12-SUM($Q8:Q8)-SUMPRODUCT(--($C8:$N8<=R$3),R$3-$C8:$N8)","v":33936},{"$f":"S$3*12-SUM($Q8:R8)-SUMPRODUCT(--($C8:$N8<=S$3),S$3-$C8:$N8)","v":250000},{"$f":"T$3*12-SUM($Q8:S8)-SUMPRODUCT(--($C8:$N8<=T$3),T$3-$C8:$N8)","v":190026},{"$f":"U$3*12-SUM($Q8:T8)-SUMPRODUCT(--($C8:$N8<=U$3),U$3-$C8:$N8)","v":0},null,{"$f":"IF(O8<250000,(250000-O8)*'Att A pg 7'!$E$56,0)","v":0},{"$f":"IF(O8<250000,(250000-O8)*'Att A pg 7'!$K$56,0)","v":0},{"$f":"Q8*'Att A pg 7'!$D$51+'Big Schedules'!R8*'Att A pg 7'!$D$52+'Big Schedules'!S8*'Att A pg 7'!$D$53+'Big Schedules'!T8*'Att A pg 7'!$D$54+'Big Schedules'!U8*'Att A pg 7'!$D$55+'Att A pg 7'!$D$49*12+W8","v":73097.924980000011},{"$f":"Q8*'Att A pg 7'!$K$51+'Big Schedules'!R8*'Att A pg 7'!$K$52+'Big Schedules'!S8*'Att A pg 7'!$K$53+'Big Schedules'!T8*'Att A pg 7'!$K$54+'Big Schedules'!U8*'Att A pg 7'!$K$55+'Att A pg 7'!$K$49*12+X8","v":74012.631139999998},1.2513435371116932E-2]
[5,"Inland Northwest Dairies                          ",16189,22506,26577,28522,28252,26151,25951,22848,20913,17462,16980,127370,379721,null,230631,{"$f":"R$3*12-SUM($Q9:Q9)-SUMPRODUCT(--($C9:$N9<=R$3),R$3-$C9:$N9)","v":71720},{"$f":"S$3*12-SUM($Q9:R9)-SUMPRODUCT(--($C9:$N9<=S$3),S$3-$C9:$N9)","v":77370},{"$f":"T$3*12-SUM($Q9:S9)-SUMPRODUCT(--($C9:$N9<=T$3),T$3-$C9:$N9)","v":0},{"$f":"U$3*12-SUM($Q9:T9)-SUMPRODUCT(--($C9:$N9<=U$3),U$3-$C9:$N9)","v":0},null,{"$f":"IF(O9<250000,(250000-O9)*'Att A pg 7'!$E$56,0)","v":0},{"$f":"IF(O9<250000,(250000-O9)*'Att A pg 7'!$K$56,0)","v":0},{"$f":"Q9*'Att A pg 7'!$D$51+'Big Schedules'!R9*'Att A pg 7'!$D$52+'Big Schedules'!S9*'Att A pg 7'!$D$53+'Big Schedules'!T9*'Att A pg 7'!$D$54+'Big Schedules'!U9*'Att A pg 7'!$D$55+'Att A pg 7'!$D$49*12+W9","v":52093.502560000001},{"$f":"Q9*'Att A pg 7'!$K$51+'Big Schedules'!R9*'Att A pg 7'!$K$52+'Big Schedules'!S9*'Att A pg 7'!$K$53+'Big Schedules'!T9*'Att A pg 7'!$K$54+'Big Schedules'!U9*'Att A pg 7'!$K$55+'Att A pg 7'!$K$49*12+X9","v":52712.793599999997},1.1888066833031896E-2]
[6,"Central Pre-Mix Block                             ",29237,37791,30698,25559,25811,30673,36586,38479,39157,32864,25298,32513,384666,null,240000,{"$f":"R$3*12-SUM($Q10:Q10)-SUMPRODUCT(--($C10:$N10<=R$3),R$3-$C10:$N10)","v":144666},{"$f":"S$3*12-SUM($Q10:R10)-SUMPRODUCT(--($C10:$N10<=S$3),S$3-$C10:$N10)","v":0},{"$f":"T$3*12-SUM($Q10:S10)-SUMPRODUCT(--($C10:$N10<=T$3),T$3-$C10:$N10)","v":0},{"$f":"U$3*12-SUM($Q10:T10)-SUMPRODUCT(--($C10:$N10<=U$3),U$3-$C10:$N10)","v":0},null,{"$f":"IF(O10<250000,(250000-O10)*'Att A pg 7'!$E$56,0)","v":0},{"$f":"IF(O10<250000,(250000-O10)*'Att A pg 7'!$K$56,0)","v":0},{"$f":"Q10*'Att A pg 7'!$D$51+'Big Schedules'!R10*'Att A pg 7'!$D$52+'Big Schedules'!S10*'Att A pg 7'!$D$53+'Big Schedules'!T10*'Att A pg 7'!$D$54+'Big Schedules'!U10*'Att A pg 7'!$D$55+'Att A pg 7'!$D$49*12+W10","v":53588.780639999997},{"$f":"Q10*'Att A pg 7'!$K$51+'Big Schedules'!R10*'Att A pg 7'!$K$52+'Big Schedules'!S10*'Att A pg 7'!$K$53+'Big Schedules'!T10*'Att A pg 7'!$K$54+'Big Schedules'!U10*'Att A pg 7'!$K$55+'Att A pg 7'!$K$49*12+X10","v":54229.166279999998},1.1949994613648762E-2]
{"$rows_left_out":100}
{"sheet":"12MESEP21","index":9,"n_rows":217,"n_cols":16,"rows_kept":217,"cut":false,"hidden":false,"merged":[]}
[]
[]
["Rev Norm Bill Determinant 12 ME Report for Report Date : '09/30/2021'  "]
[]
["State Cde:WA"]
[]
[null,null,"Meters"]
[null,"Period",202010,{"$f":"C8+1","v":202011},{"$f":"D8+1","v":202012},202101,{"$f":"F8+1","v":202102},202103,202104,202105,202106,202107,202108,202109,"12 Month Average","12 Month Total"]
["Rate Schedule Num"]
[101,null,168622,168739,169372,162808,162594,183866,169998,169961,170090,170133,170413,170256,{"$f":"AVERAGE(C10:N10)","v":169737.66666666666},{"$f":"SUM(C10:N10)","v":2036852}]
{"$rows_left_out":207}