{"text_format":"1","workbook":"xlsx","n_sheets":41,"sheets":["Utility Group Criteria","Utility Group","Proxy Group Risk Measures","Table 1 - Fig. 1","Tables 2 4","Fig. 2","Fig. 3","Exhibit List","AMM-3 Fig. 1","AMM-3 Fig. 2","AMM-3 Table 4","4","5 (1)","5 (2-3)","6 (1)","6 (2)","6 (3)","6 (4)","7","8","9","10 (1)","10 (2)","10 (3)","10 (4)","11","12 (1)","12 (2)","12 (3)","13","14 (1)","14 (2-4)","Stock Price (Utility)","Stock Price (Non-Utility)","2020 10 Market DCF","Bond Yields","Size Premium","Ordinal Ratings","Electric Utility Data","CS Data","Capital Structure - Op. Cos."],"not_rendered":{"charts":5,"images":0,"macros":1,"external_links":0,"defined_names":4676,"comments":1,"pivot_tables":0},"unopened":[],"bounds":{"document_bytes":16777216,"sheet_cells":100000,"rows_first":2000,"rows_last":500,"rows_between":2000,"halvings":0,"cell_chars":16384,"cell_head_chars":4096},"cells_cut":0,"cells_raw":0,"read":"whole","date_system":"1900"}

{"sheet":"Utility Group Criteria","index":0,"n_rows":111,"n_cols":21,"rows_kept":111,"cut":false,"hidden":false,"merged":[[3,11,3,15],[4,11,4,15]]}
["VALUE LINE ELECTRIC UTILITIES"]
[]
[]
[null,null,null,null,null,"(a)",null,null,"(b)",null,null,"(e)",null,null,null,null,null,"(d)"]
[null,null,null,null,null,"S&P",null,null,"Moody's",null,null,"Value Line",null,null,null,null,null,null,null,"Override:"]
[null,null,null," ",null,"Credit",null,null,"Issuer",null,null,"Safety",null,"Finaneial",null,null,null,"Market",null,"\"Y\" for Incl."]
[null,"Included","SYM","Company",null," Rating",null,null,"Rating",null,null,"Rank",null,"Strength",null,"Beta",null,"Cap",null,"\"X\" for Excl.","Comments"]
[{"$f":"A7+1","v":1},{"$f":"IF(AND(G8<=$G$62,G8>=$G$63,J8<=$J$62,J8>=$J$63,L8>=$L$62,L8<=$L$63,T8<>\"X\"),\"Y\",IF(T8=\"Y\",\"Y\",\"\"))","v":"Y"},{"$f":"'Electric Utility Data'!B8","v":"AQN"},{"$f":"'Electric Utility Data'!C8","v":"Algonquin Pwr & Util"},null,{"$f":"'Electric Utility Data'!AA8","v":"BBB"},{"$f":"IF(F8=\"NR\",0,VLOOKUP(F8,'Ordinal Ratings'!A$8:B$30,2,FALSE))","v":9},null,{"$f":"'Electric Utility Data'!AB8","v":"NR"},{"$f":"IF(I8=\"NR\",0,VLOOKUP(I8,'Ordinal Ratings'!I$8:J$26,2,FALSE))","v":0},null,{"$f":"'Electric Utility Data'!W8","v":"n/a"},null,{"$f":"'Electric Utility Data'!Y8","v":"n/a"},null,{"$f":"'Electric Utility Data'!X8","v":0.9},null,{"$f":"'Electric Utility Data'!AC8","v":9094.3405220000004},null,"Y","S&P rating meets criteria"]
[{"$f":"A8+1","v":2},"Y",{"$f":"'Electric Utility Data'!B9","v":"ALE"},{"$f":"'Electric Utility Data'!C9","v":"ALLETE"},null,{"$f":"'Electric Utility Data'!AA9","v":"BBB"},{"$f":"IF(F9=\"NR\",0,VLOOKUP(F9,'Ordinal Ratings'!A$8:B$30,2,FALSE))","v":9},null,{"$f":"'Electric Utility Data'!AB9","v":"Baa1"},{"$f":"IF(I9=\"NR\",0,VLOOKUP(I9,'Ordinal Ratings'!I$8:J$26,2,FALSE))","v":8},null,{"$f":"'Electric Utility Data'!W9","v":2},null,{"$f":"'Electric Utility Data'!Y9","v":"A"},null,{"$f":"'Electric Utility Data'!X9","v":0.85},null,{"$f":"'Electric Utility Data'!AC9","v":2800}]
[3,"",{"$f":"'Electric Utility Data'!B10","v":"LNT"},{"$f":"'Electric Utility Data'!C10","v":"Alliant Energy"},null,{"$f":"'Electric Utility Data'!AA10","v":"A-"},{"$f":"IF(F10=\"NR\",0,VLOOKUP(F10,'Ordinal Ratings'!A$8:B$30,2,FALSE))","v":7},null,{"$f":"'Electric Utility Data'!AB10","v":"Baa2"},{"$f":"IF(I10=\"NR\",0,VLOOKUP(I10,'Ordinal Ratings'!I$8:J$26,2,FALSE))","v":9},null,{"$f":"'Electric Utility Data'!W10","v":2},null,{"$f":"'Electric Utility Data'!Y10","v":"A"},null,{"$f":"'Electric Utility Data'!X10","v":0.85},null,{"$f":"'Electric Utility Data'!AC10","v":13500}]
[4,"Y",{"$f":"'Electric Utility Data'!B11","v":"AEE"},{"$f":"'Electric Utility Data'!C11","v":"Ameren Corp."},null,{"$f":"'Electric Utility Data'!AA11","v":"BBB+"},{"$f":"IF(F11=\"NR\",0,VLOOKUP(F11,'Ordinal Ratings'!A$8:B$30,2,FALSE))","v":8},null,{"$f":"'Electric Utility Data'!AB11","v":"Baa1"},{"$f":"IF(I11=\"NR\",0,VLOOKUP(I11,'Ordinal Ratings'!I$8:J$26,2,FALSE))","v":8},null,{"$f":"'Electric Utility Data'!W11","v":2},null,{"$f":"'Electric Utility Data'!Y11","v":"A"},null,{"$f":"'Electric Utility Data'!X11","v":0.8},null,{"$f":"'Electric Utility Data'!AC11","v":20000}]
[5,"",{"$f":"'Electric Utility Data'!B12","v":"AEP"},{"$f":"'Electric Utility Data'!C12","v":"American Elec Pwr"},null,{"$f":"'Electric Utility Data'!AA12","v":"A-"},{"$f":"IF(F12=\"NR\",0,VLOOKUP(F12,'Ordinal Ratings'!A$8:B$30,2,FALSE))","v":7},null,{"$f":"'Electric Utility Data'!AB12","v":"Baa2"},{"$f":"IF(I12=\"NR\",0,VLOOKUP(I12,'Ordinal Ratings'!I$8:J$26,2,FALSE))","v":9},null,{"$f":"'Electric Utility Data'!W12","v":1},null,{"$f":"'Electric Utility Data'!Y12","v":"A+"},null,{"$f":"'Electric Utility Data'!X12","v":0.75},null,{"$f":"'Electric Utility Data'!AC12","v":39000}]
[6,"Y",{"$f":"'Electric Utility Data'!B13","v":"AGR"},{"$f":"'Electric Utility Data'!C13","v":"Avangrid, Inc."},null,{"$f":"'Electric Utility Data'!AA13","v":"BBB+"},{"$f":"IF(F13=\"NR\",0,VLOOKUP(F13,'Ordinal Ratings'!A$8:B$30,2,FALSE))","v":8},null,{"$f":"'Electric Utility Data'!AB13","v":"Baa1"},{"$f":"IF(I13=\"NR\",0,VLOOKUP(I13,'Ordinal Ratings'!I$8:J$26,2,FALSE))","v":8},null,{"$f":"'Electric Utility Data'!W13","v":2},null,{"$f":"'Electric Utility Data'!Y13","v":"B++"},null,{"$f":"'Electric Utility Data'!X13","v":0.8},null,{"$f":"'Electric Utility Data'!AC13","v":15000}]
[7,"Y",{"$f":"'Electric Utility Data'!B14","v":"AVA"},{"$f":"'Electric Utility Data'!C14","v":"Avista Corp."},null,{"$f":"'Electric Utility Data'!AA14","v":"BBB"},{"$f":"IF(F14=\"NR\",0,VLOOKUP(F14,'Ordinal Ratings'!A$8:B$30,2,FALSE))","v":9},null,{"$f":"'Electric Utility Data'!AB14","v":"Baa2"},{"$f":"IF(I14=\"NR\",0,VLOOKUP(I14,'Ordinal Ratings'!I$8:J$26,2,FALSE))","v":9},null,{"$f":"'Electric Utility Data'!W14","v":2},null,{"$f":"'Electric Utility Data'!Y14","v":"B++"},null,{"$f":"'Electric Utility Data'!X14","v":0.9},null,{"$f":"'Electric Utility Data'!AC14","v":2400}]
[8,"Y",{"$f":"'Electric Utility Data'!B15","v":"BKH"},{"$f":"'Electric Utility Data'!C15","v":"Black Hills Corp."},null,{"$f":"'Electric Utility Data'!AA15","v":"BBB+"},{"$f":"IF(F15=\"NR\",0,VLOOKUP(F15,'Ordinal Ratings'!A$8:B$30,2,FALSE))","v":8},null,{"$f":"'Electric Utility Data'!AB15","v":"Baa2"},{"$f":"IF(I15=\"NR\",0,VLOOKUP(I15,'Ordinal Ratings'!I$8:J$26,2,FALSE))","v":9},null,{"$f":"'Electric Utility Data'!W15","v":2},null,{"$f":"'Electric Utility Data'!Y15","v":"A"},null,{"$f":"'Electric Utility Data'!X15","v":0.95},null,{"$f":"'Electric Utility Data'!AC15","v":3800}]
[9,"Y",{"$f":"'Electric Utility Data'!B16","v":"CNP"},{"$f":"'Electric Utility Data'!C16","v":"CenterPoint Energy"},null,{"$f":"'Electric Utility Data'!AA16","v":"BBB+"},{"$f":"IF(F16=\"NR\",0,VLOOKUP(F16,'Ordinal Ratings'!A$8:B$30,2,FALSE))","v":8},null,{"$f":"'Electric Utility Data'!AB16","v":"Baa2"},{"$f":"IF(I16=\"NR\",0,VLOOKUP(I16,'Ordinal Ratings'!I$8:J$26,2,FALSE))","v":9},null,{"$f":"'Electric Utility Data'!W16","v":3},null,{"$f":"'Electric Utility Data'!Y16","v":"B+"},null,{"$f":"'Electric Utility Data'!X16","v":1.1000000000000001},null,{"$f":"'Electric Utility Data'!AC16","v":11000}]
[10,"Y",{"$f":"'Electric Utility Data'!B17","v":"CMS"},{"$f":"'Electric Utility Data'!C17","v":"CMS Energy Corp."},null,{"$f":"'Electric Utility Data'!AA17","v":"BBB+"},{"$f":"IF(F17=\"NR\",0,VLOOKUP(F17,'Ordinal Ratings'!A$8:B$30,2,FALSE))","v":8},null,{"$f":"'Electric Utility Data'!AB17","v":"Baa1"},{"$f":"IF(I17=\"NR\",0,VLOOKUP(I17,'Ordinal Ratings'!I$8:J$26,2,FALSE))","v":8},null,{"$f":"'Electric Utility Data'!W17","v":2},null,{"$f":"'Electric Utility Data'!Y17","v":"B++"},null,{"$f":"'Electric Utility Data'!X17","v":0.8},null,{"$f":"'Electric Utility Data'!AC17","v":17000}]
[11,"",{"$f":"'Electric Utility Data'!B18","v":"ED"},{"$f":"'Electric Utility Data'!C18","v":"Consolidated Edison"},null,{"$f":"'Electric Utility Data'!AA18","v":"A-"},{"$f":"IF(F18=\"NR\",0,VLOOKUP(F18,'Ordinal Ratings'!A$8:B$30,2,FALSE))","v":7},null,{"$f":"'Electric Utility Data'!AB18","v":"Baa2"},{"$f":"IF(I18=\"NR\",0,VLOOKUP(I18,'Ordinal Ratings'!I$8:J$26,2,FALSE))","v":9},null,{"$f":"'Electric Utility Data'!W18","v":1},null,{"$f":"'Electric Utility Data'!Y18","v":"A+"},null,{"$f":"'Electric Utility Data'!X18","v":0.75},null,{"$f":"'Electric Utility Data'!AC18","v":25000}]
[12,"",{"$f":"'Electric Utility Data'!B19","v":"D"},{"$f":"'Electric Utility Data'!C19","v":"Dominion Energy"},null,{"$f":"'Electric Utility Data'!AA19","v":"BBB+"},{"$f":"IF(F19=\"NR\",0,VLOOKUP(F19,'Ordinal Ratings'!A$8:B$30,2,FALSE))","v":8},null,{"$f":"'Electric Utility Data'!AB19","v":"Baa2"},{"$f":"IF(I19=\"NR\",0,VLOOKUP(I19,'Ordinal Ratings'!I$8:J$26,2,FALSE))","v":9},null,{"$f":"'Electric Utility Data'!W19","v":2},null,{"$f":"'Electric Utility Data'!Y19","v":"B++"},null,{"$f":"'Electric Utility Data'!X19","v":0.8},null,{"$f":"'Electric Utility Data'!AC19","v":67000},null,"X","Announced sale of gas transmission/storage segment ($9.5/$69.9 total capital = 13.6%); reduction in annual dividend in Q4 from $3.76 to $2.50."]
[13,"Y",{"$f":"'Electric Utility Data'!B20","v":"DTE"},{"$f":"'Electric Utility Data'!C20","v":"DTE Energy Co."},null,{"$f":"'Electric Utility Data'!AA20","v":"BBB+"},{"$f":"IF(F20=\"NR\",0,VLOOKUP(F20,'Ordinal Ratings'!A$8:B$30,2,FALSE))","v":8},null,{"$f":"'Electric Utility Data'!AB20","v":"Baa2"},{"$f":"IF(I20=\"NR\",0,VLOOKUP(I20,'Ordinal Ratings'!I$8:J$26,2,FALSE))","v":9},null,{"$f":"'Electric Utility Data'!W20","v":2},null,{"$f":"'Electric Utility Data'!Y20","v":"A"},null,{"$f":"'Electric Utility Data'!X20","v":0.9},null,{"$f":"'Electric Utility Data'!AC20","v":23000}]
[14,"",{"$f":"'Electric Utility Data'!B21","v":"DUK"},{"$f":"'Electric Utility Data'!C21","v":"Duke Energy Corp."},null,{"$f":"'Electric Utility Data'!AA21","v":"A-"},{"$f":"IF(F21=\"NR\",0,VLOOKUP(F21,'Ordinal Ratings'!A$8:B$30,2,FALSE))","v":7},null,{"$f":"'Electric Utility Data'!AB21","v":"Baa1"},{"$f":"IF(I21=\"NR\",0,VLOOKUP(I21,'Ordinal Ratings'!I$8:J$26,2,FALSE))","v":8},null,{"$f":"'Electric Utility Data'!W21","v":2},null,{"$f":"'Electric Utility Data'!Y21","v":"A"},null,{"$f":"'Electric Utility Data'!X21","v":0.85},null,{"$f":"'Electric Utility Data'!AC21","v":62000}]
[15,"Y",{"$f":"'Electric Utility Data'!B22","v":"EIX"},{"$f":"'Electric Utility Data'!C22","v":"Edison International"},null,{"$f":"'Electric Utility Data'!AA22","v":"BBB"},{"$f":"IF(F22=\"NR\",0,VLOOKUP(F22,'Ordinal Ratings'!A$8:B$30,2,FALSE))","v":9},null,{"$f":"'Electric Utility Data'!AB22","v":"Baa3"},{"$f":"IF(I22=\"NR\",0,VLOOKUP(I22,'Ordinal Ratings'!I$8:J$26,2,FALSE))","v":10},null,{"$f":"'Electric Utility Data'!W22","v":3},null,{"$f":"'Electric Utility Data'!Y22","v":"B+"},null,{"$f":"'Electric Utility Data'!X22","v":0.9},null,{"$f":"'Electric Utility Data'!AC22","v":20000}]
[16,"Y",{"$f":"'Electric Utility Data'!B23","v":"EMA"},{"$f":"'Electric Utility Data'!C23","v":"Emera Inc."},null,{"$f":"'Electric Utility Data'!AA23","v":"BBB"},{"$f":"IF(F23=\"NR\",0,VLOOKUP(F23,'Ordinal Ratings'!A$8:B$30,2,FALSE))","v":9},null,{"$f":"'Electric Utility Data'!AB23","v":"Baa3"},{"$f":"IF(I23=\"NR\",0,VLOOKUP(I23,'Ordinal Ratings'!I$8:J$26,2,FALSE))","v":10},null,{"$f":"'Electric Utility Data'!W23","v":2},null,{"$f":"'Electric Utility Data'!Y23","v":"B+"},null,{"$f":"'Electric Utility Data'!X23","v":0.75},null,{"$f":"'Electric Utility Data'!AC23","v":13100}]
[17,"Y",{"$f":"'Electric Utility Data'!B24","v":"ETR"},{"$f":"'Electric Utility Data'!C24","v":"Entergy Corp."},null,{"$f":"'Electric Utility Data'!AA24","v":"BBB+"},{"$f":"IF(F24=\"NR\",0,VLOOKUP(F24,'Ordinal Ratings'!A$8:B$30,2,FALSE))","v":8},null,{"$f":"'Electric Utility Data'!AB24","v":"Baa2"},{"$f":"IF(I24=\"NR\",0,VLOOKUP(I24,'Ordinal Ratings'!I$8:J$26,2,FALSE))","v":9},null,{"$f":"'Electric Utility Data'!W24","v":2},null,{"$f":"'Electric Utility Data'!Y24","v":"B++"},null,{"$f":"'Electric Utility Data'!X24","v":0.95},null,{"$f":"'Electric Utility Data'!AC24","v":20000}]
[18,"",{"$f":"'Electric Utility Data'!B25","v":"EVRG"},{"$f":"'Electric Utility Data'!C25","v":"Evergy Inc."},null,{"$f":"'Electric Utility Data'!AA25","v":"A-"},{"$f":"IF(F25=\"NR\",0,VLOOKUP(F25,'Ordinal Ratings'!A$8:B$30,2,FALSE))","v":7},null,{"$f":"'Electric Utility Data'!AB25","v":"Baa2"},{"$f":"IF(I25=\"NR\",0,VLOOKUP(I25,'Ordinal Ratings'!I$8:J$26,2,FALSE))","v":9},null,{"$f":"'Electric Utility Data'!W25","v":2},null,{"$f":"'Electric Utility Data'!Y25","v":"B++"},null,{"$f":"'Electric Utility Data'!X25","v":1},null,{"$f":"'Electric Utility Data'!AC25","v":12000}]
[19,"",{"$f":"'Electric Utility Data'!B26","v":"ES"},{"$f":"'Electric Utility Data'!C26","v":"Eversource Energy"},null,{"$f":"'Electric Utility Data'!AA26","v":"A-"},{"$f":"IF(F26=\"NR\",0,VLOOKUP(F26,'Ordinal Ratings'!A$8:B$30,2,FALSE))","v":7},null,{"$f":"'Electric Utility Data'!AB26","v":"Baa1"},{"$f":"IF(I26=\"NR\",0,VLOOKUP(I26,'Ordinal Ratings'!I$8:J$26,2,FALSE))","v":8},null,{"$f":"'Electric Utility Data'!W26","v":1},null,{"$f":"'Electric Utility Data'!Y26","v":"A"},null,{"$f":"'Electric Utility Data'!X26","v":0.9},null,{"$f":"'Electric Utility Data'!AC26","v":30000}]
[20,"Y",{"$f":"'Electric Utility Data'!B27","v":"EXC"},{"$f":"'Electric Utility Data'!C27","v":"Exelon Corp."},null,{"$f":"'Electric Utility Data'!AA27","v":"BBB+"},{"$f":"IF(F27=\"NR\",0,VLOOKUP(F27,'Ordinal Ratings'!A$8:B$30,2,FALSE))","v":8},null,{"$f":"'Electric Utility Data'!AB27","v":"Baa2"},{"$f":"IF(I27=\"NR\",0,VLOOKUP(I27,'Ordinal Ratings'!I$8:J$26,2,FALSE))","v":9},null,{"$f":"'Electric Utility Data'!W27","v":3},null,{"$f":"'Electric Utility Data'!Y27","v":"B+"},null,{"$f":"'Electric Utility Data'!X27","v":0.95},null,{"$f":"'Electric Utility Data'!AC27","v":37000}]
[21,"Y",{"$f":"'Electric Utility Data'!B28","v":"FE"},{"$f":"'Electric Utility Data'!C28","v":"FirstEnergy Corp."},null,{"$f":"'Electric Utility Data'!AA28","v":"BBB"},{"$f":"IF(F28=\"NR\",0,VLOOKUP(F28,'Ordinal Ratings'!A$8:B$30,2,FALSE))","v":9},null,{"$f":"'Electric Utility Data'!AB28","v":"Baa3"},{"$f":"IF(I28=\"NR\",0,VLOOKUP(I28,'Ordinal Ratings'!I$8:J$26,2,FALSE))","v":10},null,{"$f":"'Electric Utility Data'!W28","v":3},null,{"$f":"'Electric Utility Data'!Y28","v":"B+"},null,{"$f":"'Electric Utility Data'!X28","v":0.85},null,{"$f":"'Electric Utility Data'!AC28","v":16000}]
[22,"",{"$f":"'Electric Utility Data'!B29","v":"FTS"},{"$f":"'Electric Utility Data'!C29","v":"Fortis Inc."},null,{"$f":"'Electric Utility Data'!AA29","v":"A-"},{"$f":"IF(F29=\"NR\",0,VLOOKUP(F29,'Ordinal Ratings'!A$8:B$30,2,FALSE))","v":7},null,{"$f":"'Electric Utility Data'!AB29","v":"Baa3"},{"$f":"IF(I29=\"NR\",0,VLOOKUP(I29,'Ordinal Ratings'!I$8:J$26,2,FALSE))","v":10},null,{"$f":"'Electric Utility Data'!W29","v":2},null,{"$f":"'Electric Utility Data'!Y29","v":"B++"},null,{"$f":"'Electric Utility Data'!X29","v":0.8},null,{"$f":"'Electric Utility Data'!AC29","v":24000}]
[23,"Y",{"$f":"'Electric Utility Data'!B30","v":"HE"},{"$f":"'Electric Utility Data'!C30","v":"Hawaiian Elec."},null,{"$f":"'Electric Utility Data'!AA30","v":"BBB-"},{"$f":"IF(F30=\"NR\",0,VLOOKUP(F30,'Ordinal Ratings'!A$8:B$30,2,FALSE))","v":10},null,{"$f":"'Electric Utility Data'!AB30","v":"Baa2"},{"$f":"IF(I30=\"NR\",0,VLOOKUP(I30,'Ordinal Ratings'!I$8:J$26,2,FALSE))","v":9},null,{"$f":"'Electric Utility Data'!W30","v":2},null,{"$f":"'Electric Utility Data'!Y30","v":"A"},null,{"$f":"'Electric Utility Data'!X30","v":0.8},null,{"$f":"'Electric Utility Data'!AC30","v":4000}]
[24,"Y",{"$f":"'Electric Utility Data'!B31","v":"IDA"},{"$f":"'Electric Utility Data'!C31","v":"IDACORP, Inc."},null,{"$f":"'Electric Utility Data'!AA31","v":"BBB"},{"$f":"IF(F31=\"NR\",0,VLOOKUP(F31,'Ordinal Ratings'!A$8:B$30,2,FALSE))","v":9},null,{"$f":"'Electric Utility Data'!AB31","v":"Baa1"},{"$f":"IF(I31=\"NR\",0,VLOOKUP(I31,'Ordinal Ratings'!I$8:J$26,2,FALSE))","v":8},null,{"$f":"'Electric Utility Data'!W31","v":2},null,{"$f":"'Electric Utility Data'!Y31","v":"A"},null,{"$f":"'Electric Utility Data'!X31","v":0.8},null,{"$f":"'Electric Utility Data'!AC31","v":4600}]
[25,"",{"$f":"'Electric Utility Data'!B32","v":"MGEE"},{"$f":"'Electric Utility Data'!C32","v":"MGE Energy"},null,{"$f":"'Electric Utility Data'!AA32","v":"NR"},{"$f":"IF(F32=\"NR\",0,VLOOKUP(F32,'Ordinal Ratings'!A$8:B$30,2,FALSE))","v":0},null,{"$f":"'Electric Utility Data'!AB32","v":"NR"},{"$f":"IF(I32=\"NR\",0,VLOOKUP(I32,'Ordinal Ratings'!I$8:J$26,2,FALSE))","v":0},null,{"$f":"'Electric Utility Data'!W32","v":1},null,{"$f":"'Electric Utility Data'!Y32","v":"A+"},null,{"$f":"'Electric Utility Data'!X32","v":0.7},null,{"$f":"'Electric Utility Data'!AC32","v":2400}]
[26,"",{"$f":"'Electric Utility Data'!B33","v":"NEE"},{"$f":"'Electric Utility Data'!C33","v":"NextEra Energy, Inc."},null,{"$f":"'Electric Utility Data'!AA33","v":"A-"},{"$f":"IF(F33=\"NR\",0,VLOOKUP(F33,'Ordinal Ratings'!A$8:B$30,2,FALSE))","v":7},null,{"$f":"'Electric Utility Data'!AB33","v":"Baa1"},{"$f":"IF(I33=\"NR\",0,VLOOKUP(I33,'Ordinal Ratings'!I$8:J$26,2,FALSE))","v":8},null,{"$f":"'Electric Utility Data'!W33","v":1},null,{"$f":"'Electric Utility Data'!Y33","v":"A+"},null,{"$f":"'Electric Utility Data'!X33","v":0.85},null,{"$f":"'Electric Utility Data'!AC33","v":136000}]
[27,"Y",{"$f":"'Electric Utility Data'!B34","v":"NWE"},{"$f":"'Electric Utility Data'!C34","v":"NorthWestern Corp."},null,{"$f":"'Electric Utility Data'!AA34","v":"BBB"},{"$f":"IF(F34=\"NR\",0,VLOOKUP(F34,'Ordinal Ratings'!A$8:B$30,2,FALSE))","v":9},null,{"$f":"'Electric Utility Data'!AB34","v":"Baa2"},{"$f":"IF(I34=\"NR\",0,VLOOKUP(I34,'Ordinal Ratings'!I$8:J$26,2,FALSE))","v":9},null,{"$f":"'Electric Utility Data'!W34","v":2},null,{"$f":"'Electric Utility Data'!Y34","v":"B++"},null,{"$f":"'Electric Utility Data'!X34","v":0.9},null,{"$f":"'Electric Utility Data'!AC34","v":2700}]
[28,"Y",{"$f":"'Electric Utility Data'!B35","v":"OGE"},{"$f":"'Electric Utility Data'!C35","v":"OGE Energy Corp."},null,{"$f":"'Electric Utility Data'!AA35","v":"BBB+"},{"$f":"IF(F35=\"NR\",0,VLOOKUP(F35,'Ordinal Ratings'!A$8:B$30,2,FALSE))","v":8},null,{"$f":"'Electric Utility Data'!AB35","v":"Baa1"},{"$f":"IF(I35=\"NR\",0,VLOOKUP(I35,'Ordinal Ratings'!I$8:J$26,2,FALSE))","v":8},null,{"$f":"'Electric Utility Data'!W35","v":2},null,{"$f":"'Electric Utility Data'!Y35","v":"A"},null,{"$f":"'Electric Utility Data'!X35","v":1.05},null,{"$f":"'Electric Utility Data'!AC35","v":6400}]
[29,"Y",{"$f":"'Electric Utility Data'!B36","v":"OTTR"},{"$f":"'Electric Utility Data'!C36","v":"Otter Tail Corp."},null,{"$f":"'Electric Utility Data'!AA36","v":"BBB"},{"$f":"IF(F36=\"NR\",0,VLOOKUP(F36,'Ordinal Ratings'!A$8:B$30,2,FALSE))","v":9},null,{"$f":"'Electric Utility Data'!AB36","v":"Baa2"},{"$f":"IF(I36=\"NR\",0,VLOOKUP(I36,'Ordinal Ratings'!I$8:J$26,2,FALSE))","v":9},null,{"$f":"'Electric Utility Data'!W36","v":2},null,{"$f":"'Electric Utility Data'!Y36","v":"A"},null,{"$f":"'Electric Utility Data'!X36","v":0.85},null,{"$f":"'Electric Utility Data'!AC36","v":1600}]
[30,"",{"$f":"'Electric Utility Data'!B37","v":"PNW"},{"$f":"'Electric Utility Data'!C37","v":"Pinnacle West Capital"},null,{"$f":"'Electric Utility Data'!AA37","v":"A-"},{"$f":"IF(F37=\"NR\",0,VLOOKUP(F37,'Ordinal Ratings'!A$8:B$30,2,FALSE))","v":7},null,{"$f":"'Electric Utility Data'!AB37","v":"A3"},{"$f":"IF(I37=\"NR\",0,VLOOKUP(I37,'Ordinal Ratings'!I$8:J$26,2,FALSE))","v":7},null,{"$f":"'Electric Utility Data'!W37","v":1},null,{"$f":"'Electric Utility Data'!Y37","v":"A+"},null,{"$f":"'Electric Utility Data'!X37","v":0.85},null,{"$f":"'Electric Utility Data'!AC37","v":8900}]
[31,"Y",{"$f":"'Electric Utility Data'!B38","v":"PNM"},{"$f":"'Electric Utility Data'!C38","v":"PNM Resources"},null,{"$f":"'Electric Utility Data'!AA38","v":"BBB"},{"$f":"IF(F38=\"NR\",0,VLOOKUP(F38,'Ordinal Ratings'!A$8:B$30,2,FALSE))","v":9},null,{"$f":"'Electric Utility Data'!AB38","v":"Baa3"},{"$f":"IF(I38=\"NR\",0,VLOOKUP(I38,'Ordinal Ratings'!I$8:J$26,2,FALSE))","v":10},null,{"$f":"'Electric Utility Data'!W38","v":3},null,{"$f":"'Electric Utility Data'!Y38","v":"B+"},null,{"$f":"'Electric Utility Data'!X38","v":0.95},null,{"$f":"'Electric Utility Data'!AC38","v":3100}]
[32,"",{"$f":"'Electric Utility Data'!B39","v":"POR"},{"$f":"'Electric Utility Data'!C39","v":"Portland General Elec."},null,{"$f":"'Electric Utility Data'!AA39","v":"BBB+"},{"$f":"IF(F39=\"NR\",0,VLOOKUP(F39,'Ordinal Ratings'!A$8:B$30,2,FALSE))","v":8},null,{"$f":"'Electric Utility Data'!AB39","v":"A3"},{"$f":"IF(I39=\"NR\",0,VLOOKUP(I39,'Ordinal Ratings'!I$8:J$26,2,FALSE))","v":7},null,{"$f":"'Electric Utility Data'!W39","v":2},null,{"$f":"'Electric Utility Data'!Y39","v":"B++"},null,{"$f":"'Electric Utility Data'!X39","v":0.85},null,{"$f":"'Electric Utility Data'!AC39","v":3800}]
[33,"",{"$f":"'Electric Utility Data'!B40","v":"PPL"},{"$f":"'Electric Utility Data'!C40","v":"PPL Corp."},null,{"$f":"'Electric Utility Data'!AA40","v":"A-"},{"$f":"IF(F40=\"NR\",0,VLOOKUP(F40,'Ordinal Ratings'!A$8:B$30,2,FALSE))","v":7},null,{"$f":"'Electric Utility Data'!AB40","v":"Baa2"},{"$f":"IF(I40=\"NR\",0,VLOOKUP(I40,'Ordinal Ratings'!I$8:J$26,2,FALSE))","v":9},null,{"$f":"'Electric Utility Data'!W40","v":2},null,{"$f":"'Electric Utility Data'!Y40","v":"B++"},null,{"$f":"'Electric Utility Data'!X40","v":1.1000000000000001},null,{"$f":"'Electric Utility Data'!AC40","v":20000}]
[34,"",{"$f":"'Electric Utility Data'!B41","v":"PEG"},{"$f":"'Electric Utility Data'!C41","v":"Pub Sv Enterprise Grp."},null,{"$f":"'Electric Utility Data'!AA41","v":"BBB+"},{"$f":"IF(F41=\"NR\",0,VLOOKUP(F41,'Ordinal Ratings'!A$8:B$30,2,FALSE))","v":8},null,{"$f":"'Electric Utility Data'!AB41","v":"Baa1"},{"$f":"IF(I41=\"NR\",0,VLOOKUP(I41,'Ordinal Ratings'!I$8:J$26,2,FALSE))","v":8},null,{"$f":"'Electric Utility Data'!W41","v":1},null,{"$f":"'Electric Utility Data'!Y41","v":"A++"},null,{"$f":"'Electric Utility Data'!X41","v":0.9},null,{"$f":"'Electric Utility Data'!AC41","v":28000}]
[35,"Y",{"$f":"'Electric Utility Data'!B42","v":"SRE"},{"$f":"'Electric Utility Data'!C42","v":"Sempra Energy"},null,{"$f":"'Electric Utility Data'!AA42","v":"BBB+"},{"$f":"IF(F42=\"NR\",0,VLOOKUP(F42,'Ordinal Ratings'!A$8:B$30,2,FALSE))","v":8},null,{"$f":"'Electric Utility Data'!AB42","v":"Baa2"},{"$f":"IF(I42=\"NR\",0,VLOOKUP(I42,'Ordinal Ratings'!I$8:J$26,2,FALSE))","v":9},null,{"$f":"'Electric Utility Data'!W42","v":2},null,{"$f":"'Electric Utility Data'!Y42","v":"A"},null,{"$f":"'Electric Utility Data'!X42","v":0.95},null,{"$f":"'Electric Utility Data'!AC42","v":35000}]
[36,"",{"$f":"'Electric Utility Data'!B43","v":"SO"},{"$f":"'Electric Utility Data'!C43","v":"Southern Company"},null,{"$f":"'Electric Utility Data'!AA43","v":"A-"},{"$f":"IF(F43=\"NR\",0,VLOOKUP(F43,'Ordinal Ratings'!A$8:B$30,2,FALSE))","v":7},null,{"$f":"'Electric Utility Data'!AB43","v":"Baa2"},{"$f":"IF(I43=\"NR\",0,VLOOKUP(I43,'Ordinal Ratings'!I$8:J$26,2,FALSE))","v":9},null,{"$f":"'Electric Utility Data'!W43","v":2},null,{"$f":"'Electric Utility Data'!Y43","v":"A"},null,{"$f":"'Electric Utility Data'!X43","v":0.9},null,{"$f":"'Electric Utility Data'!AC43","v":57000}]
[37,"",{"$f":"'Electric Utility Data'!B44","v":"WEC"},{"$f":"'Electric Utility Data'!C44","v":"WEC Energy Group"},null,{"$f":"'Electric Utility Data'!AA44","v":"A-"},{"$f":"IF(F44=\"NR\",0,VLOOKUP(F44,'Ordinal Ratings'!A$8:B$30,2,FALSE))","v":7},null,{"$f":"'Electric Utility Data'!AB44","v":"Baa1"},{"$f":"IF(I44=\"NR\",0,VLOOKUP(I44,'Ordinal Ratings'!I$8:J$26,2,FALSE))","v":8},null,{"$f":"'Electric Utility Data'!W44","v":1},null,{"$f":"'Electric Utility Data'!Y44","v":"A+"},null,{"$f":"'Electric Utility Data'!X44","v":0.8},null,{"$f":"'Electric Utility Data'!AC44","v":30000}]
[38,"",{"$f":"'Electric Utility Data'!B45","v":"XEL"},{"$f":"'Electric Utility Data'!C45","v":"Xcel Energy Inc."},null,{"$f":"'Electric Utility Data'!AA45","v":"A-"},{"$f":"IF(F45=\"NR\",0,VLOOKUP(F45,'Ordinal Ratings'!A$8:B$30,2,FALSE))","v":7},null,{"$f":"'Electric Utility Data'!AB45","v":"Baa1"},{"$f":"IF(I45=\"NR\",0,VLOOKUP(I45,'Ordinal Ratings'!I$8:J$26,2,FALSE))","v":8},null,{"$f":"'Electric Utility Data'!W45","v":1},null,{"$f":"'Electric Utility Data'!Y45","v":"A+"},null,{"$f":"'Electric Utility Data'!X45","v":0.8},null,{"$f":"'Electric Utility Data'!AC45","v":34000}]
[]
[]
["(a)",{"$f":"'Electric Utility Data'!B51","v":"Issuer credit rating from www.standardandpoors.com (retrieved Oct. 5, 2020)."}]
["(b)",{"$f":"'Electric Utility Data'!B52","v":"Long-term rating from www.moodys.com (retrieved Oct. 5, 2020)."}]
["(c)",{"$f":"'Electric Utility Data'!B50","v":"The Value Line Investment Survey (Jul. 24, Aug. 14 and Sep. 11, 2020)."}]
["(d)",{"$f":"'Electric Utility Data'!B53","v":"www.finance.yahoo.com (retreived Oct. 5, 2020)."}]
[]
[null,{"$f":"COUNTIF(B8:B45,\"Y\")","v":21},null,{"$f":"\"S&P corporate credit rating of \"&VLOOKUP(G62,'Ordinal Ratings'!B$8:C$30,2,FALSE)&\", \"&F61&\", or \"&VLOOKUP(G63,'Ordinal Ratings'!B$8:C$30,2,FALSE)","v":"S&P corporate credit rating of BBB-, BBB, or BBB+"}]
[null,null,null,{"$f":"\"Moody's issure rating of \"&VLOOKUP(J62,'Ordinal Ratings'!J$8:K$30,2,FALSE)&\", \"&I61&\", or \"&VLOOKUP(J63,'Ordinal Ratings'!J$8:K$30,2,FALSE)","v":"Moody's issure rating of Baa3, Baa2, or Baa1"}]
[null,null,null,"Safety Rank of \"2\" or \"3\""]
[]
[]
[]
[]
[null,null,null,"Proxy Group Criteria",null,"S&P",null,null,"Moodys",null,null,"Safety"]
[null,null,null,"Avista Corp.",null,"BBB",{"$f":"IF(F61=\"NR\",0,VLOOKUP(F61,'Ordinal Ratings'!A$8:B$30,2,FALSE))","v":9},null,"Baa2",{"$f":"IF(I61=\"NR\",0,VLOOKUP(I61,'Ordinal Ratings'!I$8:J$26,2,FALSE))","v":9},null,2]
[null,null,null,"Low Rating",null,{"$f":"VLOOKUP(G62,'Ordinal Ratings'!$B$8:$C$28,2,FALSE)","v":"BBB-"},{"$f":"VLOOKUP(F$61,'Ordinal Ratings'!A$8:B$30,2,FALSE)+1","v":10},null,{"$f":"VLOOKUP(J62,'Ordinal Ratings'!$J$8:$K$28,2,FALSE)","v":"Baa3"},{"$f":"VLOOKUP(I$61,'Ordinal Ratings'!I$8:J$26,2,FALSE)+1","v":10},null,{"$f":"L61","v":2}]
[null,null,null,"High Rating",null,{"$f":"VLOOKUP(G63,'Ordinal Ratings'!$B$8:$C$28,2,FALSE)","v":"BBB+"},{"$f":"VLOOKUP(F$61,'Ordinal Ratings'!A$8:B$30,2,FALSE)-1","v":8},null,{"$f":"VLOOKUP(J63,'Ordinal Ratings'!$J$8:$K$28,2,FALSE)","v":"Baa1"},{"$f":"VLOOKUP(I$61,'Ordinal Ratings'!I$8:J$26,2,FALSE)-1","v":8},null,{"$f":"L61+1","v":3}]
[]
[]
[]
[]
[]
[null,null,{"$f":"IF($B8=\"Y\",C8,\"zzz\")","v":"AQN"},"Algonquin Pwr & Util"]
[null,null,"ALE","ALLETE"]
[null,null,"zzz","zzz"]
[null,null,"AEE","Ameren Corp."]
[null,null,"zzz","zzz"]
[null,null,"AGR","Avangrid, Inc."]
[null,null,"AVA","Avista Corp."]
[null,null,"BKH","Black Hills Corp."]
[null,null,"CNP","CenterPoint Energy"]
[null,null,"CMS","CMS Energy Corp."]
[null,null,"zzz","zzz"]
[null,null,"zzz","zzz"]
[null,null,"DTE","DTE Energy Co."]
[null,null,"zzz","zzz"]
[null,null,"EIX","Edison International"]
[null,null,"EMA","Emera Inc."]
[null,null,"ETR","Entergy Corp."]
[null,null,"zzz","zzz"]
[null,null,"zzz","zzz"]
[null,null,"EXC","Exelon Corp."]
[null,null,"FE","FirstEnergy Corp."]
[null,null,"zzz","zzz"]
[null,null,"HE","Hawaiian Elec."]
[null,null,"IDA","IDACORP, Inc."]
[null,null,"zzz","zzz"]
[null,null,"zzz","zzz"]
[null,null,"NWE","NorthWestern Corp."]
[null,null,"OGE","OGE Energy Corp."]
[null,null,"OTTR","Otter Tail Corp."]
[null,null,"zzz","zzz"]
[null,null,{"$f":"IF(#REF!=\"Y\",#REF!,\"zzz\")","v":{"$error":"#REF!"}},{"$f":"IF(#REF!=\"Y\",#REF!,\"zzz\")","v":{"$error":"#REF!"}}]
[null,null,{"$f":"IF($B38=\"Y\",C38,\"zzz\")","v":"PNM"},"PNM Resources"]
[null,null,"zzz","zzz"]
[null,null,"zzz","zzz"]
[null,null,"zzz","zzz"]
[null,null,"SRE","Sempra Energy"]
[null,null,{"$f":"IF(#REF!=\"Y\",#REF!,\"zzz\")","v":{"$error":"#REF!"}},{"$f":"IF(#REF!=\"Y\",#REF!,\"zzz\")","v":{"$error":"#REF!"}}]
[null,null,{"$f":"IF($B43=\"Y\",C43,\"zzz\")","v":"zzz"},{"$f":"IF($B43=\"Y\",D43,\"zzz\")","v":"zzz"}]
[null,null,{"$f":"IF(#REF!=\"Y\",#REF!,\"zzz\")","v":{"$error":"#REF!"}},{"$f":"IF(#REF!=\"Y\",#REF!,\"zzz\")","v":{"$error":"#REF!"}}]
[null,null,{"$f":"IF($B44=\"Y\",C44,\"zzz\")","v":"zzz"},{"$f":"IF($B44=\"Y\",D44,\"zzz\")","v":"zzz"}]
[null,null,{"$f":"IF(#REF!=\"Y\",#REF!,\"zzz\")","v":{"$error":"#REF!"}},{"$f":"IF(#REF!=\"Y\",#REF!,\"zzz\")","v":{"$error":"#REF!"}}]
[null,null,{"$f":"IF($B45=\"Y\",C45,\"zzz\")","v":"zzz"},{"$f":"IF($B45=\"Y\",D45,\"zzz\")","v":"zzz"}]
[null,null,{"$f":"IF(#REF!=\"Y\",#REF!,\"zzz\")","v":{"$error":"#REF!"}},{"$f":"IF(#REF!=\"Y\",#REF!,\"zzz\")","v":{"$error":"#REF!"}}]

{"sheet":"Utility Group","index":1,"n_rows":42,"n_cols":3,"rows_kept":42,"cut":false,"hidden":false,"merged":[]}
[]
[null,"SYM","Company"]
[{"$f":"A2+1","v":1},{"$f":"'Utility Group Criteria'!C69","v":"AQN"},{"$f":"'Utility Group Criteria'!D69","v":"Algonquin Pwr & Util"}]
[{"$f":"A3+1","v":2},{"$f":"'Utility Group Criteria'!C70","v":"ALE"},{"$f":"'Utility Group Criteria'!D70","v":"ALLETE"}]
[3,{"$f":"'Utility Group Criteria'!C72","v":"AEE"},{"$f":"'Utility Group Criteria'!D72","v":"Ameren Corp."}]
[4,{"$f":"'Utility Group Criteria'!C74","v":"AGR"},{"$f":"'Utility Group Criteria'!D74","v":"Avangrid, Inc."}]
[5,{"$f":"'Utility Group Criteria'!C75","v":"AVA"},{"$f":"'Utility Group Criteria'!D75","v":"Avista Corp."}]
[6,{"$f":"'Utility Group Criteria'!C76","v":"BKH"},{"$f":"'Utility Group Criteria'!D76","v":"Black Hills Corp."}]
[7,{"$f":"'Utility Group Criteria'!C77","v":"CNP"},{"$f":"'Utility Group Criteria'!D77","v":"CenterPoint Energy"}]
[8,{"$f":"'Utility Group Criteria'!C78","v":"CMS"},{"$f":"'Utility Group Criteria'!D78","v":"CMS Energy Corp."}]
[9,{"$f":"'Utility Group Criteria'!C81","v":"DTE"},{"$f":"'Utility Group Criteria'!D81","v":"DTE Energy Co."}]
[10,{"$f":"'Utility Group Criteria'!C83","v":"EIX"},{"$f":"'Utility Group Criteria'!D83","v":"Edison International"}]
[11,{"$f":"'Utility Group Criteria'!C84","v":"EMA"},{"$f":"'Utility Group Criteria'!D84","v":"Emera Inc."}]
[12,{"$f":"'Utility Group Criteria'!C85","v":"ETR"},{"$f":"'Utility Group Criteria'!D85","v":"Entergy Corp."}]
[13,{"$f":"'Utility Group Criteria'!C88","v":"EXC"},{"$f":"'Utility Group Criteria'!D88","v":"Exelon Corp."}]
[14,{"$f":"'Utility Group Criteria'!C89","v":"FE"},{"$f":"'Utility Group Criteria'!D89","v":"FirstEnergy Corp."}]
[15,{"$f":"'Utility Group Criteria'!C91","v":"HE"},{"$f":"'Utility Group Criteria'!D91","v":"Hawaiian Elec."}]
[16,{"$f":"'Utility Group Criteria'!C92","v":"IDA"},{"$f":"'Utility Group Criteria'!D92","v":"IDACORP, Inc."}]
[17,{"$f":"'Utility Group Criteria'!C95","v":"NWE"},{"$f":"'Utility Group Criteria'!D95","v":"NorthWestern Corp."}]
[18,{"$f":"'Utility Group Criteria'!C96","v":"OGE"},{"$f":"'Utility Group Criteria'!D96","v":"OGE Energy Corp."}]
[19,{"$f":"'Utility Group Criteria'!C97","v":"OTTR"},{"$f":"'Utility Group Criteria'!D97","v":"Otter Tail Corp."}]
[20,{"$f":"'Utility Group Criteria'!C100","v":"PNM"},{"$f":"'Utility Group Criteria'!D100","v":"PNM Resources"}]
[21,{"$f":"'Utility Group Criteria'!C104","v":"SRE"},{"$f":"'Utility Group Criteria'!D104","v":"Sempra Energy"}]
[22,{"$f":"'Utility Group Criteria'!C80","v":"zzz"},{"$f":"'Utility Group Criteria'!D80","v":"zzz"}]
[23,{"$f":"'Utility Group Criteria'!C86","v":"zzz"},{"$f":"'Utility Group Criteria'!D86","v":"zzz"}]
[24,{"$f":"'Utility Group Criteria'!C90","v":"zzz"},{"$f":"'Utility Group Criteria'!D90","v":"zzz"}]
[25,{"$f":"'Utility Group Criteria'!C93","v":"zzz"},{"$f":"'Utility Group Criteria'!D93","v":"zzz"}]
[26,{"$f":"'Utility Group Criteria'!C98","v":"zzz"},{"$f":"'Utility Group Criteria'!D98","v":"zzz"}]
[27,{"$f":"'Utility Group Criteria'!C101","v":"zzz"},{"$f":"'Utility Group Criteria'!D101","v":"zzz"}]
[28,{"$f":"'Utility Group Criteria'!C106","v":"zzz"},{"$f":"'Utility Group Criteria'!D106","v":"zzz"}]
[29,{"$f":"'Utility Group Criteria'!C71","v":"zzz"},{"$f":"'Utility Group Criteria'!D71","v":"zzz"}]
[30,{"$f":"'Utility Group Criteria'!C73","v":"zzz"},{"$f":"'Utility Group Criteria'!D73","v":"zzz"}]
[31,{"$f":"'Utility Group Criteria'!C79","v":"zzz"},{"$f":"'Utility Group Criteria'!D79","v":"zzz"}]
[32,{"$f":"'Utility Group Criteria'!C82","v":"zzz"},{"$f":"'Utility Group Criteria'!D82","v":"zzz"}]
[33,{"$f":"'Utility Group Criteria'!C102","v":"zzz"},{"$f":"'Utility Group Criteria'!D102","v":"zzz"}]
[34,{"$f":"'Utility Group Criteria'!C103","v":"zzz"},{"$f":"'Utility Group Criteria'!D103","v":"zzz"}]
[35,{"$f":"'Utility Group Criteria'!C108","v":"zzz"},{"$f":"'Utility Group Criteria'!D108","v":"zzz"}]
[36,{"$f":"'Utility Group Criteria'!C87","v":"zzz"},{"$f":"'Utility Group Criteria'!D87","v":"zzz"}]
[37,{"$f":"'Utility Group Criteria'!C94","v":"zzz"},{"$f":"'Utility Group Criteria'!D94","v":"zzz"}]
[38,{"$f":"'Utility Group Criteria'!C110","v":"zzz"},{"$f":"'Utility Group Criteria'!D110","v":"zzz"}]
[39,{"$f":"'Utility Group Criteria'!C111","v":{"$error":"#REF!"}},{"$f":"'Utility Group Criteria'!D111","v":{"$error":"#REF!"}}]
[40,{"$f":"'Utility Group Criteria'!C99","v":{"$error":"#REF!"}},{"$f":"'Utility Group Criteria'!D99","v":{"$error":"#REF!"}}]

{"sheet":"Proxy Group Risk Measures","index":2,"n_rows":95,"n_cols":20,"rows_kept":95,"cut":false,"hidden":false,"merged":[[3,9,3,14],[4,3,4,4],[4,6,4,7],[5,3,5,6],[42,6,42,7],[41,3,41,6],[6,3,6,4],[6,6,6,7],[3,3,3,4],[42,3,42,4],[39,3,39,4],[39,9,39,14],[40,9,40,14],[40,3,40,4],[40,6,40,7],[4,9,4,14]]}
["RISK MEASURES"]
[]
["ELECTRIC GROUP"]
[null,null,null,"(a)",null,null,"(b)",null,null,"(c)",null,null,null,null,null,null,"(d)"]
[null,null,null,null,null,null,null,null,null,"Value Line"]
[null,null,null,"Credit Ratings",null,null,null,null,null,"Safety",null,"Financial",null,null,null,null,"Market"]
[null,"Company",null,"S&P",null,null,"Moody's",null,null,"Rank",null,"Strength",null,null,"Beta",null,"Cap"]
[{"$f":"A7+1","v":1},{"$f":"VLOOKUP('Utility Group'!$B3,vldatabase,2,FALSE)","v":"Algonquin Pwr & Util"},null,{"$f":"VLOOKUP('Utility Group'!$B3,vldatabase,26,FALSE)","v":"BBB"},{"$f":"VLOOKUP(D8,'Ordinal Ratings'!A$8:C$30,2,FALSE)","v":9},null,{"$f":"VLOOKUP('Utility Group'!$B3,vldatabase,27,FALSE)","v":"NR"},{"$f":"VLOOKUP(G8,'Ordinal Ratings'!I$9:K$28,2,FALSE)","v":" "},null,{"$f":"VLOOKUP('Utility Group'!$B3,vldatabase,22,FALSE)","v":"n/a"},null,{"$f":"VLOOKUP('Utility Group'!$B3,vldatabase,24,FALSE)","v":"n/a"},{"$f":"VLOOKUP(L8,'Ordinal Ratings'!E$8:F$18,2,FALSE)","v":" "},null,{"$f":"VLOOKUP('Utility Group'!$B3,vldatabase,23,FALSE)","v":0.9},null,{"$f":"VLOOKUP('Utility Group'!$B3,vldatabase,28,FALSE)","v":9094.3405220000004}]
[{"$f":"A8+1","v":2},{"$f":"VLOOKUP('Utility Group'!$B4,vldatabase,2,FALSE)","v":"ALLETE"},null,{"$f":"VLOOKUP('Utility Group'!$B4,vldatabase,26,FALSE)","v":"BBB"},{"$f":"VLOOKUP(D9,'Ordinal Ratings'!A$8:C$30,2,FALSE)","v":9},null,{"$f":"VLOOKUP('Utility Group'!$B4,vldatabase,27,FALSE)","v":"Baa1"},{"$f":"VLOOKUP(G9,'Ordinal Ratings'!I$9:K$28,2,FALSE)","v":8},null,{"$f":"VLOOKUP('Utility Group'!$B4,vldatabase,22,FALSE)","v":2},null,{"$f":"VLOOKUP('Utility Group'!$B4,vldatabase,24,FALSE)","v":"A"},{"$f":"VLOOKUP(L9,'Ordinal Ratings'!E$8:F$18,2,FALSE)","v":3},null,{"$f":"VLOOKUP('Utility Group'!$B4,vldatabase,23,FALSE)","v":0.85},null,{"$f":"VLOOKUP('Utility Group'!$B4,vldatabase,28,FALSE)","v":2800}]
[3,{"$f":"VLOOKUP('Utility Group'!$B5,vldatabase,2,FALSE)","v":"Ameren Corp."},null,{"$f":"VLOOKUP('Utility Group'!$B5,vldatabase,26,FALSE)","v":"BBB+"},{"$f":"VLOOKUP(D10,'Ordinal Ratings'!A$8:C$30,2,FALSE)","v":8},null,{"$f":"VLOOKUP('Utility Group'!$B5,vldatabase,27,FALSE)","v":"Baa1"},{"$f":"VLOOKUP(G10,'Ordinal Ratings'!I$9:K$28,2,FALSE)","v":8},null,{"$f":"VLOOKUP('Utility Group'!$B5,vldatabase,22,FALSE)","v":2},null,{"$f":"VLOOKUP('Utility Group'!$B5,vldatabase,24,FALSE)","v":"A"},{"$f":"VLOOKUP(L10,'Ordinal Ratings'!E$8:F$18,2,FALSE)","v":3},null,{"$f":"VLOOKUP('Utility Group'!$B5,vldatabase,23,FALSE)","v":0.8},null,{"$f":"VLOOKUP('Utility Group'!$B5,vldatabase,28,FALSE)","v":20000}]
[4,{"$f":"VLOOKUP('Utility Group'!$B6,vldatabase,2,FALSE)","v":"Avangrid, Inc."},null,{"$f":"VLOOKUP('Utility Group'!$B6,vldatabase,26,FALSE)","v":"BBB+"},{"$f":"VLOOKUP(D11,'Ordinal Ratings'!A$8:C$30,2,FALSE)","v":8},null,{"$f":"VLOOKUP('Utility Group'!$B6,vldatabase,27,FALSE)","v":"Baa1"},{"$f":"VLOOKUP(G11,'Ordinal Ratings'!I$9:K$28,2,FALSE)","v":8},null,{"$f":"VLOOKUP('Utility Group'!$B6,vldatabase,22,FALSE)","v":2},null,{"$f":"VLOOKUP('Utility Group'!$B6,vldatabase,24,FALSE)","v":"B++"},{"$f":"VLOOKUP(L11,'Ordinal Ratings'!E$8:F$18,2,FALSE)","v":4},null,{"$f":"VLOOKUP('Utility Group'!$B6,vldatabase,23,FALSE)","v":0.8},null,{"$f":"VLOOKUP('Utility Group'!$B6,vldatabase,28,FALSE)","v":15000}]
[5,{"$f":"VLOOKUP('Utility Group'!$B7,vldatabase,2,FALSE)","v":"Avista Corp."},null,{"$f":"VLOOKUP('Utility Group'!$B7,vldatabase,26,FALSE)","v":"BBB"},{"$f":"VLOOKUP(D12,'Ordinal Ratings'!A$8:C$30,2,FALSE)","v":9},null,{"$f":"VLOOKUP('Utility Group'!$B7,vldatabase,27,FALSE)","v":"Baa2"},{"$f":"VLOOKUP(G12,'Ordinal Ratings'!I$9:K$28,2,FALSE)","v":9},null,{"$f":"VLOOKUP('Utility Group'!$B7,vldatabase,22,FALSE)","v":2},null,{"$f":"VLOOKUP('Utility Group'!$B7,vldatabase,24,FALSE)","v":"B++"},{"$f":"VLOOKUP(L12,'Ordinal Ratings'!E$8:F$18,2,FALSE)","v":4},null,{"$f":"VLOOKUP('Utility Group'!$B7,vldatabase,23,FALSE)","v":0.9},null,{"$f":"VLOOKUP('Utility Group'!$B7,vldatabase,28,FALSE)","v":2400}]
[6,{"$f":"VLOOKUP('Utility Group'!$B8,vldatabase,2,FALSE)","v":"Black Hills Corp."},null,{"$f":"VLOOKUP('Utility Group'!$B8,vldatabase,26,FALSE)","v":"BBB+"},{"$f":"VLOOKUP(D13,'Ordinal Ratings'!A$8:C$30,2,FALSE)","v":8},null,{"$f":"VLOOKUP('Utility Group'!$B8,vldatabase,27,FALSE)","v":"Baa2"},{"$f":"VLOOKUP(G13,'Ordinal Ratings'!I$9:K$28,2,FALSE)","v":9},null,{"$f":"VLOOKUP('Utility Group'!$B8,vldatabase,22,FALSE)","v":2},null,{"$f":"VLOOKUP('Utility Group'!$B8,vldatabase,24,FALSE)","v":"A"},{"$f":"VLOOKUP(L13,'Ordinal Ratings'!E$8:F$18,2,FALSE)","v":3},null,{"$f":"VLOOKUP('Utility Group'!$B8,vldatabase,23,FALSE)","v":0.95},null,{"$f":"VLOOKUP('Utility Group'!$B8,vldatabase,28,FALSE)","v":3800}]
[7,{"$f":"VLOOKUP('Utility Group'!$B9,vldatabase,2,FALSE)","v":"CenterPoint Energy"},null,{"$f":"VLOOKUP('Utility Group'!$B9,vldatabase,26,FALSE)","v":"BBB+"},{"$f":"VLOOKUP(D14,'Ordinal Ratings'!A$8:C$30,2,FALSE)","v":8},null,{"$f":"VLOOKUP('Utility Group'!$B9,vldatabase,27,FALSE)","v":"Baa2"},{"$f":"VLOOKUP(G14,'Ordinal Ratings'!I$9:K$28,2,FALSE)","v":9},null,{"$f":"VLOOKUP('Utility Group'!$B9,vldatabase,22,FALSE)","v":3},null,{"$f":"VLOOKUP('Utility Group'!$B9,vldatabase,24,FALSE)","v":"B+"},{"$f":"VLOOKUP(L14,'Ordinal Ratings'!E$8:F$18,2,FALSE)","v":5},null,{"$f":"VLOOKUP('Utility Group'!$B9,vldatabase,23,FALSE)","v":1.1000000000000001},null,{"$f":"VLOOKUP('Utility Group'!$B9,vldatabase,28,FALSE)","v":11000}]
[8,{"$f":"VLOOKUP('Utility Group'!$B10,vldatabase,2,FALSE)","v":"CMS Energy Corp."},null,{"$f":"VLOOKUP('Utility Group'!$B10,vldatabase,26,FALSE)","v":"BBB+"},{"$f":"VLOOKUP(D15,'Ordinal Ratings'!A$8:C$30,2,FALSE)","v":8},null,{"$f":"VLOOKUP('Utility Group'!$B10,vldatabase,27,FALSE)","v":"Baa1"},{"$f":"VLOOKUP(G15,'Ordinal Ratings'!I$9:K$28,2,FALSE)","v":8},null,{"$f":"VLOOKUP('Utility Group'!$B10,vldatabase,22,FALSE)","v":2},null,{"$f":"VLOOKUP('Utility Group'!$B10,vldatabase,24,FALSE)","v":"B++"},{"$f":"VLOOKUP(L15,'Ordinal Ratings'!E$8:F$18,2,FALSE)","v":4},null,{"$f":"VLOOKUP('Utility Group'!$B10,vldatabase,23,FALSE)","v":0.8},null,{"$f":"VLOOKUP('Utility Group'!$B10,vldatabase,28,FALSE)","v":17000}]
[9,{"$f":"VLOOKUP('Utility Group'!$B11,vldatabase,2,FALSE)","v":"DTE Energy Co."},null,{"$f":"VLOOKUP('Utility Group'!$B11,vldatabase,26,FALSE)","v":"BBB+"},{"$f":"VLOOKUP(D16,'Ordinal Ratings'!A$8:C$30,2,FALSE)","v":8},null,{"$f":"VLOOKUP('Utility Group'!$B11,vldatabase,27,FALSE)","v":"Baa2"},{"$f":"VLOOKUP(G16,'Ordinal Ratings'!I$9:K$28,2,FALSE)","v":9},null,{"$f":"VLOOKUP('Utility Group'!$B11,vldatabase,22,FALSE)","v":2},null,{"$f":"VLOOKUP('Utility Group'!$B11,vldatabase,24,FALSE)","v":"A"},{"$f":"VLOOKUP(L16,'Ordinal Ratings'!E$8:F$18,2,FALSE)","v":3},null,{"$f":"VLOOKUP('Utility Group'!$B11,vldatabase,23,FALSE)","v":0.9},null,{"$f":"VLOOKUP('Utility Group'!$B11,vldatabase,28,FALSE)","v":23000}]
[10,{"$f":"VLOOKUP('Utility Group'!$B12,vldatabase,2,FALSE)","v":"Edison International"},null,{"$f":"VLOOKUP('Utility Group'!$B12,vldatabase,26,FALSE)","v":"BBB"},{"$f":"VLOOKUP(D17,'Ordinal Ratings'!A$8:C$30,2,FALSE)","v":9},null,{"$f":"VLOOKUP('Utility Group'!$B12,vldatabase,27,FALSE)","v":"Baa3"},{"$f":"VLOOKUP(G17,'Ordinal Ratings'!I$9:K$28,2,FALSE)","v":10},null,{"$f":"VLOOKUP('Utility Group'!$B12,vldatabase,22,FALSE)","v":3},null,{"$f":"VLOOKUP('Utility Group'!$B12,vldatabase,24,FALSE)","v":"B+"},{"$f":"VLOOKUP(L17,'Ordinal Ratings'!E$8:F$18,2,FALSE)","v":5},null,{"$f":"VLOOKUP('Utility Group'!$B12,vldatabase,23,FALSE)","v":0.9},null,{"$f":"VLOOKUP('Utility Group'!$B12,vldatabase,28,FALSE)","v":20000}]
[11,{"$f":"VLOOKUP('Utility Group'!$B13,vldatabase,2,FALSE)","v":"Emera Inc."},null,{"$f":"VLOOKUP('Utility Group'!$B13,vldatabase,26,FALSE)","v":"BBB"},{"$f":"VLOOKUP(D18,'Ordinal Ratings'!A$8:C$30,2,FALSE)","v":9},null,{"$f":"VLOOKUP('Utility Group'!$B13,vldatabase,27,FALSE)","v":"Baa3"},{"$f":"VLOOKUP(G18,'Ordinal Ratings'!I$9:K$28,2,FALSE)","v":10},null,{"$f":"VLOOKUP('Utility Group'!$B13,vldatabase,22,FALSE)","v":2},null,{"$f":"VLOOKUP('Utility Group'!$B13,vldatabase,24,FALSE)","v":"B+"},{"$f":"VLOOKUP(L18,'Ordinal Ratings'!E$8:F$18,2,FALSE)","v":5},null,{"$f":"VLOOKUP('Utility Group'!$B13,vldatabase,23,FALSE)","v":0.75},null,{"$f":"VLOOKUP('Utility Group'!$B13,vldatabase,28,FALSE)","v":13100}]
[12,{"$f":"VLOOKUP('Utility Group'!$B14,vldatabase,2,FALSE)","v":"Entergy Corp."},null,{"$f":"VLOOKUP('Utility Group'!$B14,vldatabase,26,FALSE)","v":"BBB+"},{"$f":"VLOOKUP(D19,'Ordinal Ratings'!A$8:C$30,2,FALSE)","v":8},null,{"$f":"VLOOKUP('Utility Group'!$B14,vldatabase,27,FALSE)","v":"Baa2"},{"$f":"VLOOKUP(G19,'Ordinal Ratings'!I$9:K$28,2,FALSE)","v":9},null,{"$f":"VLOOKUP('Utility Group'!$B14,vldatabase,22,FALSE)","v":2},null,{"$f":"VLOOKUP('Utility Group'!$B14,vldatabase,24,FALSE)","v":"B++"},{"$f":"VLOOKUP(L19,'Ordinal Ratings'!E$8:F$18,2,FALSE)","v":4},null,{"$f":"VLOOKUP('Utility Group'!$B14,vldatabase,23,FALSE)","v":0.95},null,{"$f":"VLOOKUP('Utility Group'!$B14,vldatabase,28,FALSE)","v":20000}]
[13,{"$f":"VLOOKUP('Utility Group'!$B15,vldatabase,2,FALSE)","v":"Exelon Corp."},null,{"$f":"VLOOKUP('Utility Group'!$B15,vldatabase,26,FALSE)","v":"BBB+"},{"$f":"VLOOKUP(D20,'Ordinal Ratings'!A$8:C$30,2,FALSE)","v":8},null,{"$f":"VLOOKUP('Utility Group'!$B15,vldatabase,27,FALSE)","v":"Baa2"},{"$f":"VLOOKUP(G20,'Ordinal Ratings'!I$9:K$28,2,FALSE)","v":9},null,{"$f":"VLOOKUP('Utility Group'!$B15,vldatabase,22,FALSE)","v":3},null,{"$f":"VLOOKUP('Utility Group'!$B15,vldatabase,24,FALSE)","v":"B+"},{"$f":"VLOOKUP(L20,'Ordinal Ratings'!E$8:F$18,2,FALSE)","v":5},null,{"$f":"VLOOKUP('Utility Group'!$B15,vldatabase,23,FALSE)","v":0.95},null,{"$f":"VLOOKUP('Utility Group'!$B15,vldatabase,28,FALSE)","v":37000}]
[14,{"$f":"VLOOKUP('Utility Group'!$B16,vldatabase,2,FALSE)","v":"FirstEnergy Corp."},null,{"$f":"VLOOKUP('Utility Group'!$B16,vldatabase,26,FALSE)","v":"BBB"},{"$f":"VLOOKUP(D21,'Ordinal Ratings'!A$8:C$30,2,FALSE)","v":9},null,{"$f":"VLOOKUP('Utility Group'!$B16,vldatabase,27,FALSE)","v":"Baa3"},{"$f":"VLOOKUP(G21,'Ordinal Ratings'!I$9:K$28,2,FALSE)","v":10},null,{"$f":"VLOOKUP('Utility Group'!$B16,vldatabase,22,FALSE)","v":3},null,{"$f":"VLOOKUP('Utility Group'!$B16,vldatabase,24,FALSE)","v":"B+"},{"$f":"VLOOKUP(L21,'Ordinal Ratings'!E$8:F$18,2,FALSE)","v":5},null,{"$f":"VLOOKUP('Utility Group'!$B16,vldatabase,23,FALSE)","v":0.85},null,{"$f":"VLOOKUP('Utility Group'!$B16,vldatabase,28,FALSE)","v":16000}]
[15,{"$f":"VLOOKUP('Utility Group'!$B17,vldatabase,2,FALSE)","v":"Hawaiian Elec."},null,{"$f":"VLOOKUP('Utility Group'!$B17,vldatabase,26,FALSE)","v":"BBB-"},{"$f":"VLOOKUP(D22,'Ordinal Ratings'!A$8:C$30,2,FALSE)","v":10},null,{"$f":"VLOOKUP('Utility Group'!$B17,vldatabase,27,FALSE)","v":"Baa2"},{"$f":"VLOOKUP(G22,'Ordinal Ratings'!I$9:K$28,2,FALSE)","v":9},null,{"$f":"VLOOKUP('Utility Group'!$B17,vldatabase,22,FALSE)","v":2},null,{"$f":"VLOOKUP('Utility Group'!$B17,vldatabase,24,FALSE)","v":"A"},{"$f":"VLOOKUP(L22,'Ordinal Ratings'!E$8:F$18,2,FALSE)","v":3},null,{"$f":"VLOOKUP('Utility Group'!$B17,vldatabase,23,FALSE)","v":0.8},null,{"$f":"VLOOKUP('Utility Group'!$B17,vldatabase,28,FALSE)","v":4000}]
[16,{"$f":"VLOOKUP('Utility Group'!$B18,vldatabase,2,FALSE)","v":"IDACORP, Inc."},null,{"$f":"VLOOKUP('Utility Group'!$B18,vldatabase,26,FALSE)","v":"BBB"},{"$f":"VLOOKUP(D23,'Ordinal Ratings'!A$8:C$30,2,FALSE)","v":9},null,{"$f":"VLOOKUP('Utility Group'!$B18,vldatabase,27,FALSE)","v":"Baa1"},{"$f":"VLOOKUP(G23,'Ordinal Ratings'!I$9:K$28,2,FALSE)","v":8},null,{"$f":"VLOOKUP('Utility Group'!$B18,vldatabase,22,FALSE)","v":2},null,{"$f":"VLOOKUP('Utility Group'!$B18,vldatabase,24,FALSE)","v":"A"},{"$f":"VLOOKUP(L23,'Ordinal Ratings'!E$8:F$18,2,FALSE)","v":3},null,{"$f":"VLOOKUP('Utility Group'!$B18,vldatabase,23,FALSE)","v":0.8},null,{"$f":"VLOOKUP('Utility Group'!$B18,vldatabase,28,FALSE)","v":4600}]
[17,{"$f":"VLOOKUP('Utility Group'!$B19,vldatabase,2,FALSE)","v":"NorthWestern Corp."},null,{"$f":"VLOOKUP('Utility Group'!$B19,vldatabase,26,FALSE)","v":"BBB"},{"$f":"VLOOKUP(D24,'Ordinal Ratings'!A$8:C$30,2,FALSE)","v":9},null,{"$f":"VLOOKUP('Utility Group'!$B19,vldatabase,27,FALSE)","v":"Baa2"},{"$f":"VLOOKUP(G24,'Ordinal Ratings'!I$9:K$28,2,FALSE)","v":9},null,{"$f":"VLOOKUP('Utility Group'!$B19,vldatabase,22,FALSE)","v":2},null,{"$f":"VLOOKUP('Utility Group'!$B19,vldatabase,24,FALSE)","v":"B++"},{"$f":"VLOOKUP(L24,'Ordinal Ratings'!E$8:F$18,2,FALSE)","v":4},null,{"$f":"VLOOKUP('Utility Group'!$B19,vldatabase,23,FALSE)","v":0.9},null,{"$f":"VLOOKUP('Utility Group'!$B19,vldatabase,28,FALSE)","v":2700}]
[18,{"$f":"VLOOKUP('Utility Group'!$B20,vldatabase,2,FALSE)","v":"OGE Energy Corp."},null,{"$f":"VLOOKUP('Utility Group'!$B20,vldatabase,26,FALSE)","v":"BBB+"},{"$f":"VLOOKUP(D25,'Ordinal Ratings'!A$8:C$30,2,FALSE)","v":8},null,{"$f":"VLOOKUP('Utility Group'!$B20,vldatabase,27,FALSE)","v":"Baa1"},{"$f":"VLOOKUP(G25,'Ordinal Ratings'!I$9:K$28,2,FALSE)","v":8},null,{"$f":"VLOOKUP('Utility Group'!$B20,vldatabase,22,FALSE)","v":2},null,{"$f":"VLOOKUP('Utility Group'!$B20,vldatabase,24,FALSE)","v":"A"},{"$f":"VLOOKUP(L25,'Ordinal Ratings'!E$8:F$18,2,FALSE)","v":3},null,{"$f":"VLOOKUP('Utility Group'!$B20,vldatabase,23,FALSE)","v":1.05},null,{"$f":"VLOOKUP('Utility Group'!$B20,vldatabase,28,FALSE)","v":6400}]
[19,{"$f":"VLOOKUP('Utility Group'!$B21,vldatabase,2,FALSE)","v":"Otter Tail Corp."},null,{"$f":"VLOOKUP('Utility Group'!$B21,vldatabase,26,FALSE)","v":"BBB"},{"$f":"VLOOKUP(D26,'Ordinal Ratings'!A$8:C$30,2,FALSE)","v":9},null,{"$f":"VLOOKUP('Utility Group'!$B21,vldatabase,27,FALSE)","v":"Baa2"},{"$f":"VLOOKUP(G26,'Ordinal Ratings'!I$9:K$28,2,FALSE)","v":9},null,{"$f":"VLOOKUP('Utility Group'!$B21,vldatabase,22,FALSE)","v":2},null,{"$f":"VLOOKUP('Utility Group'!$B21,vldatabase,24,FALSE)","v":"A"},{"$f":"VLOOKUP(L26,'Ordinal Ratings'!E$8:F$18,2,FALSE)","v":3},null,{"$f":"VLOOKUP('Utility Group'!$B21,vldatabase,23,FALSE)","v":0.85},null,{"$f":"VLOOKUP('Utility Group'!$B21,vldatabase,28,FALSE)","v":1600}]
[20,{"$f":"VLOOKUP('Utility Group'!$B22,vldatabase,2,FALSE)","v":"PNM Resources"},null,{"$f":"VLOOKUP('Utility Group'!$B22,vldatabase,26,FALSE)","v":"BBB"},{"$f":"VLOOKUP(D27,'Ordinal Ratings'!A$8:C$30,2,FALSE)","v":9},null,{"$f":"VLOOKUP('Utility Group'!$B22,vldatabase,27,FALSE)","v":"Baa3"},{"$f":"VLOOKUP(G27,'Ordinal Ratings'!I$9:K$28,2,FALSE)","v":10},null,{"$f":"VLOOKUP('Utility Group'!$B22,vldatabase,22,FALSE)","v":3},null,{"$f":"VLOOKUP('Utility Group'!$B22,vldatabase,24,FALSE)","v":"B+"},{"$f":"VLOOKUP(L27,'Ordinal Ratings'!E$8:F$18,2,FALSE)","v":5},null,{"$f":"VLOOKUP('Utility Group'!$B22,vldatabase,23,FALSE)","v":0.95},null,{"$f":"VLOOKUP('Utility Group'!$B22,vldatabase,28,FALSE)","v":3100}]
[21,{"$f":"VLOOKUP('Utility Group'!$B23,vldatabase,2,FALSE)","v":"Sempra Energy"},null,{"$f":"VLOOKUP('Utility Group'!$B23,vldatabase,26,FALSE)","v":"BBB+"},{"$f":"VLOOKUP(D28,'Ordinal Ratings'!A$8:C$30,2,FALSE)","v":8},null,{"$f":"VLOOKUP('Utility Group'!$B23,vldatabase,27,FALSE)","v":"Baa2"},{"$f":"VLOOKUP(G28,'Ordinal Ratings'!I$9:K$28,2,FALSE)","v":9},null,{"$f":"VLOOKUP('Utility Group'!$B23,vldatabase,22,FALSE)","v":2},null,{"$f":"VLOOKUP('Utility Group'!$B23,vldatabase,24,FALSE)","v":"A"},{"$f":"VLOOKUP(L28,'Ordinal Ratings'!E$8:F$18,2,FALSE)","v":3},null,{"$f":"VLOOKUP('Utility Group'!$B23,vldatabase,23,FALSE)","v":0.95},null,{"$f":"VLOOKUP('Utility Group'!$B23,vldatabase,28,FALSE)","v":35000}]
[]
[null,"Average",null,{"$f":"VLOOKUP(E30,'Ordinal Ratings'!$B$8:$C$28,2,FALSE)","v":"BBB"},{"$f":"ROUND(AVERAGE(E8:E28),0)","v":9},null,{"$f":"VLOOKUP(H30,'Ordinal Ratings'!$J$8:$K$28,2,FALSE)","v":"Baa2"},{"$f":"ROUND(AVERAGE(H8:H28),0)","v":9},null,{"$f":"AVERAGE(J8:J28)","v":2.25},null,{"$f":"VLOOKUP(M30,'Ordinal Ratings'!$F$8:$G$17,2,FALSE)","v":"B++"},{"$f":"ROUND(AVERAGE(M8:M28),0)","v":4},null,{"$f":"AVERAGE(O8:O28)","v":0.89047619047619042},null,{"$f":"AVERAGE(Q8:Q28)","v":12742.587643904761}]
[]
[]
["(a)",{"$f":"'Electric Utility Data'!B51","v":"Issuer credit rating from www.standardandpoors.com (retrieved Oct. 5, 2020)."}]
["(b)",{"$f":"'Electric Utility Data'!B52","v":"Long-term rating from www.moodys.com (retrieved Oct. 5, 2020)."}]
["(c)",{"$f":"'Utility Group Criteria'!B50","v":"The Value Line Investment Survey (Jul. 24, Aug. 14 and Sep. 11, 2020)."}]
["(d)",{"$f":"'Electric Utility Data'!B53","v":"www.finance.yahoo.com (retreived Oct. 5, 2020)."}]
["RISK MEASURES"]
[]
["NON-UTILITY GROUP"]
[null,null,null,"(a)",null,null,"(b)",null,null,"(c)",null,null,null,null,null,null,"(c)"]
[null,null,null,null,null,null,null,null,null,"Value Line"]
[null,null,null,"Credit Ratings",null,null,null,null,null,"Safety",null,"Financial",null,null,null,null,"Market"]
[null,"Company",null,"S&P",null,null,"Moody's",null,null,"Rank",null,"Strength",null,null,"Beta",null,"Cap"]
[1,"Air Products & Chem.",null,"A",{"$f":"VLOOKUP(D44,'Ordinal Ratings'!A$8:B$30,2,FALSE)","v":6},null,"A2",{"$f":"VLOOKUP(G44,'Ordinal Ratings'!I$8:J$26,2,FALSE)","v":6},null,1,null,"A++",{"$f":"VLOOKUP(L44,'Ordinal Ratings'!E$8:F$17,2,FALSE)","v":1},null,0.95,null,64200,null,null,"APD"]
[{"$f":"A44+1","v":2},"Amdocs Ltd.",null,"BBB",{"$f":"VLOOKUP(D45,'Ordinal Ratings'!A$8:B$30,2,FALSE)","v":9},null,"Baa2",{"$f":"VLOOKUP(G45,'Ordinal Ratings'!I$8:J$26,2,FALSE)","v":9},null,1,null,"A",{"$f":"VLOOKUP(L45,'Ordinal Ratings'!E$8:F$17,2,FALSE)","v":3},null,0.95,null,8200,null,null,"DOX"]
[3,"Amgen",null,"A-",{"$f":"VLOOKUP(D46,'Ordinal Ratings'!A$8:B$30,2,FALSE)","v":7},null,"Baa1",{"$f":"VLOOKUP(G46,'Ordinal Ratings'!I$8:J$26,2,FALSE)","v":8},null,1,null,"A++",{"$f":"VLOOKUP(L46,'Ordinal Ratings'!E$8:F$17,2,FALSE)","v":1},null,0.85,null,145900,null,null,"AMGN"]
[4,"Amphenol Corp.",null,"BBB+",{"$f":"VLOOKUP(D47,'Ordinal Ratings'!A$8:B$30,2,FALSE)","v":8},null,"Baa1",{"$f":"VLOOKUP(G47,'Ordinal Ratings'!I$8:J$26,2,FALSE)","v":8},null,1,null,"A",{"$f":"VLOOKUP(L47,'Ordinal Ratings'!E$8:F$17,2,FALSE)","v":3},null,0.95,null,31600,null,null,"APH"]
[5,"Apple Inc.",null,"AA+",{"$f":"VLOOKUP(D48,'Ordinal Ratings'!A$8:B$30,2,FALSE)","v":2},null,"Aa1",{"$f":"VLOOKUP(G48,'Ordinal Ratings'!I$8:J$26,2,FALSE)","v":2},null,1,null,"A++",{"$f":"VLOOKUP(L48,'Ordinal Ratings'!E$8:F$17,2,FALSE)","v":1},null,0.95,null,1643800,null,null,"AAPL"]
[6,"AT&T Inc.",null,"BBB",{"$f":"VLOOKUP(D49,'Ordinal Ratings'!A$8:B$30,2,FALSE)","v":9},null,"Baa2",{"$f":"VLOOKUP(G49,'Ordinal Ratings'!I$8:J$26,2,FALSE)","v":9},null,1,null,"A++",{"$f":"VLOOKUP(L49,'Ordinal Ratings'!E$8:F$17,2,FALSE)","v":1},null,0.8,null,210600,null,null,"T"]
[7,"Baxter Int'l Inc.",null,"A-",{"$f":"VLOOKUP(D50,'Ordinal Ratings'!A$8:B$30,2,FALSE)","v":7},null,"Baa1",{"$f":"VLOOKUP(G50,'Ordinal Ratings'!I$8:J$26,2,FALSE)","v":8},null,1,null,"A+",{"$f":"VLOOKUP(L50,'Ordinal Ratings'!E$8:F$17,2,FALSE)","v":2},null,0.8,null,42100,null,null,"BAX"]
[8,"Bristol-Myers Squibb",null,"A+",{"$f":"VLOOKUP(D51,'Ordinal Ratings'!A$8:B$30,2,FALSE)","v":5},null,"A2",{"$f":"VLOOKUP(G51,'Ordinal Ratings'!I$8:J$26,2,FALSE)","v":6},null,1,null,"A++",{"$f":"VLOOKUP(L51,'Ordinal Ratings'!E$8:F$17,2,FALSE)","v":1},null,0.85,null,133800,null,null,"BMY"]
[9,"Brown & Brown",null,"BBB-",{"$f":"VLOOKUP(D52,'Ordinal Ratings'!A$8:B$30,2,FALSE)","v":10},null,"Baa3",{"$f":"VLOOKUP(G52,'Ordinal Ratings'!I$8:J$26,2,FALSE)","v":10},null,1,null,"A",{"$f":"VLOOKUP(L52,'Ordinal Ratings'!E$8:F$17,2,FALSE)","v":3},null,0.95,null,12900,null,null,"BRO"]
[10,"Brown-Forman 'B'",null,"A-",{"$f":"VLOOKUP(D53,'Ordinal Ratings'!A$8:B$30,2,FALSE)","v":7},null,"A1",{"$f":"VLOOKUP(G53,'Ordinal Ratings'!I$8:J$26,2,FALSE)","v":5},null,1,null,"A",{"$f":"VLOOKUP(L53,'Ordinal Ratings'!E$8:F$17,2,FALSE)","v":3},null,0.9,null,33100,null,null,"BF/B"]
[11,"Church & Dwight",null,"BBB+",{"$f":"VLOOKUP(D54,'Ordinal Ratings'!A$8:B$30,2,FALSE)","v":8},null,"A3",{"$f":"VLOOKUP(G54,'Ordinal Ratings'!I$8:J$26,2,FALSE)","v":7},null,1,null,"A+",{"$f":"VLOOKUP(L54,'Ordinal Ratings'!E$8:F$17,2,FALSE)","v":2},null,0.65,null,21900,null,null,"CHD"]
[12,"Cisco Systems",null,"AA-",{"$f":"VLOOKUP(D55,'Ordinal Ratings'!A$8:B$30,2,FALSE)","v":4},null,"A1",{"$f":"VLOOKUP(G55,'Ordinal Ratings'!I$8:J$26,2,FALSE)","v":5},null,1,null,"A++",{"$f":"VLOOKUP(L55,'Ordinal Ratings'!E$8:F$17,2,FALSE)","v":1},null,0.95,null,197100,null,null,"CSCO"]
[13,"Coca-Cola",null,"A+",{"$f":"VLOOKUP(D56,'Ordinal Ratings'!A$8:B$30,2,FALSE)","v":5},null,"A1",{"$f":"VLOOKUP(G56,'Ordinal Ratings'!I$8:J$26,2,FALSE)","v":5},null,1,null,"A++",{"$f":"VLOOKUP(L56,'Ordinal Ratings'!E$8:F$17,2,FALSE)","v":1},null,0.9,null,206200,null,null,"KO"]
[14,"Colgate-Palmolive",null,"AA-",{"$f":"VLOOKUP(D57,'Ordinal Ratings'!A$8:B$30,2,FALSE)","v":4},null,"Aa3",{"$f":"VLOOKUP(G57,'Ordinal Ratings'!I$8:J$26,2,FALSE)","v":4},null,1,null,"A+",{"$f":"VLOOKUP(L57,'Ordinal Ratings'!E$8:F$17,2,FALSE)","v":2},null,0.75,null,65300,null,null,"CL"]
[15,"Comcast Corp.",null,"A-",{"$f":"VLOOKUP(D58,'Ordinal Ratings'!A$8:B$30,2,FALSE)","v":7},null,"A3",{"$f":"VLOOKUP(G58,'Ordinal Ratings'!I$8:J$26,2,FALSE)","v":7},null,1,null,"A+",{"$f":"VLOOKUP(L58,'Ordinal Ratings'!E$8:F$17,2,FALSE)","v":2},null,0.75,null,199900,null,null,"CMCSA"]
[16,"Commerce Bancshs.",null,"A-",{"$f":"VLOOKUP(D59,'Ordinal Ratings'!A$8:B$30,2,FALSE)","v":7},null,"Baa1",{"$f":"VLOOKUP(G59,'Ordinal Ratings'!I$8:J$26,2,FALSE)","v":8},null,1,null,"A",{"$f":"VLOOKUP(L59,'Ordinal Ratings'!E$8:F$17,2,FALSE)","v":3},null,0.9,null,6500,null,null,"CBSH"]
[17,"Costco Wholesale",null,"A+",{"$f":"VLOOKUP(D60,'Ordinal Ratings'!A$8:B$30,2,FALSE)","v":5},null,"Aa3",{"$f":"VLOOKUP(G60,'Ordinal Ratings'!I$8:J$26,2,FALSE)","v":4},null,1,null,"A++",{"$f":"VLOOKUP(L60,'Ordinal Ratings'!E$8:F$17,2,FALSE)","v":1},null,0.65,null,144000,null,null,"COST"]
[18,"CVS Health",null,"BBB",{"$f":"VLOOKUP(D61,'Ordinal Ratings'!A$8:B$30,2,FALSE)","v":9},null,"Baa2",{"$f":"VLOOKUP(G61,'Ordinal Ratings'!I$8:J$26,2,FALSE)","v":9},null,1,null,"A++",{"$f":"VLOOKUP(L61,'Ordinal Ratings'!E$8:F$17,2,FALSE)","v":1},null,0.9,null,83800,null,null,"CVS"]
[19,"Danaher Corp.",null,"BBB+",{"$f":"VLOOKUP(D62,'Ordinal Ratings'!A$8:B$30,2,FALSE)","v":8},null,"Baa1",{"$f":"VLOOKUP(G62,'Ordinal Ratings'!I$8:J$26,2,FALSE)","v":8},null,1,null,"A+",{"$f":"VLOOKUP(L62,'Ordinal Ratings'!E$8:F$17,2,FALSE)","v":2},null,0.85,null,140900,null,null,"DHR"]
[20,"Gen'l Mills",null,"BBB",{"$f":"VLOOKUP(D63,'Ordinal Ratings'!A$8:B$30,2,FALSE)","v":9},null,"Baa2",{"$f":"VLOOKUP(G63,'Ordinal Ratings'!I$8:J$26,2,FALSE)","v":9},null,1,null,"A+",{"$f":"VLOOKUP(L63,'Ordinal Ratings'!E$8:F$17,2,FALSE)","v":2},null,0.7,null,39300,null,null,"GIS"]
[21,"Hormel Foods",null,"A",{"$f":"VLOOKUP(D64,'Ordinal Ratings'!A$8:B$30,2,FALSE)","v":6},null,"A1",{"$f":"VLOOKUP(G64,'Ordinal Ratings'!I$8:J$26,2,FALSE)","v":5},null,1,null,"A+",{"$f":"VLOOKUP(L64,'Ordinal Ratings'!E$8:F$17,2,FALSE)","v":2},null,0.55000000000000004,null,27400,null,null,"HRL"]
[22,"Intel Corp.",null,"A+",{"$f":"VLOOKUP(D65,'Ordinal Ratings'!A$8:B$30,2,FALSE)","v":5},null,"A1",{"$f":"VLOOKUP(G65,'Ordinal Ratings'!I$8:J$26,2,FALSE)","v":5},null,1,null,"A++",{"$f":"VLOOKUP(L65,'Ordinal Ratings'!E$8:F$17,2,FALSE)","v":1},null,0.9,null,204400,null,null,"INTC"]
[23,"Int'l Flavors & Frag.",null,"BBB",{"$f":"VLOOKUP(D66,'Ordinal Ratings'!A$8:B$30,2,FALSE)","v":9},null,"Baa3",{"$f":"VLOOKUP(G66,'Ordinal Ratings'!I$8:J$26,2,FALSE)","v":10},null,1,null,"A+",{"$f":"VLOOKUP(L66,'Ordinal Ratings'!E$8:F$17,2,FALSE)","v":2},null,0.9,null,13700,null,null,"IFF"]
[24,"Johnson & Johnson",null,"AAA",{"$f":"VLOOKUP(D67,'Ordinal Ratings'!A$8:B$30,2,FALSE)","v":1},null,"Aaa",{"$f":"VLOOKUP(G67,'Ordinal Ratings'!I$8:J$26,2,FALSE)","v":1},null,1,null,"A++",{"$f":"VLOOKUP(L67,'Ordinal Ratings'!E$8:F$17,2,FALSE)","v":1},null,0.85,null,388000,null,null,"JNJ"]
[25,"Kellogg",null,"BBB",{"$f":"VLOOKUP(D68,'Ordinal Ratings'!A$8:B$30,2,FALSE)","v":9},null,"Baa2",{"$f":"VLOOKUP(G68,'Ordinal Ratings'!I$8:J$26,2,FALSE)","v":9},null,1,null,"A+",{"$f":"VLOOKUP(L68,'Ordinal Ratings'!E$8:F$17,2,FALSE)","v":2},null,0.65,null,24300,null,null,"K"]
[26,"Kimberly-Clark",null,"A",{"$f":"VLOOKUP(D69,'Ordinal Ratings'!A$8:B$30,2,FALSE)","v":6},null,"A2",{"$f":"VLOOKUP(G69,'Ordinal Ratings'!I$8:J$26,2,FALSE)","v":6},null,1,null,"A+",{"$f":"VLOOKUP(L69,'Ordinal Ratings'!E$8:F$17,2,FALSE)","v":2},null,0.8,null,51800,null,null,"KMB"]
[27,"Lilly (Eli)",null,"A+",{"$f":"VLOOKUP(D70,'Ordinal Ratings'!A$8:B$30,2,FALSE)","v":5},null,"A2",{"$f":"VLOOKUP(G70,'Ordinal Ratings'!I$8:J$26,2,FALSE)","v":6},null,1,null,"A++",{"$f":"VLOOKUP(L70,'Ordinal Ratings'!E$8:F$17,2,FALSE)","v":1},null,0.75,null,154800,null,null,"LLY"]
[28,"Lockheed Martin",null,"A-",{"$f":"VLOOKUP(D71,'Ordinal Ratings'!A$8:B$30,2,FALSE)","v":7},null,"A3",{"$f":"VLOOKUP(G71,'Ordinal Ratings'!I$8:J$26,2,FALSE)","v":7},null,1,null,"A++",{"$f":"VLOOKUP(L71,'Ordinal Ratings'!E$8:F$17,2,FALSE)","v":1},null,0.95,null,108300,null,null,"LMT"]
[29,"Marsh & McLennan",null,"A-",{"$f":"VLOOKUP(D72,'Ordinal Ratings'!A$8:B$30,2,FALSE)","v":7},null,"Baa1",{"$f":"VLOOKUP(G72,'Ordinal Ratings'!I$8:J$26,2,FALSE)","v":8},null,1,null,"A",{"$f":"VLOOKUP(L72,'Ordinal Ratings'!E$8:F$17,2,FALSE)","v":3},null,0.95,null,58000,null,null,"MMC"]
[30,"McCormick & Co.",null,"BBB",{"$f":"VLOOKUP(D73,'Ordinal Ratings'!A$8:B$30,2,FALSE)","v":9},null,"Baa2",{"$f":"VLOOKUP(G73,'Ordinal Ratings'!I$8:J$26,2,FALSE)","v":9},null,1,null,"A+",{"$f":"VLOOKUP(L73,'Ordinal Ratings'!E$8:F$17,2,FALSE)","v":2},null,0.85,null,25900,null,null,"MKC"]
[31,"McDonald's Corp.",null,"BBB+",{"$f":"VLOOKUP(D74,'Ordinal Ratings'!A$8:B$30,2,FALSE)","v":8},null,"Baa1",{"$f":"VLOOKUP(G74,'Ordinal Ratings'!I$8:J$26,2,FALSE)","v":8},null,1,null,"A++",{"$f":"VLOOKUP(L74,'Ordinal Ratings'!E$8:F$17,2,FALSE)","v":1},null,0.95,null,152000,null,null,"MCD"]
[32,"Merck & Co.",null,"AA-",{"$f":"VLOOKUP(D75,'Ordinal Ratings'!A$8:B$30,2,FALSE)","v":4},null,"A1",{"$f":"VLOOKUP(G75,'Ordinal Ratings'!I$8:J$26,2,FALSE)","v":5},null,1,null,"A++",{"$f":"VLOOKUP(L75,'Ordinal Ratings'!E$8:F$17,2,FALSE)","v":1},null,0.85,null,200300,null,null,"MRK"]
[33,"Microsoft Corp.",null,"AAA",{"$f":"VLOOKUP(D76,'Ordinal Ratings'!A$8:B$30,2,FALSE)","v":1},null,"Aaa",{"$f":"VLOOKUP(G76,'Ordinal Ratings'!I$8:J$26,2,FALSE)","v":1},null,1,null,"A++",{"$f":"VLOOKUP(L76,'Ordinal Ratings'!E$8:F$17,2,FALSE)","v":1},null,0.95,null,1543000,null,null,"MSFT"]
[34,"Northrop Grumman",null,"BBB",{"$f":"VLOOKUP(D77,'Ordinal Ratings'!A$8:B$30,2,FALSE)","v":9},null,"Baa1",{"$f":"VLOOKUP(G77,'Ordinal Ratings'!I$8:J$26,2,FALSE)","v":8},null,1,null,"A++",{"$f":"VLOOKUP(L77,'Ordinal Ratings'!E$8:F$17,2,FALSE)","v":1},null,0.85,null,52600,null,null,"NOC"]
[35,"Oracle Corp.",null,"A",{"$f":"VLOOKUP(D78,'Ordinal Ratings'!A$8:B$30,2,FALSE)","v":6},null,"A3",{"$f":"VLOOKUP(G78,'Ordinal Ratings'!I$8:J$26,2,FALSE)","v":7},null,1,null,"A++",{"$f":"VLOOKUP(L78,'Ordinal Ratings'!E$8:F$17,2,FALSE)","v":1},null,0.85,null,170000,null,null,"ORCL"]
[36,"PepsiCo, Inc.",null,"A+",{"$f":"VLOOKUP(D79,'Ordinal Ratings'!A$8:B$30,2,FALSE)","v":5},null,"A1",{"$f":"VLOOKUP(G79,'Ordinal Ratings'!I$8:J$26,2,FALSE)","v":5},null,1,null,"A++",{"$f":"VLOOKUP(L79,'Ordinal Ratings'!E$8:F$17,2,FALSE)","v":1},null,0.85,null,191000,null,null,"PEP"]
[37,"Pfizer, Inc.",null,"AA-",{"$f":"VLOOKUP(D80,'Ordinal Ratings'!A$8:B$30,2,FALSE)","v":4},null,"A1",{"$f":"VLOOKUP(G80,'Ordinal Ratings'!I$8:J$26,2,FALSE)","v":5},null,1,null,"A++",{"$f":"VLOOKUP(L80,'Ordinal Ratings'!E$8:F$17,2,FALSE)","v":1},null,0.85,null,218000,null,null,"PFE"]
[38,"Procter & Gamble",null,"AA-",{"$f":"VLOOKUP(D81,'Ordinal Ratings'!A$8:B$30,2,FALSE)","v":4},null,"Aa3",{"$f":"VLOOKUP(G81,'Ordinal Ratings'!I$8:J$26,2,FALSE)","v":4},null,1,null,"A++",{"$f":"VLOOKUP(L81,'Ordinal Ratings'!E$8:F$17,2,FALSE)","v":1},null,0.75,null,317600,null,null,"PG"]
[39,"Public Storage",null,"A",{"$f":"VLOOKUP(D82,'Ordinal Ratings'!A$8:B$30,2,FALSE)","v":6},null,"A2",{"$f":"VLOOKUP(G82,'Ordinal Ratings'!I$8:J$26,2,FALSE)","v":6},null,1,null,"A+",{"$f":"VLOOKUP(L82,'Ordinal Ratings'!E$8:F$17,2,FALSE)","v":2},null,0.85,null,34300,46176.47,null,"PSA"]
[40,"Texas Instruments",null,"A+",{"$f":"VLOOKUP(D83,'Ordinal Ratings'!A$8:B$30,2,FALSE)","v":5},null,"A1",{"$f":"VLOOKUP(G83,'Ordinal Ratings'!I$8:J$26,2,FALSE)","v":5},null,1,null,"A++",{"$f":"VLOOKUP(L83,'Ordinal Ratings'!E$8:F$17,2,FALSE)","v":1},null,0.85,null,120500,null,null,"TXN"]
[41,"Travelers Cos.",null,"A",{"$f":"VLOOKUP(D84,'Ordinal Ratings'!A$8:B$30,2,FALSE)","v":6},null,"A2",{"$f":"VLOOKUP(G84,'Ordinal Ratings'!I$8:J$26,2,FALSE)","v":6},null,1,null,"A++",{"$f":"VLOOKUP(L84,'Ordinal Ratings'!E$8:F$17,2,FALSE)","v":1},null,0.95,null,29500,140074.20000000001,null,"TRV"]
[42,"United Parcel Serv.",null,"A-",{"$f":"VLOOKUP(D85,'Ordinal Ratings'!A$8:B$30,2,FALSE)","v":7},null,"A2",{"$f":"VLOOKUP(G85,'Ordinal Ratings'!I$8:J$26,2,FALSE)","v":6},null,1,null,"A+",{"$f":"VLOOKUP(L85,'Ordinal Ratings'!E$8:F$17,2,FALSE)","v":2},null,0.8,null,138000,null,null,"UPS"]
[43,"Verizon Communic.",null,"BBB+",{"$f":"VLOOKUP(D86,'Ordinal Ratings'!A$8:B$30,2,FALSE)","v":8},null,"Baa1",{"$f":"VLOOKUP(G86,'Ordinal Ratings'!I$8:J$26,2,FALSE)","v":8},null,1,null,"A++",{"$f":"VLOOKUP(L86,'Ordinal Ratings'!E$8:F$17,2,FALSE)","v":1},null,0.65,null,237700,null,null,"VZ"]
[44,"Walmart Inc.",null,"AA",{"$f":"VLOOKUP(D87,'Ordinal Ratings'!A$8:B$30,2,FALSE)","v":3},null,"Aa2",{"$f":"VLOOKUP(G87,'Ordinal Ratings'!I$8:J$26,2,FALSE)","v":3},null,1,null,"A++",{"$f":"VLOOKUP(L87,'Ordinal Ratings'!E$8:F$17,2,FALSE)","v":1},null,0.6,null,370100,null,null,"WMT"]
[45,"Waste Management",null,"A-",{"$f":"VLOOKUP(D88,'Ordinal Ratings'!A$8:B$30,2,FALSE)","v":7},null,"Baa1",{"$f":"VLOOKUP(G88,'Ordinal Ratings'!I$8:J$26,2,FALSE)","v":8},null,1,null,"A",{"$f":"VLOOKUP(L88,'Ordinal Ratings'!E$8:F$17,2,FALSE)","v":3},null,0.8,null,47200,null,null,"WM"]
[]
[null,"Average ",null,{"$f":"VLOOKUP(E90,'Ordinal Ratings'!$B$8:$C$28,2,FALSE)","v":"A"},{"$f":"ROUND(AVERAGE(E44:E88),0)","v":6},null,{"$f":"VLOOKUP(H90,'Ordinal Ratings'!$J$8:$K$28,2,FALSE)","v":"A2"},{"$f":"ROUND(AVERAGE(H44:H88),0)","v":6},null,{"$f":"AVERAGE(J44:J88)","v":1},null,{"$f":"VLOOKUP(M90,'Ordinal Ratings'!$F$8:$G$17,2,FALSE)","v":"A+"},{"$f":"ROUND(AVERAGE(M44:M88),0)","v":2},null,{"$f":"AVERAGE(O44:O88)","v":0.83333333333333337},null,{"$f":"AVERAGE(Q44:Q88)","v":184655.55555555556}]
[]
[]
["(a)","www.standardandpoors.com (retrieved Aug 21, 2020)."]
["(b)","www.moodys.com (retrieved Aug. 21, 2020)."]
["(c)","The Value Line Investment Survey (various editions as of Aug. 21, 2020)."]

{"sheet":"Table 1 - Fig. 1","index":3,"n_rows":56,"n_cols":8,"rows_kept":56,"cut":false,"hidden":false,"merged":[[3,2,3,3],[3,4,3,6],[42,3,42,5],[43,3,43,5],[50,3,50,5]]}
[]
[]
[]
[null,null,"                        From Exh. AMM-4",null,"Graph Data"]
[null,{"$f":"B4+1","v":1},{"$f":"'4'!F7","v":9.2585422316775898E-2},null,1,8.8209834331551079E-2,null,9.9000000000000005E-2]
[null,{"$f":"B5+1","v":2},{"$f":"'4'!F8","v":9.4327778486256772E-2},null,{"$f":"E5+1","v":2},8.8322204542593749E-2,null,9.9000000000000005E-2]
[null,3,{"$f":"'4'!F9","v":9.3010426170854602E-2},null,{"$f":"E6+1","v":3},9.2585422316775898E-2,null,9.9000000000000005E-2]
[null,4,{"$f":"'4'!F10","v":8.8209834331551079E-2},null,4,9.2728900000000003E-2,null,9.9000000000000005E-2]
[null,5,{"$f":"'4'!H7","v":0.10434357565963015},null,5,9.3010426170854602E-2,null,9.9000000000000005E-2]
[null,6,{"$f":"'4'!H8","v":9.7795290783031522E-2},null,6,9.4327778486256772E-2,null,9.9000000000000005E-2]
[null,7,{"$f":"'4'!H9","v":0.10076282280866747},null,7,9.7795290783031522E-2,null,9.9000000000000005E-2]
[null,8,{"$f":"'4'!H10","v":8.8322204542593749E-2},null,8,0.10076282280866747,null,9.9000000000000005E-2]
[null,9,{"$f":"'4'!F12","v":0.1117619047619048},null,9,0.1009507,null,9.9000000000000005E-2]
[null,10,{"$f":"'4'!H12","v":0.11550000000000001},null,10,0.10309099308601725,null,9.9000000000000005E-2]
[null,11,{"$f":"'4'!F14","v":0.11433333333333333},null,11,0.10434357565963015,null,9.9000000000000005E-2]
[null,12,{"$f":"'4'!H14","v":0.11749999999999999},null,12,0.1085757188547383,null,9.9000000000000005E-2]
[null,13,{"$f":"'4'!G17","v":9.2728900000000003E-2},null,13,0.1117619047619048,null,9.9000000000000005E-2]
[null,14,{"$f":"'4'!G18","v":0.1009507},null,14,0.11433333333333333,null,9.9000000000000005E-2]
[null,15,{"$f":"'4'!F20","v":0.10309099308601725},null,15,0.11550000000000001,null,9.9000000000000005E-2]
[null,16,{"$f":"'4'!H20","v":0.1085757188547383},null,16,0.11749999999999999,null,9.9000000000000005E-2]
[]
[]
[]
[]
[]
[]
[]
[]
[]
[]
[]
["DCF",null,null,"Average",null,"Midpoint"]
[null,"Value Line",null,{"$f":"'4'!F7","v":9.2585422316775898E-2},3,{"$f":"'4'!H7","v":0.10434357565963015},11]
[null,"IBES",null,{"$f":"'4'!F8","v":9.4327778486256772E-2},6,{"$f":"'4'!H8","v":9.7795290783031522E-2},7]
[null,"Zacks",null,{"$f":"'4'!F9","v":9.3010426170854602E-2},5,{"$f":"'4'!H9","v":0.10076282280866747},8]
[null,"Internal br + sv",null,{"$f":"'4'!F10","v":8.8209834331551079E-2},1,{"$f":"'4'!H10","v":8.8322204542593749E-2},2]
[null,"Internal br + sv"]
["CAPM",null,null,{"$f":"'4'!F12","v":0.1117619047619048},13,{"$f":"'4'!H12","v":0.11550000000000001},15]
[null,"Projected Bond Yield",null,null,28]
["Empirical CAPM",null,null,{"$f":"'4'!F14","v":0.11433333333333333},14,{"$f":"'4'!H14","v":0.11749999999999999},16]
[null,"Projected Bond Yield",null,0.1116209375,35,0.11196374999999999,36]
["Utility Risk Premium"]
[null,"Current Bond Yields",null,"9.3% 4"]
[null,"Projected Bond Yields",null,"10.1% 9"]
[]
["Expected Earnings",null,null,{"$f":"'4'!F20","v":0.10309099308601725},10,{"$f":"'4'!H20","v":0.1085757188547383},12]
[]
["Cost of Equity Recommendation"]
[null,"Cost of Equity Range",null,{"$f":"'4'!F24","v":9.2999999999999999E-2},"--",{"$f":"'4'!H24","v":0.107}]
[]
["Flotation Cost Adjustment",null,null,{"$f":"'4'!G29","v":1.1567143159060575E-3}]
[]
["Recommended ROE Range",null,null,{"$f":"D49+D51","v":9.4156714315906054E-2},"--",{"$f":"F49+D51","v":0.10815671431590605}]
[]
[]
["Note: Footnotes correspond to rank order in the subsequent figure."]

{"sheet":"Tables 2 4","index":4,"n_rows":17,"n_cols":7,"rows_kept":17,"cut":false,"hidden":false,"merged":[[4,1,4,2],[11,4,11,6],[12,1,12,2],[3,4,3,6]]}
[]
[]
[]
[null,null,null,null,"Value Line"]
[null,"Credit Rating",null,null,"Safety","Financial"]
[null,"S&P","Moody's",null,"Rank","Strength","Beta"]
["Utility Group",{"$f":"'Proxy Group Risk Measures'!D30","v":"BBB"},{"$f":"'Proxy Group Risk Measures'!G30","v":"Baa2"},null,{"$f":"'Proxy Group Risk Measures'!J30","v":2.25},{"$f":"'Proxy Group Risk Measures'!L30","v":"B++"},{"$f":"'Proxy Group Risk Measures'!O30","v":0.89047619047619042}]
["Avista",{"$f":"'Proxy Group Risk Measures'!D$12","v":"BBB"},{"$f":"'Proxy Group Risk Measures'!G$12","v":"Baa2"},null,{"$f":"'Proxy Group Risk Measures'!J$12","v":2},{"$f":"'Proxy Group Risk Measures'!L$12","v":"B++"},{"$f":"'Proxy Group Risk Measures'!O$12","v":0.9}]
[]
[]
[]
[null,null,null,null,"Value Line"]
[null,"Credit Rating",null,null,"Safety","Financial"]
[null,"S&P","Moody's",null,"Rank","Strength","Beta"]
["Non-Utility Group",{"$f":"'Proxy Group Risk Measures'!D90","v":"A"},{"$f":"'Proxy Group Risk Measures'!G90","v":"A2"},null,{"$f":"'Proxy Group Risk Measures'!J90","v":1},{"$f":"'Proxy Group Risk Measures'!L90","v":"A+"},{"$f":"'Proxy Group Risk Measures'!O90","v":0.83333333333333337}]
["Utility Group",{"$f":"B7","v":"BBB"},{"$f":"C7","v":"Baa2"},null,{"$f":"E7","v":2.25},{"$f":"F7","v":"B++"},{"$f":"G7","v":0.89047619047619042}]
["Avista",{"$f":"'Proxy Group Risk Measures'!D$11","v":"BBB+"},{"$f":"'Proxy Group Risk Measures'!G$11","v":"Baa1"},null,{"$f":"'Proxy Group Risk Measures'!J$11","v":2},{"$f":"'Proxy Group Risk Measures'!L$11","v":"B++"},{"$f":"'Proxy Group Risk Measures'!O$12","v":0.9}]

{"sheet":"Fig. 2","index":5,"n_rows":42,"n_cols":5,"rows_kept":42,"cut":false,"hidden":false,"merged":[]}
[]
[]
[]
[]
[null,null,"OTTR",{"$f":"E5/1000","v":1.6},1600]
[null,null,"AVA",2.4,2400]
[null,null,"MGEE",2.4,2400]
[null,null,"NWE",2.7,2700]
[null,null,"ALE",2.8,2800]
[null,null,"PNM",3.1,3100]
[null,null,"BKH",3.8,3800]
[null,null,"POR",3.8,3800]
[null,null,"HE",4,4000]
[null,null,"IDA",4.5999999999999996,4600]
[null,null,"OGE",6.4,6400]
[null,null,"PNW",8.9,8900]
[null,null,"AQN",9.0943405219999995,9094.3405220000004]
[null,null,"CNP",11,11000]
[null,null,"EVRG",12,12000]
[null,null,"EMA",13.1,13100]
[null,null,"LNT",13.5,13500]
[null,null,"AGR",15,15000]
[null,null,"FE",16,16000]
[null,null,"CMS",17,17000]
[null,null,"AEE",20,20000]
[null,null,"EIX",20,20000]
[null,null,"ETR",20,20000]
[null,null,"PPL",20,20000]
[null,null,"DTE",23,23000]
[null,null,"FTS",24,24000]
[null,null,"ED",25,25000]
[null,null,"PEG",28,28000]
[null,null,"ES",30,30000]
[null,null,"WEC",30,30000]
[null,null,"XEL",34,34000]
[null,null,"SRE",35,35000]
[null,null,"EXC",37,37000]
[null,null,"AEP",39,39000]
[null,null,"SO",57,57000]
[null,null,"DUK",62,62000]
[null,null,"D",67,67000]
[null,null,"NEE",136,136000]

{"sheet":"Fig. 3","index":6,"n_rows":689,"n_cols":9,"rows_kept":689,"cut":false,"hidden":false,"merged":[]}
["Date","Total Assets"]
["2007-08-01",870261,{"$f":"B2/1000","v":870.26099999999997}]
["2007-08-08",865453,{"$f":"B3/1000","v":865.45299999999997}]
["2007-08-15",864931,864.93100000000004]
["2007-08-22",862775,862.77499999999998]
["2007-08-29",872873,872.87300000000005]
["2007-09-05",871156,871.15599999999995]
["2007-09-12",886314,886.31399999999996]
["2007-09-19",867732,867.73199999999997]
["2007-09-26",889900,889.9]
["2007-10-03",869051,869.05100000000004]
["2007-10-10",886363,886.36300000000006]
["2007-10-17",869509,869.50900000000001]
["2007-10-24",881395,881.39499999999998]
["2007-10-31",883385,883.38499999999999]
["2007-11-07",885724,885.72400000000005]
["2007-11-14",889537,889.53700000000003]
["2007-11-21",891028,891.02800000000002]
["2007-11-28",879417,879.41700000000003]
["2007-12-05",882764,882.76400000000001]
["2007-12-12",881750,881.75]
["2007-12-19",887983,887.98299999999995]
["2007-12-26",890662,890.66200000000003]
["2008-01-02",922187,922.18700000000001]
["2008-01-09",880754,880.75400000000002,null,null,null,null,null,"https://fred.stlouisfed.org/series/WALCL"]
["2008-01-16",893581,893.58100000000002]
["2008-01-23",877253,877.25300000000004]
["2008-01-30",900264,900.26400000000001]
["2008-02-06",871022,871.02200000000005]
["2008-02-13",883005,883.005]
["2008-02-20",878949,878.94899999999996]
["2008-02-27",893825,893.82500000000005]
["2008-03-05",881208,881.20799999999997]
["2008-03-12",896565,896.56500000000005]
["2008-03-19",888646,888.64599999999996]
["2008-03-26",893965,893.96500000000003]
["2008-04-02",883708,883.70799999999997]
["2008-04-09",893029,893.029]
["2008-04-16",881904,881.904]
["2008-04-23",885781,885.78099999999995]
["2008-04-30",888131,888.13099999999997]
["2008-05-07",889228,889.22799999999995]
["2008-05-14",880175,880.17499999999995]
["2008-05-21",898487,898.48699999999997]
["2008-05-28",904054,904.05399999999997]
["2008-06-04",895939,895.93899999999996]
["2008-06-11",890610,890.61]
["2008-06-18",902304,902.30399999999997]
["2008-06-25",892713,892.71299999999997]
["2008-07-02",902962,902.96199999999999]
["2008-07-09",898034,898.03399999999999]
["2008-07-16",910681,910.68100000000004]
["2008-07-23",899665,899.66499999999996]
["2008-07-30",918625,918.625]
["2008-08-06",901710,901.71]
["2008-08-13",914632,914.63199999999995]
["2008-08-20",898611,898.61099999999999]
["2008-08-27",909982,909.98199999999997]
["2008-09-03",905253,905.25300000000004]
["2008-09-10",925725,925.72500000000002]
["2008-09-17",995093,995.09299999999996]
["2008-09-24",1211825,1211.825]
["2008-10-01",1503989,1503.989]
["2008-10-08",1591587,1591.587]
["2008-10-15",1770809,1770.809]
["2008-10-22",1802602,1802.6020000000001]
["2008-10-29",1969086,{"$f":"B67/1000","v":1969.086}]
["2008-11-05",2074205,2074.2049999999999]
["2008-11-12",2212852,2212.8519999999999]
["2008-11-19",2187137,2187.1370000000002]
["2008-11-26",2106117,2106.1170000000002]
["2008-12-03",2136924,2136.924]
["2008-12-10",2250012,2250.0120000000002]
["2008-12-17",2254983,2254.9830000000002]
["2008-12-24",2232311,2232.3110000000001]
["2008-12-31",2239457,2239.4569999999999]
["2009-01-07",2121439,2121.4389999999999]
["2009-01-14",2049714,2049.7139999999999]
["2009-01-21",2037112,2037.1120000000001]
["2009-01-28",1927082,1927.0820000000001]
["2009-02-04",1851437,1851.4369999999999]
["2009-02-11",1843400,1843.4]
["2009-02-18",1915562,1915.5619999999999]
["2009-02-25",1916115,1916.115]
["2009-03-04",1901317,1901.317]
["2009-03-11",1899514,1899.5139999999999]
["2009-03-18",2066942,2066.942]
["2009-03-25",2071556,2071.556]
["2009-04-01",2078936,2078.9360000000001]
["2009-04-08",2088573,2088.5729999999999]
["2009-04-15",2186498,2186.498]
["2009-04-22",2196812,2196.8119999999999]
["2009-04-29",2066712,2066.712]
["2009-05-06",2079758,2079.7579999999998]
["2009-05-13",2196351,2196.3510000000001]
["2009-05-20",2181632,2181.6320000000001]
["2009-05-27",2080115,2080.1149999999998]
["2009-06-03",2077695,2077.6950000000002]
["2009-06-10",2052297,2052.297]
["2009-06-17",2072527,2072.527]
["2009-06-24",2025571,2025.5709999999999]
["2009-07-01",2005627,2005.627]
["2009-07-08",1992740,1992.74]
["2009-07-15",2072451,2072.451]
["2009-07-22",2039001,2039.001]
["2009-07-29",2000547,2000.547]
["2009-08-05",1989203,1989.203]
["2009-08-12",2014899,2014.8989999999999]
["2009-08-19",2060641,2060.6410000000001]
["2009-08-26",2074902,2074.902]
["2009-09-02",2083720,2083.7199999999998]
["2009-09-09",2087946,2087.9459999999999]
["2009-09-16",2139783,2139.7829999999999]
["2009-09-23",2158631,2158.6309999999999]
["2009-09-30",2141020,2141.02]
["2009-10-07",2138086,2138.0859999999998]
["2009-10-14",2192787,2192.7869999999998]
["2009-10-21",2201119,2201.1190000000001]
["2009-10-28",2161537,2161.5369999999998]
["2009-11-04",2165067,2165.067]
["2009-11-11",2135035,2135.0349999999999]
["2009-11-18",2208721,2208.721]
["2009-11-25",2206359,2206.3589999999999]
["2009-12-02",2204074,2204.0740000000001]
["2009-12-09",2186383,2186.3829999999998]
["2009-12-16",2235763,2235.7629999999999]
["2009-12-23",2235803,2235.8029999999999]
["2009-12-30",2234067,2234.067]
["2010-01-06",2235304,2235.3040000000001]
["2010-01-13",2291700,2291.6999999999998]
["2010-01-20",2251806,{"$f":"B131/1000","v":2251.806}]
["2010-01-27",2246886,2246.886]
["2010-02-03",2249319,2249.319]
["2010-02-10",2256679,2256.6790000000001]
["2010-02-17",2277574,2277.5740000000001]
["2010-02-24",2286127,2286.127]
["2010-03-03",2280147,2280.1469999999999]
["2010-03-10",2282474,2282.4740000000002]
["2010-03-17",2307997,2307.9969999999998]
["2010-03-24",2313149,2313.1489999999999]
["2010-03-31",2307150,2307.15]
["2010-04-07",2307575,2307.5749999999998]
["2010-04-14",2339345,2339.3449999999998]
["2010-04-21",2337556,2337.556]
["2010-04-28",2330472,2330.4720000000002]
["2010-05-05",2326164,2326.1640000000002]
["2010-05-12",2336103,2336.1030000000001]
["2010-05-19",2350890,2350.89]
["2010-05-26",2334041,2334.0410000000002]
["2010-06-02",2336216,2336.2159999999999]
["2010-06-09",2331529,2331.529]
["2010-06-16",2344316,2344.3159999999998]
["2010-06-23",2344497,2344.4969999999998]
["2010-06-30",2330851,2330.8510000000001]
["2010-07-07",2332017,2332.0169999999998]
["2010-07-14",2340717,2340.7170000000001]
["2010-07-21",2332322,2332.3220000000001]
["2010-07-28",2325298,2325.2979999999998]
["2010-08-04",2326479,2326.4789999999998]
["2010-08-11",2327533,2327.5329999999999]
["2010-08-18",2313662,2313.6619999999998]
["2010-08-25",2301015,2301.0149999999999]
["2010-09-01",2301996,2301.9960000000001]
["2010-09-08",2305802,2305.8020000000001]
["2010-09-15",2296079,2296.0790000000002]
["2010-09-22",2307171,2307.1709999999998]
["2010-09-29",2298691,2298.6909999999998]
["2010-10-06",2308092,2308.0920000000001]
["2010-10-13",2309885,2309.8850000000002]
["2010-10-20",2305227,2305.2269999999999]
["2010-10-27",2295392,2295.3919999999998]
["2010-11-03",2300353,2300.3530000000001]
["2010-11-10",2312768,2312.768]
["2010-11-17",2314757,2314.7570000000001]
["2010-11-24",2346001,2346.0010000000002]
["2010-12-01",2346920,2346.92]
["2010-12-08",2382294,2382.2939999999999]
["2010-12-15",2385754,2385.7539999999999]
["2010-12-22",2427921,2427.9209999999998]
["2010-12-29",2420570,2420.5700000000002]
["2011-01-05",2436064,2436.0639999999999]
["2011-01-12",2468131,2468.1309999999999]
["2011-01-19",2425164,2425.1640000000002]
["2011-01-26",2443527,2443.527]
["2011-02-02",2469419,2469.4189999999999]
["2011-02-09",2500481,2500.4810000000002]
["2011-02-16",2508868,2508.8679999999999]
["2011-02-23",2533221,2533.221]
["2011-03-02",2545119,2545.1190000000001]
["2011-03-09",2577076,2577.076]
["2011-03-16",2583046,2583.0459999999998]
["2011-03-23",2601341,2601.3409999999999]
["2011-03-30",2622523,2622.5230000000001]
["2011-04-06",2648676,2648.6759999999999]
["2011-04-13",2665408,{"$f":"B195/1000","v":2665.4079999999999}]
["2011-04-20",2685782,2685.7820000000002]
["2011-04-27",2690985,2690.9850000000001]
["2011-05-04",2718757,2718.7570000000001]
["2011-05-11",2744498,2744.498]
["2011-05-18",2758009,2758.009]
["2011-05-25",2774996,2774.9960000000001]
["2011-06-01",2788723,2788.723]
["2011-06-08",2811206,2811.2060000000001]
["2011-06-15",2827549,2827.549]
["2011-06-22",2856403,2856.4029999999998]
["2011-06-29",2865251,2865.2510000000002]
["2011-07-06",2870103,2870.1030000000001]
["2011-07-13",2878074,2878.0740000000001]
["2011-07-20",2871301,2871.3009999999999]
["2011-07-27",2863576,2863.576]
["2011-08-03",2867215,2867.2150000000001]
["2011-08-10",2872423,2872.4229999999998]
["2011-08-17",2857906,2857.9059999999999]
["2011-08-24",2859433,2859.433]
["2011-08-31",2853888,2853.8879999999999]
["2011-09-07",2858660,2858.66]
["2011-09-14",2863540,2863.54]
["2011-09-21",2857747,2857.7469999999998]
["2011-09-28",2850921,2850.9209999999998]
["2011-10-05",2859701,2859.701]
["2011-10-12",2860822,2860.8220000000001]
["2011-10-19",2852390,2852.39]
["2011-10-26",2845685,2845.6849999999999]
["2011-11-02",2822034,2822.0340000000001]
["2011-11-09",2839786,2839.7860000000001]
["2011-11-16",2831576,2831.576]
["2011-11-23",2821980,2821.98]
["2011-11-30",2814235,2814.2350000000001]
["2011-12-07",2820691,2820.6909999999998]
["2011-12-14",2902488,2902.4879999999998]
["2011-12-21",2916085,2916.085]
["2011-12-28",2926095,2926.0949999999998]
["2012-01-04",2917689,2917.6889999999999]
["2012-01-11",2899149,2899.1489999999999]
["2012-01-18",2919423,2919.4229999999998]
["2012-01-25",2919545,2919.5450000000001]
["2012-02-01",2924947,2924.9470000000001]
["2012-02-08",2928275,2928.2750000000001]
["2012-02-15",2937893,2937.893]
["2012-02-22",2932813,2932.8130000000001]
["2012-02-29",2925722,2925.7220000000002]
["2012-03-07",2884747,2884.7469999999998]
["2012-03-14",2893560,2893.56]
["2012-03-21",2892646,2892.6460000000002]
["2012-03-28",2878137,2878.1370000000002]
["2012-04-04",2865478,2865.4780000000001]
["2012-04-11",2867200,2867.2]
["2012-04-18",2875470,2875.47]
["2012-04-25",2866561,2866.5610000000001]
["2012-05-02",2864280,2864.28]
["2012-05-09",2864150,2864.15]
["2012-05-16",2850984,2850.9839999999999]
["2012-05-23",2859495,2859.4949999999999]
["2012-05-30",2842654,2842.654]
["2012-06-06",2852018,2852.018]
["2012-06-13",2869071,2869.0709999999999]
["2012-06-20",2870846,2870.846]
["2012-06-27",2863547,2863.547]
["2012-07-04",2865858,{"$f":"B259/1000","v":2865.8580000000002}]
["2012-07-11",2866279,2866.279]
["2012-07-18",2855807,2855.8069999999998]
["2012-07-25",2846757,2846.7570000000001]
["2012-08-01",2851118,2851.1179999999999]
["2012-08-08",2856181,2856.181]
["2012-08-15",2833317,2833.317]
["2012-08-22",2825661,2825.6610000000001]
["2012-08-29",2812806,2812.806]
["2012-09-05",2822169,2822.1689999999999]
["2012-09-12",2823448,2823.4479999999999]
["2012-09-19",2821574,2821.5740000000001]
["2012-09-26",2804457,2804.4569999999999]
["2012-10-03",2808512,2808.5120000000002]
["2012-10-10",2811623,2811.623]
["2012-10-17",2846920,2846.92]
["2012-10-24",2840964,2840.9639999999999]
["2012-10-31",2823137,2823.1370000000002]
["2012-11-07",2830791,2830.7910000000002]
["2012-11-14",2877244,2877.2440000000001]
["2012-11-21",2871161,2871.1610000000001]
["2012-11-28",2851362,2851.3620000000001]
["2012-12-05",2859807,2859.8069999999998]
["2012-12-12",2917260,2917.26]
["2012-12-19",2920231,2920.2310000000002]
["2012-12-26",2907300,2907.3]
["2013-01-02",2917189,2917.1889999999999]
["2013-01-09",2928728,2928.7280000000001]
["2013-01-16",2963812,2963.8119999999999]
["2013-01-23",3011697,3011.6970000000001]
["2013-01-30",3008704,3008.7040000000002]
["2013-02-06",3014975,3014.9749999999999]
["2013-02-13",3074225,3074.2249999999999]
["2013-02-20",3095150,3095.15]
["2013-02-27",3090600,3090.6]
["2013-03-06",3108805,3108.8049999999998]
["2013-03-13",3165396,3165.3960000000002]
["2013-03-20",3206888,3206.8879999999999]
["2013-03-27",3202256,3202.2559999999999]
["2013-04-03",3215432,3215.4319999999998]
["2013-04-10",3227762,3227.7620000000002]
["2013-04-17",3295109,3295.1089999999999]
["2013-04-24",3318649,3318.6489999999999]
["2013-05-01",3317194,3317.194]
["2013-05-08",3324615,3324.6149999999998]
["2013-05-15",3354269,3354.2689999999998]
["2013-05-22",3398713,3398.7130000000002]
["2013-05-29",3385128,3385.1280000000002]
["2013-06-05",3400183,3400.183]
["2013-06-12",3410842,3410.8420000000001]
["2013-06-19",3470530,3470.53]
["2013-06-26",3478672,3478.672]
["2013-07-03",3492742,3492.7420000000002]
["2013-07-10",3504095,3504.0949999999998]
["2013-07-17",3537861,3537.8609999999999]
["2013-07-24",3574574,3574.5740000000001]
["2013-07-31",3571797,3571.797]
["2013-08-07",3585359,3585.3589999999999]
["2013-08-14",3646323,3646.3229999999999]
["2013-08-21",3645668,3645.6680000000001]
["2013-08-28",3644456,3644.4560000000001]
["2013-09-04",3654182,3654.1819999999998]
["2013-09-11",3662035,3662.0349999999999]
["2013-09-18",3722192,3722.192]
["2013-09-25",3734018,{"$f":"B323/1000","v":3734.018}]
["2013-10-02",3747387,3747.3870000000002]
["2013-10-09",3758663,3758.663]
["2013-10-16",3813599,3813.5990000000002]
["2013-10-23",3839033,3839.0329999999999]
["2013-10-30",3843396,3843.3960000000002]
["2013-11-06",3851623,3851.623]
["2013-11-13",3907424,3907.424]
["2013-11-20",3906620,3906.62]
["2013-11-27",3925876,3925.8760000000002]
["2013-12-04",3932626,3932.6260000000002]
["2013-12-11",3993955,3993.9549999999999]
["2013-12-18",4008062,4008.0619999999999]
["2013-12-25",4032575,4032.5749999999998]
["2014-01-01",4023640,4023.64]
["2014-01-08",4028185,4028.1849999999999]
["2014-01-15",4071528,4071.5279999999998]
["2014-01-22",4097914,4097.9139999999998]
["2014-01-29",4102138,4102.1379999999999]
["2014-02-05",4109285,4109.2849999999999]
["2014-02-12",4119474,4119.4740000000002]
["2014-02-19",4149224,4149.2240000000002]
["2014-02-26",4159972,4159.9719999999998]
["2014-03-05",4171762,4171.7619999999997]
["2014-03-12",4181361,4181.3609999999999]
["2014-03-19",4222081,4222.0810000000001]
["2014-03-26",4226971,4226.9709999999995]
["2014-04-02",4236441,4236.4409999999998]
["2014-04-09",4244188,4244.1880000000001]
["2014-04-16",4283967,4283.9669999999996]
["2014-04-23",4296339,4296.3389999999999]
["2014-04-30",4296049,4296.049]
["2014-05-07",4303143,4303.143]
["2014-05-14",4336649,4336.6490000000003]
["2014-05-21",4327560,4327.5600000000004]
["2014-05-28",4322654,4322.6540000000005]
["2014-06-04",4330917,4330.9170000000004]
["2014-06-11",4340904,4340.9040000000005]
["2014-06-18",4368168,4368.1679999999997]
["2014-06-25",4368348,4368.348]
["2014-07-02",4377031,4377.0309999999999]
["2014-07-09",4383401,4383.4009999999998]
["2014-07-16",4398201,4398.201]
["2014-07-23",4410746,4410.7460000000001]
["2014-07-30",4406637,4406.6369999999997]
["2014-08-06",4410111,4410.1109999999999]
["2014-08-13",4431923,4431.9229999999998]
["2014-08-20",4412924,4412.924]
["2014-08-27",4413736,4413.7359999999999]
["2014-09-03",4415587,4415.5870000000004]
["2014-09-10",4421408,4421.4080000000004]
["2014-09-17",4449588,4449.5879999999997]
["2014-09-24",4459050,4459.05]
["2014-10-01",4450260,4450.26]
["2014-10-08",4455403,4455.4030000000002]
["2014-10-15",4474360,4474.3599999999997]
["2014-10-22",4481616,4481.616]
["2014-10-29",4486754,4486.7539999999999]
["2014-11-05",4486585,4486.585]
["2014-11-12",4488895,4488.8950000000004]
["2014-11-19",4492759,4492.759]
["2014-11-26",4485931,4485.9309999999996]
["2014-12-03",4486190,4486.1899999999996]
["2014-12-10",4488865,4488.8649999999998]
["2014-12-17",4502247,{"$f":"B387/1000","v":4502.2470000000003}]
["2014-12-24",4509462,4509.4620000000004]
["2014-12-31",4497660,4497.66]
["2015-01-07",4499524,4499.5240000000003]
["2015-01-14",4516077,4516.0770000000002]
["2015-01-21",4512936,4512.9359999999997]
["2015-01-28",4500064,4500.0640000000003]
["2015-02-04",4500348,4500.348]
["2015-02-11",4501685,4501.6850000000004]
["2015-02-18",4496851,4496.8509999999997]
["2015-02-25",4486725,4486.7250000000004]
["2015-03-04",4487583,4487.5829999999996]
["2015-03-11",4489279,4489.2790000000005]
["2015-03-18",4495888,4495.8879999999999]
["2015-03-25",4480603,4480.6030000000001]
["2015-04-01",4481799,4481.799]
["2015-04-08",4483419,4483.4189999999999]
["2015-04-15",4485366,4485.366]
["2015-04-22",4489695,4489.6949999999997]
["2015-04-29",4471499,4471.4989999999998]
["2015-05-06",4472703,4472.7030000000004]
["2015-05-13",4501188,4501.1880000000001]
["2015-05-20",4480384,4480.384]
["2015-05-27",4463981,4463.9809999999998]
["2015-06-03",4465360,4465.3599999999997]
["2015-06-10",4468005,4468.0050000000001]
["2015-06-17",4487817,4487.817]
["2015-06-24",4495055,4495.0550000000003]
["2015-07-01",4479130,4479.13]
["2015-07-08",4481289,4481.2889999999998]
["2015-07-15",4493605,4493.6049999999996]
["2015-07-22",4500503,4500.5029999999997]
["2015-07-29",4485480,4485.4799999999996]
["2015-08-05",4486329,4486.3289999999997]
["2015-08-12",4489250,4489.25]
["2015-08-19",4487208,4487.2079999999996]
["2015-08-26",4475105,4475.1049999999996]
["2015-09-02",4475886,4475.8860000000004]
["2015-09-09",4478213,4478.2129999999997]
["2015-09-16",4487809,4487.8090000000002]
["2015-09-23",4497484,4497.4840000000004]
["2015-09-30",4484111,4484.1109999999999]
["2015-10-07",4486185,4486.1850000000004]
["2015-10-14",4504704,4504.7039999999997]
["2015-10-21",4501372,4501.3720000000003]
["2015-10-28",4489339,4489.3389999999999]
["2015-11-04",4489702,4489.7020000000002]
["2015-11-11",4492012,4492.0119999999997]
["2015-11-18",4486721,4486.7209999999995]
["2015-11-25",4477088,4477.0879999999997]
["2015-12-02",4478069,4478.0690000000004]
["2015-12-09",4480436,4480.4359999999997]
["2015-12-16",4489593,4489.5929999999998]
["2015-12-23",4496523,4496.5230000000001]
["2015-12-30",4486587,4486.5870000000004]
["2016-01-06",4486606,4486.6059999999998]
["2016-01-13",4501695,4501.6949999999997]
["2016-01-20",4488840,4488.84]
["2016-01-27",4482349,4482.3490000000002]
["2016-02-03",4483495,4483.4949999999999]
["2016-02-10",4486278,4486.2780000000002]
["2016-02-17",4483629,4483.6289999999999]
["2016-02-24",4489796,4489.7960000000003]
["2016-03-02",4478485,4478.4849999999997]
["2016-03-09",4481083,{"$f":"B451/1000","v":4481.0829999999996}]
["2016-03-16",4486333,4486.3329999999996]
["2016-03-23",4492857,4492.857]
["2016-03-30",4482840,4482.84]
["2016-04-06",4484069,4484.0690000000004]
["2016-04-13",4499729,4499.7290000000003]
["2016-04-20",4490131,4490.1310000000003]
["2016-04-27",4474665,4474.665]
["2016-05-04",4477270,4477.2700000000004]
["2016-05-11",4478411,4478.4110000000001]
["2016-05-18",4473741,4473.741]
["2016-05-25",4461111,4461.1109999999999]
["2016-06-01",4461393,4461.393]
["2016-06-08",4463542,4463.5420000000004]
["2016-06-15",4472817,4472.817]
["2016-06-22",4482009,4482.009]
["2016-06-29",4466482,4466.482]
["2016-07-06",4470605,4470.6049999999996]
["2016-07-13",4472202,4472.2020000000002]
["2016-07-20",4480973,4480.973]
["2016-07-27",4464498,4464.4979999999996]
["2016-08-03",4466793,4466.7929999999997]
["2016-08-10",4468929,4468.9290000000001]
["2016-08-17",4466476,4466.4759999999997]
["2016-08-24",4473840,4473.84]
["2016-08-31",4457907,4457.9070000000002]
["2016-09-07",4459394,4459.3940000000002]
["2016-09-14",4481635,4481.6350000000002]
["2016-09-21",4473032,4473.0320000000002]
["2016-09-28",4452002,4452.0020000000004]
["2016-10-05",4459407,4459.4070000000002]
["2016-10-12",4457698,4457.6980000000003]
["2016-10-19",4467382,4467.3819999999996]
["2016-10-26",4454326,4454.326]
["2016-11-02",4453087,4453.0870000000004]
["2016-11-09",4455087,4455.0870000000004]
["2016-11-16",4453633,4453.6329999999998]
["2016-11-23",4465782,4465.7820000000002]
["2016-11-30",4446307,4446.3069999999998]
["2016-12-07",4448618,4448.6180000000004]
["2016-12-14",4470973,4470.973]
["2016-12-21",4469089,4469.0889999999999]
["2016-12-28",4451451,4451.451]
["2017-01-04",4453101,4453.1009999999997]
["2017-01-11",4452509,4452.509]
["2017-01-18",4460758,4460.7579999999998]
["2017-01-25",4452838,4452.8379999999997]
["2017-02-01",4453881,4453.8810000000003]
["2017-02-08",4456236,4456.2359999999999]
["2017-02-15",4454676,4454.6760000000004]
["2017-02-22",4468702,4468.7020000000002]
["2017-03-01",4458018,4458.018]
["2017-03-08",4459840,4459.84]
["2017-03-15",4469577,4469.5770000000002]
["2017-03-22",4478236,4478.2359999999999]
["2017-03-29",4469618,4469.6180000000004]
["2017-04-05",4474634,4474.634]
["2017-04-12",4484492,4484.4920000000002]
["2017-04-19",4479270,4479.2700000000004]
["2017-04-26",4470142,4470.1419999999998]
["2017-05-03",4471246,4471.2460000000001]
["2017-05-10",4473459,4473.4589999999998]
["2017-05-17",4467108,4467.1080000000002]
["2017-05-24",4470852,4470.8519999999999]
["2017-05-31",4459914,{"$f":"B515/1000","v":4459.9139999999998}]
["2017-06-07",4462443,4462.4430000000002]
["2017-06-14",4476269,4476.2690000000002]
["2017-06-21",4474257,4474.2569999999996]
["2017-06-28",4463347,4463.3469999999998]
["2017-07-05",4467272,4467.2719999999999]
["2017-07-12",4466702,4466.7020000000002]
["2017-07-19",4476903,4476.9030000000002]
["2017-07-26",4465284,4465.2839999999997]
["2017-08-02",4466846,4466.8459999999995]
["2017-08-09",4469083,4469.0829999999996]
["2017-08-16",4462871,4462.8710000000001]
["2017-08-23",4463837,4463.8370000000004]
["2017-08-30",4452360,4452.3599999999997]
["2017-09-06",4453474,4453.4740000000002]
["2017-09-13",4471174,4471.174]
["2017-09-20",4458576,4458.576]
["2017-09-27",4455661,4455.6610000000001]
["2017-10-04",4460422,4460.4219999999996]
["2017-10-11",4459415,4459.415]
["2017-10-18",4469723,4469.723]
["2017-10-25",4461117,4461.1170000000002]
["2017-11-01",4455887,4455.8869999999997]
["2017-11-08",4458552,4458.5519999999997]
["2017-11-15",4448289,4448.2889999999998]
["2017-11-22",4450615,4450.6149999999998]
["2017-11-29",4438592,4438.5919999999996]
["2017-12-06",4437148,4437.1480000000001]
["2017-12-13",4452726,4452.7259999999997]
["2017-12-20",4447470,4447.47]
["2017-12-27",4448680,4448.68]
["2018-01-03",4443718,4443.7179999999998]
["2018-01-10",4446062,4446.0619999999999]
["2018-01-17",4439145,4439.1450000000004]
["2018-01-24",4441317,4441.317]
["2018-01-31",4419225,4419.2250000000004]
["2018-02-07",4420745,4420.7449999999999]
["2018-02-14",4434863,4434.8630000000003]
["2018-02-21",4411660,4411.66]
["2018-02-28",4393401,4393.4009999999998]
["2018-03-07",4396097,4396.0969999999998]
["2018-03-14",4407258,4407.2579999999998]
["2018-03-21",4401222,4401.2219999999998]
["2018-03-28",4392198,4392.1980000000003]
["2018-04-04",4386104,4386.1040000000003]
["2018-04-11",4383684,4383.6840000000002]
["2018-04-18",4385903,4385.9030000000002]
["2018-04-25",4372886,4372.8860000000004]
["2018-05-02",4356129,4356.1289999999999]
["2018-05-09",4358207,4358.2070000000003]
["2018-05-16",4337609,4337.6090000000004]
["2018-05-23",4337301,4337.3010000000004]
["2018-05-30",4327519,4327.5190000000002]
["2018-06-06",4319191,4319.1909999999998]
["2018-06-13",4324906,4324.9059999999999]
["2018-06-20",4315896,4315.8959999999997]
["2018-06-27",4305491,4305.491]
["2018-07-04",4289764,4289.7640000000001]
["2018-07-11",4291201,4291.201]
["2018-07-18",4291615,4291.6149999999998]
["2018-07-25",4277681,4277.6809999999996]
["2018-08-01",4255653,4255.6530000000002]
["2018-08-08",4258030,4258.03]
["2018-08-15",4228924,4228.924]
["2018-08-22",4228818,{"$f":"B579/1000","v":4228.8180000000002}]
["2018-08-29",4218914,4218.9139999999998]
["2018-09-05",4208496,4208.4960000000001]
["2018-09-12",4210812,4210.8119999999999]
["2018-09-19",4208059,4208.0590000000002]
["2018-09-26",4192909,4192.9089999999997]
["2018-10-03",4174704,4174.7039999999997]
["2018-10-10",4176906,4176.9059999999999]
["2018-10-17",4175446,4175.4459999999999]
["2018-10-24",4173070,4173.07]
["2018-10-31",4139731,4139.7309999999998]
["2018-11-07",4141936,4141.9359999999997]
["2018-11-14",4145892,4145.8919999999998]
["2018-11-21",4106198,4106.1980000000003]
["2018-11-28",4097170,4097.17]
["2018-12-05",4086044,4086.0439999999999]
["2018-12-12",4088314,4088.3139999999999]
["2018-12-19",4084274,4084.2739999999999]
["2018-12-26",4075636,4075.636]
["2019-01-02",4058378,4058.3780000000002]
["2019-01-09",4056563,4056.5630000000001]
["2019-01-16",4050044,4050.0439999999999]
["2019-01-23",4047052,4047.0520000000001]
["2019-01-30",4039678,4039.6779999999999]
["2019-02-06",4026350,4026.35]
["2019-02-13",4028431,4028.431]
["2019-02-20",3981420,3981.42]
["2019-02-27",3974590,3974.59]
["2019-03-06",3969134,3969.134]
["2019-03-13",3971559,3971.5590000000002]
["2019-03-20",3962748,3962.748]
["2019-03-27",3955617,3955.6170000000002]
["2019-04-03",3935509,3935.509]
["2019-04-10",3936784,3936.7840000000001]
["2019-04-17",3931827,3931.8270000000002]
["2019-04-24",3928273,3928.2730000000001]
["2019-05-01",3889691,3889.6909999999998]
["2019-05-08",3892216,3892.2159999999999]
["2019-05-15",3864749,3864.7489999999998]
["2019-05-22",3860435,3860.4349999999999]
["2019-05-29",3851444,3851.444]
["2019-06-05",3847645,3847.645]
["2019-06-12",3849955,3849.9549999999999]
["2019-06-19",3844016,3844.0160000000001]
["2019-06-26",3826817,3826.817]
["2019-07-03",3813198,3813.1979999999999]
["2019-07-10",3815038,3815.038]
["2019-07-17",3808110,3808.11]
["2019-07-24",3803436,3803.4360000000001]
["2019-07-31",3779102,3779.1019999999999]
["2019-08-07",3781543,3781.5430000000001]
["2019-08-14",3786018,3786.018]
["2019-08-21",3764866,3764.866]
["2019-08-28",3759946,3759.9459999999999]
["2019-09-04",3761508,3761.5079999999998]
["2019-09-11",3769673,3769.6729999999998]
["2019-09-18",3844695,3844.6950000000002]
["2019-09-25",3857715,3857.7150000000001]
["2019-10-02",3945831,3945.8310000000001]
["2019-10-09",3949955,3949.9549999999999]
["2019-10-16",3966471,3966.471]
["2019-10-23",3968700,3968.7]
["2019-10-30",4019823,4019.8229999999999]
["2019-11-06",4039443,4039.4430000000002]
["2019-11-13",4047882,{"$f":"B643/1000","v":4047.8820000000001}]
["2019-11-20",4030249,4030.2489999999998]
["2019-11-27",4052875,4052.875]
["2019-12-04",4065696,4065.6959999999999]
["2019-12-11",4095491,4095.491]
["2019-12-18",4137052,4137.0519999999997]
["2019-12-25",4165591,4165.5910000000003]
["2020-01-01",4173626,4173.6260000000002]
["2020-01-08",4149544,4149.5439999999999]
["2020-01-15",4175850,4175.8500000000004]
["2020-01-22",4145912,4145.9120000000003]
["2020-01-29",4151630,4151.63]
["2020-02-05",4166707,4166.7070000000003]
["2020-02-12",4182689,4182.6890000000003]
["2020-02-19",4171570,4171.57]
["2020-02-26",4158637,4158.6369999999997]
["2020-03-04",4241507,4241.5069999999996]
["2020-03-11",4311911,4311.9110000000001]
["2020-03-18",4668212,4668.2120000000004]
["2020-03-25",5254278,5254.2780000000002]
["2020-04-01",5811607,5811.607]
["2020-04-08",6083141,6083.1409999999996]
["2020-04-15",6367887,6367.8869999999997]
["2020-04-22",6573136,6573.1360000000004]
["2020-04-29",6655929,6655.9290000000001]
["2020-05-06",6721420,6721.42]
["2020-05-13",6934227,6934.2269999999999]
["2020-05-20",7037258,7037.2579999999998]
["2020-05-27",7097316,7097.3159999999998]
["2020-06-03",7165217,7165.2169999999996]
["2020-06-10",7168936,7168.9359999999997]
["2020-06-17",7094690,7094.69]
["2020-06-24",7082302,7082.3019999999997]
["2020-07-01",7009040,7009.04]
["2020-07-08",6920716,6920.7160000000003]
["2020-07-15",6958604,6958.6040000000003]
["2020-07-22",6964755,6964.7550000000001]
["2020-07-29",6949032,6949.0320000000002]
["2020-08-05",6945237,6945.2370000000001]
["2020-08-12",6957277,6957.277]
["2020-08-19",7010637,7010.6369999999997]
["2020-08-26",6990418,6990.4179999999997]
["2020-09-02",7017492,7017.4920000000002]
["2020-09-09",7010614,7010.6139999999996]
["2020-09-16",7064475,7064.4750000000004]
["2020-09-23",7093161,7093.1610000000001]
["2020-09-30",7056129,7056.1289999999999]

{"sheet":"Exhibit List","index":7,"n_rows":22,"n_cols":4,"rows_kept":22,"cut":false,"hidden":false,"merged":[]}
["Tab","Designation","Title I","Title II"]
[4,"Exh. AMM-4","ROE ANALYSIS","SUMMARY OF RESULTS"]
["5 (1)","Exh. AMM-5","CAPITAL STRUCTURE","UTILITY GROUP"]
["5 (2-3)","Exh. AMM-5","CAPITAL STRUCTURE","ELECTRIC GROUP OPERATING SUBSIDIARIES"]
["6 (1)","Exh. AMM-6","DCF MODEL - UTILITY GROUP","DIVIDEND YIELD"]
["6 (2)","Exh. AMM-6","DCF MODEL - UTILITY GROUP","GROWTH RATES"]
["6 (3)","Exh. AMM-6","DCF MODEL - UTILITY GROUP","DCF COST OF EQUITY ESTIMATES"]
["6 (4)","Exh. AMM-6","DCF MODEL - UTILITY GROUP","LOW-END THRESHOLD ADJUSTMENTS"]
[7,"Exh. AMM-7","DCF MODEL - UTILITY GROUP","BR+SV GROWTH RATE"]
[8,"Exh. AMM-8","CAPM","UTILITY GROUP"]
[9,"Exh. AMM-9","EMPIRICAL CAPM","UTILITY GROUP"]
["10 (1)","Exh. AMM-10","ELECTRIC UTILITY RISK PREMIUM","CURRENT BOND YIELD"]
["10 (2)","Exh. AMM-10","ELECTRIC UTILITY RISK PREMIUM","PROJECTED BOND YIELD"]
["10 (3)","Exh. AMM-10","ELECTRIC UTILITY RISK PREMIUM","AUTHORIZED RETURNS"]
["10 (4)","Exh. AMM-10","ELECTRIC UTILITY RISK PREMIUM","REGRESSION RESULTS"]
[11,"Exh. AMM-11","EXPECTED EARNINGS APPROACH","UTILITY GROUP"]
["12 (1)","Exh. AMM-12","DCF MODEL - NON-UTILITY GROUP","DIVIDEND YIELD"]
["12 (2)","Exh. AMM-12","DCF MODEL - NON-UTILITY GROUP","GROWTH RATES"]
["12 (3)","Exh. AMM-12","DCF MODEL - NON-UTILITY GROUP","DCF COST OF EQUITY ESTIMATES"]
[13,"Exh. AMM-13","FLOTATION COST STUDY","ELECTRIC & GAS UTILITIES"]
["14 (1)","Exh. AMM-14","REGULATORY MECHANISMS","UTILITY GROUP"]
["14 (2-4)","Exh. AMM-14","REGULATORY MECHANISMS","UTILITY GROUP OPERATING COS."]

{"sheet":"AMM-3 Fig. 1","index":8,"n_rows":13,"n_cols":9,"rows_kept":13,"cut":false,"hidden":false,"merged":[[9,3,9,5],[9,6,9,8],[11,2,12,2],[12,5,12,6]]}
[]
[null,null,"Return"]
[]
[]
[]
[]
[]
[]
[null,null,"Rf"]
[null,null,null,"Low beta assets",null,null,"High beta assets"]
[]
[null,null,0]
[null,null,null,null,null,1,null,null,"Beta"]

{"sheet":"AMM-3 Fig. 2","index":9,"n_rows":0,"n_cols":0,"rows_kept":0,"cut":false,"hidden":false,"merged":[]}

{"sheet":"AMM-3 Table 4","index":10,"n_rows":17,"n_cols":7,"rows_kept":17,"cut":false,"hidden":false,"merged":[]}
[]
[]
[]
[null,null,null,null,null,"Average","Change"]
[null,null,null,null,{"$f":"'Bond Yields'!B14","v":"Sep. 2020"},{"$f":"'Bond Yields'!O50","v":"2021-25"},"Basis Pts"]
[null,null,"10-Yr. Treasury",null,{"$f":"'Bond Yields'!M14","v":6.7999999999999996E-3},{"$f":"'Bond Yields'!O55","v":1.9091428687500002E-2},{"$f":"(F6-E6)*10000","v":122.91428687500002}]
[null,null,"30-Yr. Treasury",null,{"$f":"'Bond Yields'!K14","v":1.4200000000000001E-2},{"$f":"'Bond Yields'!O60","v":2.2442196166666668E-2},{"$f":"(F7-E7)*10000","v":82.421961666666675}]
[null,null,"Aaa Corporate",null,{"$f":"'Bond Yields'!O14","v":2.3099999999999999E-2},{"$f":"'Bond Yields'!O65","v":3.0333333833333337E-2},72.333338333333373]
[null,null,"Aa Utility",null,{"$f":"'Bond Yields'!G14","v":2.6200000000000001E-2},{"$f":"'Bond Yields'!O69","v":4.1224999999999998E-2},150.24999999999997]
[]
[null,null,"Sources:"]
[null,null,{"$f":"'Bond Yields'!B20","v":"Moody's Investors Service."}]
[null,null,{"$f":"'Bond Yields'!B21","v":"https://fred.stlouisfed.org/."}]
[null,null,{"$f":"'Bond Yields'!B72&\".\"","v":"Value Line Investment Survey, Forecast for the U.S. Economy (Aug. 28, 2020)."}]
[null,null,{"$f":"'Bond Yields'!B73&\".\"","v":"IHS Markit, Long-Term Macro Forecast - Baseline (Jun. 29, 2020)."}]
[null,null,{"$f":"'Bond Yields'!B74&\".\"","v":"Energy Information Administration, Annual Energy Outlook 2020 (Jan. 29, 2020)."}]
[null,null,{"$f":"'Bond Yields'!B75&\".\"","v":"Wolters Kluwer, Blue Chip Financial Forecasts (Jun. 1, 2020)."}]

{"sheet":"4","index":11,"n_rows":43,"n_cols":23,"rows_kept":43,"cut":false,"hidden":false,"merged":[[22,1,22,8]]}
[{"$f":"'Exhibit List'!C2","v":"ROE ANALYSIS"},null,null,null,null,null,null,null,null,{"$f":"'Exhibit List'!B2","v":"Exh. AMM-4"}]
[null,null,null,null,null,null,null,null,null,"Page 1 of 1"]
[{"$f":"'Exhibit List'!D2","v":"SUMMARY OF RESULTS"}]
[]
[null,"Method",null,null,null,"Average",null,"Midpoint"]
[null,"DCF   "]
[null,null,"Value Line",null,null,{"$f":"'6 (3)'!E31","v":9.2585422316775898E-2},null,{"$f":"'6 (3)'!E32","v":0.10434357565963015}]
[null,null,"IBES",null,null,{"$f":"'6 (3)'!G31","v":9.4327778486256772E-2},null,{"$f":"'6 (3)'!G32","v":9.7795290783031522E-2}]
[null,null,"Zacks",null,null,{"$f":"'6 (3)'!I31","v":9.3010426170854602E-2},null,{"$f":"'6 (3)'!I32","v":0.10076282280866747}]
[null,null,"Internal br + sv",null,null,{"$f":"'6 (3)'!L31","v":8.8209834331551079E-2},null,{"$f":"'6 (3)'!L32","v":8.8322204542593749E-2}]
[]
[null,"CAPM   ",null,null,null,{"$f":"'8'!N31","v":0.1117619047619048},null,{"$f":"'8'!N32","v":0.11550000000000001}]
[]
[null,"Empirical CAPM   ",null,null,null,{"$f":"'9'!Q31","v":0.11433333333333333},null,{"$f":"'9'!Q32","v":0.11749999999999999}]
[]
[null,"Utility Risk Premium"]
[null,null,"Current Bond Yield",null,null,null,{"$f":"'10 (1)'!G22","v":9.2728900000000003E-2}]
[null,null,"Projected Bond Yields",null,null,null,{"$f":"'10 (2)'!G22","v":0.1009507}]
[]
[null,"Expected Earnings",null,null,null,{"$f":"'11'!H30","v":0.10309099308601725},null,{"$f":"'11'!H31","v":0.1085757188547383}]
[]
[]
[null,"ROE Recommendation"]
[null,null,"Cost of Equity Range",null,null,9.2999999999999999E-2,"--",0.107]
[]
[null,null,"Flotation Cost Adjustment"]
[null,null,null,"Dividend Yield",null,null,{"$f":"'6 (1)'!H30","v":3.9886700548484741E-2}]
[null,null,null,"Flotation Cost Percentage",null,null,{"$f":"ROUND('13'!U61,3)","v":2.9000000000000001E-2}]
[null,null,null,null,"Adjustment",null,{"$f":"G27*G28","v":1.1567143159060575E-3}]
[]
[]
[null,null,"Recommended ROE Range",null,null,{"$f":"F24+G29","v":9.4156714315906054E-2},"--",{"$f":"H24+G29","v":0.10815671431590605}]
[null,null,null,null,"Midpoint",null,{"$f":"AVERAGE(F32,H32)","v":0.10115671431590606}]
[]
[]
[]
[]
[null,null,null,null,null,null,null,null,null,null,null,null,null,"UTILITY",null,null,null,null,null,"NON-UTILITY"]
[null,null,null,null,null,null,null,null,null,null,null,null,null,"Growth Rate","Average",null,"Midpoint",null,null,"Growth Rate","Average",null,"Midpoint"]
[null,null,null,null,null,null,null,null,null,null,null,null,null,"Value Line",{"$f":"F7","v":9.2585422316775898E-2},null,{"$f":"H7","v":0.10434357565963015},null,null,"Value Line",{"$f":"'12 (3)'!E54","v":0.10367815311985579},null,{"$f":"'12 (3)'!E55","v":0.10360661806574384}]
[null,null,null,null,null,null,null,null,null,null,null,null,null,"IBES",{"$f":"F8","v":9.4327778486256772E-2},null,{"$f":"H8","v":9.7795290783031522E-2},null,null,"IBES",{"$f":"'12 (3)'!G54","v":9.480797337938919E-2},null,{"$f":"'12 (3)'!G55","v":9.9299551583178297E-2}]
[null,null,null,null,null,null,null,null,null,null,null,null,null,"Zacks",{"$f":"F9","v":9.3010426170854602E-2},null,{"$f":"H9","v":0.10076282280866747},null,null,"Zacks",{"$f":"'12 (3)'!I54","v":9.6378595764929423E-2},null,{"$f":"'12 (3)'!I55","v":9.8923472510986238E-2}]
[null,null,null,null,null,null,null,null,null,null,null,null,null,"br + sv",{"$f":"F10","v":8.8209834331551079E-2},null,{"$f":"H10","v":8.8322204542593749E-2}]

{"sheet":"5 (1)","index":12,"n_rows":38,"n_cols":20,"rows_kept":38,"cut":false,"hidden":false,"merged":[[5,9,5,13],[5,3,5,7],[5,16,5,19]]}
[{"$f":"'Exhibit List'!C3","v":"CAPITAL STRUCTURE"},null,null,null,null,null,null,null,null,null,null,null,null,null,{"$f":"'Exhibit List'!B3","v":"Exh. AMM-5"}]
[null,null,null,null,null,null,null,null,null,null,null,null,null,null,"Page 1 of 3"]
[{"$f":"'Exhibit List'!D3","v":"UTILITY GROUP"}]
[]
[]
[null,null,null,"At Fiscal Year-End 2019  (a)",null,null,null,null,null,"Value Line Projected (b)",null,null,null,null,null,null,"At Fiscal Year-End 2019"]
[null,null,null,null,null,null,null,"Common",null,null,null,null,null,"Common",null,null,"Long-term",null,"Common"]
[null,"Company",null,"Debt (c)",null,"Preferred",null,"Equity",null,"Debt (c)",null,"Other",null,"Equity",null,null,"Debt","Preferred","Stock","Total"]
[{"$f":"A8+1","v":1},{"$f":"VLOOKUP('Utility Group'!$B3,vldatabase,2,FALSE)","v":"Algonquin Pwr & Util"},null,{"$f":"Q9/T9","v":0.47153390259092115},null,{"$f":"R9/T9","v":2.2102274723771038E-2},null,{"$f":"S9/T9","v":0.50636382268530788},null,{"$f":"VLOOKUP('Utility Group'!$B3,vldatabase,13,FALSE)","v":"n/a"},null,{"$f":"IF(J9=\"n/a\",\"n/a\",1-J9-N9)","v":"n/a"},null,{"$f":"VLOOKUP('Utility Group'!$B3,vldatabase,15,FALSE)","v":"n/a"},null,null,3931.8679999999999,184.29900000000001,4222.2960000000003,{"$f":"SUM(Q9:S9)","v":8338.4629999999997}]
[{"$f":"A9+1","v":2},{"$f":"VLOOKUP('Utility Group'!$B4,vldatabase,2,FALSE)","v":"ALLETE"},null,{"$f":"Q10/T10","v":0.40861903073884642},null,{"$f":"R10/T10","v":0},null,{"$f":"S10/T10","v":0.59138096926115358},null,{"$f":"VLOOKUP('Utility Group'!$B4,vldatabase,13,FALSE)","v":0.41},null,{"$f":"IF(J10=\"n/a\",\"n/a\",1-J10-N10)","v":1.1102230246251565E-16},null,{"$f":"VLOOKUP('Utility Group'!$B4,vldatabase,15,FALSE)","v":0.59},null,null,1613.8000000000002,0,2335.6,{"$f":"SUM(Q10:S10)","v":3949.4}]
[3,{"$f":"VLOOKUP('Utility Group'!$B5,vldatabase,2,FALSE)","v":"Ameren Corp."},null,0.53291946690967085,null,0,null,0.46708053309032921,null,{"$f":"VLOOKUP('Utility Group'!$B5,vldatabase,13,FALSE)","v":0.5},null,1.0000000000000009E-2,null,{"$f":"VLOOKUP('Utility Group'!$B5,vldatabase,15,FALSE)","v":0.49},null,null,9357,0,8201,17558]
[4,{"$f":"VLOOKUP('Utility Group'!$B6,vldatabase,2,FALSE)","v":"Avangrid, Inc."},null,0.3232893365751997,null,0,null,0.67671066342480024,null,{"$f":"VLOOKUP('Utility Group'!$B6,vldatabase,13,FALSE)","v":0.42499999999999999},null,0,null,{"$f":"VLOOKUP('Utility Group'!$B6,vldatabase,15,FALSE)","v":0.57499999999999996},null,null,7446,0,15586,23032]
[5,{"$f":"VLOOKUP('Utility Group'!$B7,vldatabase,2,FALSE)","v":"Avista Corp."},null,0.49432654368180667,null,0,null,0.50567345631819338,null,{"$f":"VLOOKUP('Utility Group'!$B7,vldatabase,13,FALSE)","v":0.51},null,0,null,{"$f":"VLOOKUP('Utility Group'!$B7,vldatabase,15,FALSE)","v":0.49},null,null,1895.768,0,1939.2840000000001,3835.0520000000001]
[6,{"$f":"VLOOKUP('Utility Group'!$B8,vldatabase,2,FALSE)","v":"Black Hills Corp."},null,0.56076481111633203,null,0,null,0.43923518888366803,null,{"$f":"VLOOKUP('Utility Group'!$B8,vldatabase,13,FALSE)","v":0.52},null,0,null,{"$f":"VLOOKUP('Utility Group'!$B8,vldatabase,15,FALSE)","v":0.48},null,null,3145.8389999999999,0,2464.069,5609.9079999999994]
[7,{"$f":"VLOOKUP('Utility Group'!$B9,vldatabase,2,FALSE)","v":"CenterPoint Energy"},null,0.64356984478935697,null,0,null,0.35643015521064303,null,{"$f":"VLOOKUP('Utility Group'!$B9,vldatabase,13,FALSE)","v":0.54500000000000004},null,3.4999999999999976E-2,null,{"$f":"VLOOKUP('Utility Group'!$B9,vldatabase,15,FALSE)","v":0.42},null,null,15093,0,8359,23452]
[8,{"$f":"VLOOKUP('Utility Group'!$B10,vldatabase,2,FALSE)","v":"CMS Energy Corp."},null,0.72243575664397097,null,0,null,0.27756424335602897,null,{"$f":"VLOOKUP('Utility Group'!$B10,vldatabase,13,FALSE)","v":0.68},null,-5.5511151231257827E-17,null,{"$f":"VLOOKUP('Utility Group'!$B10,vldatabase,15,FALSE)","v":0.32},null,null,13157,0,5055,18212]
[9,{"$f":"VLOOKUP('Utility Group'!$B11,vldatabase,2,FALSE)","v":"DTE Energy Co."},null,0.52079021107027701,null,0,null,0.47920978892972305,null,{"$f":"VLOOKUP('Utility Group'!$B11,vldatabase,13,FALSE)","v":0.58499999999999996},null,5.5511151231257827E-17,null,{"$f":"VLOOKUP('Utility Group'!$B11,vldatabase,15,FALSE)","v":0.41499999999999998},null,null,36986,0,34033,71019]
[10,{"$f":"VLOOKUP('Utility Group'!$B12,vldatabase,2,FALSE)","v":"Edison International"},null,0.58408883266568279,null,0,null,0.41591116733431727,null,{"$f":"VLOOKUP('Utility Group'!$B12,vldatabase,13,FALSE)","v":0.57999999999999996},null,4.500000000000004E-2,null,{"$f":"VLOOKUP('Utility Group'!$B12,vldatabase,15,FALSE)","v":0.375},null,null,16622,0,11836,28458]
[11,{"$f":"VLOOKUP('Utility Group'!$B13,vldatabase,2,FALSE)","v":"Emera Inc."},null,0.54206684594698429,null,0,null,0.45793315405301577,null,{"$f":"VLOOKUP('Utility Group'!$B13,vldatabase,13,FALSE)","v":0.53612565445026183},null,-5.5511151231257827E-17,null,{"$f":"VLOOKUP('Utility Group'!$B13,vldatabase,15,FALSE)","v":0.46387434554973822},null,null,18343,0,15496,33839]
[12,{"$f":"VLOOKUP('Utility Group'!$B14,vldatabase,2,FALSE)","v":"Entergy Corp."},null,0.6483655181118263,null,4.2239892296688966E-2,null,0.30939458959148469,null,{"$f":"VLOOKUP('Utility Group'!$B14,vldatabase,13,FALSE)","v":0.59499999999999997},null,1.0000000000000009E-2,null,{"$f":"VLOOKUP('Utility Group'!$B14,vldatabase,15,FALSE)","v":0.39500000000000002},null,null,15411,1004,7354,23769]
[13,{"$f":"VLOOKUP('Utility Group'!$B15,vldatabase,2,FALSE)","v":"Exelon Corp."},null,0.63042532839254306,null,7.7388548286630738E-3,null,0.36183581677879384,null,{"$f":"VLOOKUP('Utility Group'!$B15,vldatabase,13,FALSE)","v":0.5},null,0,null,{"$f":"VLOOKUP('Utility Group'!$B15,vldatabase,15,FALSE)","v":0.5},null,null,17873.654999999999,219.41,10258.674999999999,28351.739999999998]
[14,{"$f":"VLOOKUP('Utility Group'!$B16,vldatabase,2,FALSE)","v":"FirstEnergy Corp."},null,0.5130700543646658,null,0,null,0.4869299456353342,null,{"$f":"VLOOKUP('Utility Group'!$B16,vldatabase,13,FALSE)","v":0.66},null,-5.5511151231257827E-17,null,{"$f":"VLOOKUP('Utility Group'!$B16,vldatabase,15,FALSE)","v":0.34},null,null,36429,0,34573,71002]
[15,{"$f":"VLOOKUP('Utility Group'!$B17,vldatabase,2,FALSE)","v":"Hawaiian Elec."},null,0.74140807474140813,null,0,null,0.25859192525859193,null,{"$f":"VLOOKUP('Utility Group'!$B17,vldatabase,13,FALSE)","v":0.48},null,5.0000000000000044E-3,null,{"$f":"VLOOKUP('Utility Group'!$B17,vldatabase,15,FALSE)","v":0.51500000000000001},null,null,19998,0,6975,26973]
[16,{"$f":"VLOOKUP('Utility Group'!$B18,vldatabase,2,FALSE)","v":"IDACORP, Inc."},null,0.47325028424944032,null,7.804456412203108E-3,null,0.51894525933835656,null,{"$f":"VLOOKUP('Utility Group'!$B18,vldatabase,13,FALSE)","v":0.46500000000000002},null,-1.1102230246251565E-16,null,{"$f":"VLOOKUP('Utility Group'!$B18,vldatabase,15,FALSE)","v":0.53500000000000003},null,null,2079.4749999999999,34.292999999999999,2280.2600000000002,4394.0280000000002]
[17,{"$f":"VLOOKUP('Utility Group'!$B19,vldatabase,2,FALSE)","v":"NorthWestern Corp."},null,0.42641481310880447,null,0,null,0.57358518689119553,null,{"$f":"VLOOKUP('Utility Group'!$B19,vldatabase,13,FALSE)","v":0.5},null,0,null,{"$f":"VLOOKUP('Utility Group'!$B19,vldatabase,15,FALSE)","v":0.5},null,null,1836.6590000000001,0,2470.5530000000003,4307.2120000000004]
[18,{"$f":"VLOOKUP('Utility Group'!$B20,vldatabase,2,FALSE)","v":"OGE Energy Corp."},null,0.52494029993313596,null,0,null,0.4750597000668641,null,{"$f":"VLOOKUP('Utility Group'!$B20,vldatabase,13,FALSE)","v":0.49},null,0,null,{"$f":"VLOOKUP('Utility Group'!$B20,vldatabase,15,FALSE)","v":0.51},null,null,2253.1959999999999,0,2039.0940000000001,4292.29]
[19,{"$f":"VLOOKUP('Utility Group'!$B21,vldatabase,2,FALSE)","v":"Otter Tail Corp."},null,0.43562790570848159,null,0,null,0.56437209429151847,null,{"$f":"VLOOKUP('Utility Group'!$B21,vldatabase,13,FALSE)","v":0.47},null,0,null,{"$f":"VLOOKUP('Utility Group'!$B21,vldatabase,15,FALSE)","v":0.53},null,null,3195.2,0,4139.5,7334.7]
[20,{"$f":"VLOOKUP('Utility Group'!$B22,vldatabase,2,FALSE)","v":"PNM Resources"},null,0.46882982179730648,null,0,null,0.53117017820269341,null,{"$f":"VLOOKUP('Utility Group'!$B22,vldatabase,13,FALSE)","v":0.505},null,5.0000000000000044E-3,null,{"$f":"VLOOKUP('Utility Group'!$B22,vldatabase,15,FALSE)","v":0.49},null,null,689.76400000000001,0,781.48199999999997,1471.2460000000001]
[21,{"$f":"VLOOKUP('Utility Group'!$B23,vldatabase,2,FALSE)","v":"Sempra Energy"},null,0.63174113147753119,null,2.4215521290082997E-3,null,0.36583731639346051,null,{"$f":"VLOOKUP('Utility Group'!$B23,vldatabase,13,FALSE)","v":0.48499999999999999},null,0,null,{"$f":"VLOOKUP('Utility Group'!$B23,vldatabase,15,FALSE)","v":0.51500000000000001},null,null,3007.7170000000001,11.529,1741.75,4760.9960000000001]
[]
[null,"Average",null,{"$f":"AVERAGE(D9:D29)","v":0.5380227530768662},null,{"$f":"AVERAGE(F9:F29)","v":3.9193823995397371E-3},null,{"$f":"AVERAGE(H9:H29)","v":0.45805786452359393},null,{"$f":"AVERAGE(J9:J29)","v":0.52205628272251325},null,{"$f":"AVERAGE(L9:L29)","v":5.4999999999999962E-3},null,{"$f":"AVERAGE(N9:N29)","v":0.47244371727748691}]
[]
[]
["(a)","Company Form 10-K and Annual Reports."]
["(b)",{"$f":"'Utility Group Criteria'!B50","v":"The Value Line Investment Survey (Jul. 24, Aug. 14 and Sep. 11, 2020)."}]
["(c)","Includes current maturities."]
[null,null,null,null,null,null,null,{"$f":"MIN(H9:H29)","v":0.25859192525859193},null,null,null,null,null,{"$f":"MIN(N9:N29)","v":0.32}]
[null,null,null,null,null,null,null,{"$f":"MAX(H9:H29)","v":0.67671066342480024},null,null,null,null,null,{"$f":"MAX(N9:N29)","v":0.59}]

{"sheet":"5 (2-3)","index":13,"n_rows":45,"n_cols":12,"rows_kept":45,"cut":false,"hidden":false,"merged":[[4,2,4,4],[4,8,4,10]]}
[{"$f":"'Exhibit List'!C4","v":"CAPITAL STRUCTURE"},null,null,null,null,{"$f":"'Exhibit List'!B4","v":"Exh. AMM-5"},{"$f":"A1","v":"CAPITAL STRUCTURE"},null,null,null,null,{"$f":"F1","v":"Exh. AMM-5"}]
[null,null,null,null,null,"Page 2 of 3",null,null,null,null,null,"Page 3 of 3"]
[{"$f":"'Exhibit List'!D4","v":"ELECTRIC GROUP OPERATING SUBSIDIARIES"},null,null,null,null,null,{"$f":"A3","v":"ELECTRIC GROUP OPERATING SUBSIDIARIES"}]
[]
[null,null,"At Year-End 2019 (a)",null,null,null,null,null,{"$f":"C5","v":"At Year-End 2019 (a)"}]
[null,"Operating Company","Debt (b)","Preferred","Common Equity",null,null,"Operating Company","Debt (b)","Preferred","Common Equity"]
[null,"ALGONQUIN PWR. & UTIL.",null,null,null,null,null,"EXELON CORP."]
[null,"Empire District Electric Co.",{"$f":"'Capital Structure - Op. Cos.'!K11","v":0.46007417006348611},{"$f":"'Capital Structure - Op. Cos.'!L11","v":0},{"$f":"'Capital Structure - Op. Cos.'!M11","v":0.53992582993651383},null,null,"Delmarva Power and Light",{"$f":"'Capital Structure - Op. Cos.'!K45","v":0.49793454083253891},{"$f":"'Capital Structure - Op. Cos.'!L45","v":0},{"$f":"'Capital Structure - Op. Cos.'!M45","v":0.50206545916746104}]
[null,"Liberty Utilities (Granite State Elec.)",{"$f":"'Capital Structure - Op. Cos.'!K12","v":0.22949764819388116},{"$f":"'Capital Structure - Op. Cos.'!L12","v":0},{"$f":"'Capital Structure - Op. Cos.'!M12","v":0.77050235180611881},null,null,"Baltimore Gas & Electric Co.",{"$f":"'Capital Structure - Op. Cos.'!K46","v":0.47030058967352223},{"$f":"'Capital Structure - Op. Cos.'!L46","v":0},{"$f":"'Capital Structure - Op. Cos.'!M46","v":0.52969941032647783}]
[null,"ALLETE",null,null,null,null,null,"Commonweath Edison Co.",{"$f":"'Capital Structure - Op. Cos.'!K47","v":0.44887214164042738},{"$f":"'Capital Structure - Op. Cos.'!L47","v":0},{"$f":"'Capital Structure - Op. Cos.'!M47","v":0.55112785835957256}]
[null,"ALLETE, Inc. (Minnesota Power)",{"$f":"'Capital Structure - Op. Cos.'!K14","v":0.40410811968790467},{"$f":"'Capital Structure - Op. Cos.'!L14","v":0},{"$f":"'Capital Structure - Op. Cos.'!M14","v":0.59589188031209528},null,null,"PECO Energy Co.",{"$f":"'Capital Structure - Op. Cos.'!K48","v":0.46208317239603452},{"$f":"'Capital Structure - Op. Cos.'!L48","v":0},{"$f":"'Capital Structure - Op. Cos.'!M48","v":0.53791682760396553}]
[null,"AMEREN CORP.",null,null,null,null,null,"Potomac Electric Power Co.",{"$f":"'Capital Structure - Op. Cos.'!K49","v":0.49627447582741291},{"$f":"'Capital Structure - Op. Cos.'!L49","v":0},{"$f":"'Capital Structure - Op. Cos.'!M49","v":0.50372552417258709}]
[null,"Ameren Illinois Co.",{"$f":"'Capital Structure - Op. Cos.'!K16","v":0.46386401972233032},{"$f":"'Capital Structure - Op. Cos.'!L16","v":8.0446347476320224E-3},{"$f":"'Capital Structure - Op. Cos.'!M16","v":0.52809134553003767},null,null,"Atlantic City Electric Co.",{"$f":"'Capital Structure - Op. Cos.'!K50","v":0.50979638878217437},{"$f":"'Capital Structure - Op. Cos.'!L50","v":0},{"$f":"'Capital Structure - Op. Cos.'!M50","v":0.49020361121782557}]
[null,"Union Electric Co.",{"$f":"'Capital Structure - Op. Cos.'!K17","v":0.49068977632041222},{"$f":"'Capital Structure - Op. Cos.'!L17","v":9.3687785454971313E-3},{"$f":"'Capital Structure - Op. Cos.'!M17","v":0.49994144513409067},null,null,"FIRSTENERGY CORP."]
[null,"AVANGRID",null,null,null,null,null,"Cleve. Elec. Illum./Ohio Ed./Toledo Ed.",{"$f":"'Capital Structure - Op. Cos.'!K52","v":0.40195503097779062},{"$f":"'Capital Structure - Op. Cos.'!L52","v":0},{"$f":"'Capital Structure - Op. Cos.'!M52","v":0.59804496902220938}]
[null,"Central Maine Pwr",{"$f":"'Capital Structure - Op. Cos.'!K19","v":0.3749503249897696},{"$f":"'Capital Structure - Op. Cos.'!L19","v":1.8000766442576084E-4},{"$f":"'Capital Structure - Op. Cos.'!M19","v":0.62486966734580462},null,null,"Jersey Central Power & Light Co.",{"$f":"'Capital Structure - Op. Cos.'!K53","v":0.31666389500140557},{"$f":"'Capital Structure - Op. Cos.'!L53","v":0},{"$f":"'Capital Structure - Op. Cos.'!M53","v":0.68333610499859443}]
[null,"NY State E&G",{"$f":"'Capital Structure - Op. Cos.'!K20","v":0.51063849470461053},{"$f":"'Capital Structure - Op. Cos.'!L20","v":0},{"$f":"'Capital Structure - Op. Cos.'!M20","v":0.48936150529538958},null,null,"Metropolitan Edison Co.",{"$f":"'Capital Structure - Op. Cos.'!K54","v":0.52004701801641828},{"$f":"'Capital Structure - Op. Cos.'!L54","v":0},{"$f":"'Capital Structure - Op. Cos.'!M54","v":0.47995298198358177}]
[null,"Rochester G&E",{"$f":"'Capital Structure - Op. Cos.'!K21","v":0.4878481220837258},{"$f":"'Capital Structure - Op. Cos.'!L21","v":0},{"$f":"'Capital Structure - Op. Cos.'!M21","v":0.51215187791627415},null,null,"Monongahela Power Co.",{"$f":"'Capital Structure - Op. Cos.'!K55","v":0.53643690609271089},{"$f":"'Capital Structure - Op. Cos.'!L55","v":0},{"$f":"'Capital Structure - Op. Cos.'!M55","v":0.46356309390728911}]
[null,"United Illuminating",{"$f":"'Capital Structure - Op. Cos.'!K22","v":0.42373355243998267},{"$f":"'Capital Structure - Op. Cos.'!L22","v":0},{"$f":"'Capital Structure - Op. Cos.'!M22","v":0.57626644756001733},null,null,"Pennsylvania Electric Co.",{"$f":"'Capital Structure - Op. Cos.'!K56","v":0.49625336693205757},{"$f":"'Capital Structure - Op. Cos.'!L56","v":0},{"$f":"'Capital Structure - Op. Cos.'!M56","v":0.50374663306794254}]
[null,"BLACK HILLS CORP.",null,null,null,null,null,"The Potomac Edison Co.",{"$f":"'Capital Structure - Op. Cos.'!K57","v":0.45693390247034088},{"$f":"'Capital Structure - Op. Cos.'!L57","v":0},{"$f":"'Capital Structure - Op. Cos.'!M57","v":0.54306609752965918}]
[null,"Black Hills Power",{"$f":"'Capital Structure - Op. Cos.'!K24","v":0.43180738841369554},{"$f":"'Capital Structure - Op. Cos.'!L24","v":0},{"$f":"'Capital Structure - Op. Cos.'!M24","v":0.56819261158630452},null,null,"West Penn Power Co.",{"$f":"'Capital Structure - Op. Cos.'!K58","v":0.52312854136493758},{"$f":"'Capital Structure - Op. Cos.'!L58","v":0},{"$f":"'Capital Structure - Op. Cos.'!M58","v":0.47687145863506247}]
[null,"Cheyenne Light Fuel & Power",{"$f":"'Capital Structure - Op. Cos.'!K25","v":0.51684138792555612},{"$f":"'Capital Structure - Op. Cos.'!L25","v":0},{"$f":"'Capital Structure - Op. Cos.'!M25","v":0.48315861207444394},null,null,"Pennsylvania Power",{"$f":"'Capital Structure - Op. Cos.'!K59","v":0.51206883516040769},{"$f":"'Capital Structure - Op. Cos.'!L59","v":0},{"$f":"'Capital Structure - Op. Cos.'!M59","v":0.4879311648395922}]
[null,"Black Hills/Colorado Elec. Util. Co.",{"$f":"'Capital Structure - Op. Cos.'!K26","v":0.27015299563795847},{"$f":"'Capital Structure - Op. Cos.'!L26","v":0},{"$f":"'Capital Structure - Op. Cos.'!M26","v":0.72984700436204164},null,null,"HAWAIIAN ELEC."]
[null,"CENTERPOINT ENERGY",null,null,null,null,null,"Hawaiian Electric Co.",{"$f":"'Capital Structure - Op. Cos.'!K61","v":0.41842314947677095},{"$f":"'Capital Structure - Op. Cos.'!L61","v":9.5808915232871578E-3},{"$f":"'Capital Structure - Op. Cos.'!M61","v":0.57199595899994193}]
[null,"CenterPoint Energy Houston Elect.",{"$f":"'Capital Structure - Op. Cos.'!K28","v":0.60358492866723568},{"$f":"'Capital Structure - Op. Cos.'!L28","v":0},{"$f":"'Capital Structure - Op. Cos.'!M28","v":0.39641507133276432},null,null,"IDACORP"]
[null,"CMS ENERGY",null,null,null,null,null,"Idaho Power Co.",{"$f":"'Capital Structure - Op. Cos.'!K63","v":0.44663463853326835},{"$f":"'Capital Structure - Op. Cos.'!L63","v":0},{"$f":"'Capital Structure - Op. Cos.'!M63","v":0.55336536146673154}]
[null,"Consumers Energy Co.",{"$f":"'Capital Structure - Op. Cos.'!K30","v":0.48700437607744329},{"$f":"'Capital Structure - Op. Cos.'!L30","v":2.4532555364010079E-3},{"$f":"'Capital Structure - Op. Cos.'!M30","v":0.51054236838615563},null,null,"NORTHWESTERN CORP."]
[null,"DTE ENERGY CO.",null,null,null,null,null,"NorthWestern Corporation",{"$f":"'Capital Structure - Op. Cos.'!K65","v":0.52410237222281564},{"$f":"'Capital Structure - Op. Cos.'!L65","v":0},{"$f":"'Capital Structure - Op. Cos.'!M65","v":0.47589762777718442}]
[null,"DTE Electric Co.",{"$f":"'Capital Structure - Op. Cos.'!K32","v":0.49975665716470835},{"$f":"'Capital Structure - Op. Cos.'!L32","v":0},{"$f":"'Capital Structure - Op. Cos.'!M32","v":0.5002433428352917},null,null,"OGE ENERGY CORP."]
[null,"EDISON INTERNATIONAL",null,null,null,null,null,"Oklahoma G&E",{"$f":"'Capital Structure - Op. Cos.'!K67","v":0.44853255880130316},{"$f":"'Capital Structure - Op. Cos.'!L67","v":0},{"$f":"'Capital Structure - Op. Cos.'!M67","v":0.55146744119869684}]
[null,"Southern California Edison Co.",{"$f":"'Capital Structure - Op. Cos.'!K34","v":0.46040922574005688},{"$f":"'Capital Structure - Op. Cos.'!L34","v":6.7952055209153095E-2},{"$f":"'Capital Structure - Op. Cos.'!M34","v":0.47163871905079002},null,null,"OTTER TAIL CORP."]
[null,"EMERA INC.",null,null,null,null,null,"Otter Tail Power Co.",{"$f":"'Capital Structure - Op. Cos.'!K69","v":0.48875296491464393},{"$f":"'Capital Structure - Op. Cos.'!L69","v":0},{"$f":"'Capital Structure - Op. Cos.'!M69","v":0.51124703508535596}]
[null,"Emera Maine",{"$f":"'Capital Structure - Op. Cos.'!K36","v":0.42832344214118651},{"$f":"'Capital Structure - Op. Cos.'!L36","v":3.9270878259789466E-4},{"$f":"'Capital Structure - Op. Cos.'!M36","v":0.57128384907621566},null,null,"PNM RESOURCES"]
[null,"Tampa Electric Co.",{"$f":"'Capital Structure - Op. Cos.'!K37","v":0.44703730250403961},{"$f":"'Capital Structure - Op. Cos.'!L37","v":0},{"$f":"'Capital Structure - Op. Cos.'!M37","v":0.55296269749596039},null,null,"Public Service Company of New Mexico",{"$f":"'Capital Structure - Op. Cos.'!K71","v":0.53423920684111759},{"$f":"'Capital Structure - Op. Cos.'!L71","v":3.5235545449544313E-3},{"$f":"'Capital Structure - Op. Cos.'!M71","v":0.46223723861392796}]
[null,"ENTERGY CORP.",null,null,null,null,null,"Texas-New Mexico Power Co.",{"$f":"'Capital Structure - Op. Cos.'!K72","v":0.47055534273755051},{"$f":"'Capital Structure - Op. Cos.'!L72","v":0},{"$f":"'Capital Structure - Op. Cos.'!M72","v":0.52944465726244949}]
[null,"Entergy Arkansas Inc.",{"$f":"'Capital Structure - Op. Cos.'!K39","v":0.52944922924307691},{"$f":"'Capital Structure - Op. Cos.'!L39","v":0},{"$f":"'Capital Structure - Op. Cos.'!M39","v":0.47055077075692309},null,null,"SEMPRA ENERGY"]
[null,"Entergy Louisiana LLC",{"$f":"'Capital Structure - Op. Cos.'!K40","v":0.53308390240648229},{"$f":"'Capital Structure - Op. Cos.'!L40","v":0},{"$f":"'Capital Structure - Op. Cos.'!M40","v":0.46691609759351782},null,null,"San Diego Gas & Electric",{"$f":"'Capital Structure - Op. Cos.'!K74","v":0.4725895112167583},{"$f":"'Capital Structure - Op. Cos.'!L74","v":0},{"$f":"'Capital Structure - Op. Cos.'!M74","v":0.5274104887832417}]
[null,"Entergy Mississippi Inc.",{"$f":"'Capital Structure - Op. Cos.'!K41","v":0.51140234706680021},{"$f":"'Capital Structure - Op. Cos.'!L41","v":0},{"$f":"'Capital Structure - Op. Cos.'!M41","v":0.4885976529331999},null,null,"Oncor Electric Delivery",{"$f":"'Capital Structure - Op. Cos.'!K75","v":0.43359984755243491},{"$f":"'Capital Structure - Op. Cos.'!L75","v":0},{"$f":"'Capital Structure - Op. Cos.'!M75","v":0.56640015244756503}]
[null,"Entergy New Orleans Inc.",{"$f":"'Capital Structure - Op. Cos.'!K42","v":0.52909628286457067},{"$f":"'Capital Structure - Op. Cos.'!L42","v":0},{"$f":"'Capital Structure - Op. Cos.'!M42","v":0.47090371713542939}]
[null,"Entergy Texas Inc.",{"$f":"'Capital Structure - Op. Cos.'!K43","v":0.51659550667143428},{"$f":"'Capital Structure - Op. Cos.'!L43","v":9.4026294587604697E-3},{"$f":"'Capital Structure - Op. Cos.'!M43","v":0.47400186386980531},null,null,"Minimum",{"$f":"MIN(C8:C43,I8:I39)","v":0.22949764819388116},{"$f":"MIN(D8:D43,J8:J39)","v":0},{"$f":"MIN(E8:E43,K8:K39)","v":0.39641507133276432}]
[null,null,null,null,null,null,null,"Maximum",{"$f":"MAX(C8:C43,I8:I39)","v":0.60358492866723568},{"$f":"MAX(D8:D43,J8:J39)","v":6.7952055209153095E-2},{"$f":"MAX(E8:E43,K8:K39)","v":0.77050235180611881}]
[null,null,null,null,null,null,null,"Average",{"$f":"AVERAGE(C8:C43,I8:I39)","v":0.46730712169989536},{"$f":"AVERAGE(D8:D43,J8:J39)","v":2.4108373046241079E-3},{"$f":"AVERAGE(E8:E43,K8:K39)","v":0.53028204099548037}]
[]
[null,null,null,null,null,null,null,"(a) Data from 2019 Company Form 10-K and FERC Form 1 reports."]
[null,null,null,null,null,null,null,"(b)  Includes current maturities."]

{"sheet":"6 (1)","index":14,"n_rows":36,"n_cols":9,"rows_kept":36,"cut":false,"hidden":false,"merged":[[33,1,33,8]]}
[{"$f":"'Exhibit List'!C5","v":"DCF MODEL - UTILITY GROUP"},null,null,null,null,null,null,null,{"$f":"'Exhibit List'!B5","v":"Exh. AMM-6"}]
[null,null,null,null,null,null,null,null,"Page 1 of 4"]
[{"$f":"'Exhibit List'!D5","v":"DIVIDEND YIELD"}]
[]
[]
[null,null,null,"(a)",null,"(b)"]
[null,"Company ",null,"Price",null,"Dividends",null,"Yield"]
[{"$f":"A7+1","v":1},{"$f":"VLOOKUP('Utility Group'!$B3,vldatabase,2,FALSE)","v":"Algonquin Pwr & Util"},null,{"$f":"HLOOKUP('Utility Group'!$B3,stockprice,33,FALSE)","v":14.062333333333335},null,{"$f":"VLOOKUP('Utility Group'!$B3,vldatabase,4,FALSE)","v":0.62},null,{"$f":"F8/D8","v":4.4089411430061391E-2}]
[{"$f":"A8+1","v":2},{"$f":"VLOOKUP('Utility Group'!$B4,vldatabase,2,FALSE)","v":"ALLETE"},null,{"$f":"HLOOKUP('Utility Group'!$B4,stockprice,33,FALSE)","v":52.70033333333334},null,{"$f":"VLOOKUP('Utility Group'!$B4,vldatabase,4,FALSE)","v":2.5499999999999998},null,{"$f":"F9/D9","v":4.8386790722386316E-2}]
[3,{"$f":"VLOOKUP('Utility Group'!$B5,vldatabase,2,FALSE)","v":"Ameren Corp."},null,{"$f":"HLOOKUP('Utility Group'!$B5,stockprice,33,FALSE)","v":78.320333333333323},null,{"$f":"VLOOKUP('Utility Group'!$B5,vldatabase,4,FALSE)","v":2.08},null,2.6557598920671947E-2]
[4,{"$f":"VLOOKUP('Utility Group'!$B6,vldatabase,2,FALSE)","v":"Avangrid, Inc."},null,{"$f":"HLOOKUP('Utility Group'!$B6,stockprice,33,FALSE)","v":49.142000000000003},null,{"$f":"VLOOKUP('Utility Group'!$B6,vldatabase,4,FALSE)","v":1.76},null,3.5814578161246995E-2]
[5,{"$f":"VLOOKUP('Utility Group'!$B7,vldatabase,2,FALSE)","v":"Avista Corp."},null,{"$f":"HLOOKUP('Utility Group'!$B7,stockprice,33,FALSE)","v":35.345333333333329},null,{"$f":"VLOOKUP('Utility Group'!$B7,vldatabase,4,FALSE)","v":1.64},null,4.6399336074540727E-2]
[6,{"$f":"VLOOKUP('Utility Group'!$B8,vldatabase,2,FALSE)","v":"Black Hills Corp."},null,{"$f":"HLOOKUP('Utility Group'!$B8,stockprice,33,FALSE)","v":54.695666666666675},null,{"$f":"VLOOKUP('Utility Group'!$B8,vldatabase,4,FALSE)","v":2.23},null,4.0771054379688816E-2]
[7,{"$f":"VLOOKUP('Utility Group'!$B9,vldatabase,2,FALSE)","v":"CenterPoint Energy"},null,{"$f":"HLOOKUP('Utility Group'!$B9,stockprice,33,FALSE)","v":19.516000000000002},null,{"$f":"VLOOKUP('Utility Group'!$B9,vldatabase,4,FALSE)","v":0.63},null,3.2281205164992825E-2]
[8,{"$f":"VLOOKUP('Utility Group'!$B10,vldatabase,2,FALSE)","v":"CMS Energy Corp."},null,{"$f":"HLOOKUP('Utility Group'!$B10,stockprice,33,FALSE)","v":60.863000000000021},null,{"$f":"VLOOKUP('Utility Group'!$B10,vldatabase,4,FALSE)","v":1.71},null,2.8095887485007302E-2]
[9,{"$f":"VLOOKUP('Utility Group'!$B11,vldatabase,2,FALSE)","v":"DTE Energy Co."},null,{"$f":"HLOOKUP('Utility Group'!$B11,stockprice,33,FALSE)","v":116.40199999999999},null,{"$f":"VLOOKUP('Utility Group'!$B11,vldatabase,4,FALSE)","v":4.34},null,3.72845827391282E-2]
[10,{"$f":"VLOOKUP('Utility Group'!$B12,vldatabase,2,FALSE)","v":"Edison International"},null,{"$f":"HLOOKUP('Utility Group'!$B12,stockprice,33,FALSE)","v":51.469333333333324},null,{"$f":"VLOOKUP('Utility Group'!$B12,vldatabase,4,FALSE)","v":2.6},null,5.0515517330708262E-2]
[11,{"$f":"VLOOKUP('Utility Group'!$B13,vldatabase,2,FALSE)","v":"Emera Inc."},null,{"$f":"HLOOKUP('Utility Group'!$B13,stockprice,33,FALSE)","v":54.11066679999999},null,{"$f":"VLOOKUP('Utility Group'!$B13,vldatabase,4,FALSE)","v":2.4500000000000002},null,4.5277579170397521E-2]
[12,{"$f":"VLOOKUP('Utility Group'!$B14,vldatabase,2,FALSE)","v":"Entergy Corp."},null,{"$f":"HLOOKUP('Utility Group'!$B14,stockprice,33,FALSE)","v":97.567000000000007},null,{"$f":"VLOOKUP('Utility Group'!$B14,vldatabase,4,FALSE)","v":3.8},null,3.8947594986009609E-2]
[13,{"$f":"VLOOKUP('Utility Group'!$B15,vldatabase,2,FALSE)","v":"Exelon Corp."},null,{"$f":"HLOOKUP('Utility Group'!$B15,stockprice,33,FALSE)","v":36.200000000000003},null,{"$f":"VLOOKUP('Utility Group'!$B15,vldatabase,4,FALSE)","v":1.57},null,4.3370165745856351E-2]
[14,{"$f":"VLOOKUP('Utility Group'!$B16,vldatabase,2,FALSE)","v":"FirstEnergy Corp."},null,{"$f":"HLOOKUP('Utility Group'!$B16,stockprice,33,FALSE)","v":28.777333333333331},null,{"$f":"VLOOKUP('Utility Group'!$B16,vldatabase,4,FALSE)","v":1.59},null,5.5251818560904421E-2]
[15,{"$f":"VLOOKUP('Utility Group'!$B17,vldatabase,2,FALSE)","v":"Hawaiian Elec."},null,{"$f":"HLOOKUP('Utility Group'!$B17,stockprice,33,FALSE)","v":60.44583333333334},null,{"$f":"VLOOKUP('Utility Group'!$B17,vldatabase,4,FALSE)","v":1.32},null,2.1837733507961671E-2]
[16,{"$f":"VLOOKUP('Utility Group'!$B18,vldatabase,2,FALSE)","v":"IDACORP, Inc."},null,{"$f":"HLOOKUP('Utility Group'!$B18,stockprice,33,FALSE)","v":84.64100000000002},null,{"$f":"VLOOKUP('Utility Group'!$B18,vldatabase,4,FALSE)","v":2.83},null,3.3435332758355869E-2]
[17,{"$f":"VLOOKUP('Utility Group'!$B19,vldatabase,2,FALSE)","v":"NorthWestern Corp."},null,{"$f":"HLOOKUP('Utility Group'!$B19,stockprice,33,FALSE)","v":50.607333333333337},null,{"$f":"VLOOKUP('Utility Group'!$B19,vldatabase,4,FALSE)","v":2.4500000000000002},null,4.8411956106493133E-2]
[18,{"$f":"VLOOKUP('Utility Group'!$B20,vldatabase,2,FALSE)","v":"OGE Energy Corp."},null,{"$f":"HLOOKUP('Utility Group'!$B20,stockprice,33,FALSE)","v":30.533333333333335},null,{"$f":"VLOOKUP('Utility Group'!$B20,vldatabase,4,FALSE)","v":1.64},null,5.3711790393013097E-2]
[19,{"$f":"VLOOKUP('Utility Group'!$B21,vldatabase,2,FALSE)","v":"Otter Tail Corp."},null,{"$f":"HLOOKUP('Utility Group'!$B21,stockprice,33,FALSE)","v":37.492333333333335},null,{"$f":"VLOOKUP('Utility Group'!$B21,vldatabase,4,FALSE)","v":1.54},null,4.1075064235354786E-2]
[20,{"$f":"VLOOKUP('Utility Group'!$B22,vldatabase,2,FALSE)","v":"PNM Resources"},null,{"$f":"HLOOKUP('Utility Group'!$B22,stockprice,33,FALSE)","v":41.949333333333335},null,{"$f":"VLOOKUP('Utility Group'!$B22,vldatabase,4,FALSE)","v":1.26},null,3.0036234187273535E-2]
[21,{"$f":"VLOOKUP('Utility Group'!$B23,vldatabase,2,FALSE)","v":"Sempra Energy"},null,{"$f":"HLOOKUP('Utility Group'!$B23,stockprice,33,FALSE)","v":120.32333333333335},null,{"$f":"VLOOKUP('Utility Group'!$B23,vldatabase,4,FALSE)","v":4.34},null,3.6069479458126705E-2]
[]
[null,"     Average",null,null,null,null,null,{"$f":"AVERAGE(H8:H28)","v":3.9886700548484741E-2}]
[]
[]
["(a)",{"$f":"'Stock Price (Utility)'!B37","v":"Average of closing prices for 30 trading days ended Oct. 2, 2020."}]
["(b)",{"$f":"'Electric Utility Data'!B49","v":"The Value Line Investment Survey, Summary & Index (Oct. 2, 2020)."}]
[null,null,null,null,null,null,null,{"$f":"MIN(H8:H28)","v":2.1837733507961671E-2}]
[null,null,null,null,null,null,null,{"$f":"MAX(H8:H28)","v":5.5251818560904421E-2}]

{"sheet":"6 (2)","index":15,"n_rows":35,"n_cols":12,"rows_kept":35,"cut":false,"hidden":false,"merged":[[5,3,5,8],[32,1,32,6],[33,1,33,6]]}
[{"$f":"'Exhibit List'!C6","v":"DCF MODEL - UTILITY GROUP"},null,null,null,null,null,null,null,null,null,null,{"$f":"'Exhibit List'!B6","v":"Exh. AMM-6"}]
[null,null,null,null,null,null,null,null,null,null,null,"Page 2 of 4"]
[{"$f":"'Exhibit List'!D6","v":"GROWTH RATES"}]
[]
[null,null,null,null,"(a)",null,"(b)",null,"(c)",null,"(d)"]
[null,null,null,"Earnings Growth",null,null,null,null,null,null,"br+sv"]
[null,"Company ",null,null,"Value Line",null,"IBES",null,"Zacks",null,"Growth"]
[{"$f":"A7+1","v":1},{"$f":"VLOOKUP('Utility Group'!$B3,vldatabase,2,FALSE)","v":"Algonquin Pwr & Util"},null,null,{"$f":"VLOOKUP('Utility Group'!$B3,vldatabase,19,FALSE)","v":"n/a"},null,{"$f":"VLOOKUP('Utility Group'!$B3,vldatabase,30,FALSE)","v":5.7000000000000002E-2},null,{"$f":"VLOOKUP('Utility Group'!$B3,vldatabase,31,FALSE)","v":7.8700000000000006E-2},null,{"$f":"'7'!Q8","v":"n/a"}]
[{"$f":"A8+1","v":2},{"$f":"VLOOKUP('Utility Group'!$B4,vldatabase,2,FALSE)","v":"ALLETE"},null,null,{"$f":"VLOOKUP('Utility Group'!$B4,vldatabase,19,FALSE)","v":4.4999999999999998E-2},null,{"$f":"VLOOKUP('Utility Group'!$B4,vldatabase,30,FALSE)","v":7.0000000000000007E-2},null,{"$f":"VLOOKUP('Utility Group'!$B4,vldatabase,31,FALSE)","v":"n/a"},null,{"$f":"'7'!Q9","v":3.151042728722029E-2}]
[3,{"$f":"VLOOKUP('Utility Group'!$B5,vldatabase,2,FALSE)","v":"Ameren Corp."},null,null,{"$f":"VLOOKUP('Utility Group'!$B5,vldatabase,19,FALSE)","v":0.06},null,{"$f":"VLOOKUP('Utility Group'!$B5,vldatabase,30,FALSE)","v":0.06},null,{"$f":"VLOOKUP('Utility Group'!$B5,vldatabase,31,FALSE)","v":6.8900000000000003E-2},null,{"$f":"'7'!Q10","v":5.9621182085280403E-2}]
[4,{"$f":"VLOOKUP('Utility Group'!$B6,vldatabase,2,FALSE)","v":"Avangrid, Inc."},null,null,{"$f":"VLOOKUP('Utility Group'!$B6,vldatabase,19,FALSE)","v":0.04},null,{"$f":"VLOOKUP('Utility Group'!$B6,vldatabase,30,FALSE)","v":4.5999999999999999E-2},null,{"$f":"VLOOKUP('Utility Group'!$B6,vldatabase,31,FALSE)","v":5.3100000000000001E-2},null,{"$f":"'7'!Q11","v":1.3592694962171498E-2}]
[5,{"$f":"VLOOKUP('Utility Group'!$B7,vldatabase,2,FALSE)","v":"Avista Corp."},null,null,{"$f":"VLOOKUP('Utility Group'!$B7,vldatabase,19,FALSE)","v":0.01},null,{"$f":"VLOOKUP('Utility Group'!$B7,vldatabase,30,FALSE)","v":5.8000000000000003E-2},null,{"$f":"VLOOKUP('Utility Group'!$B7,vldatabase,31,FALSE)","v":5.1400000000000001E-2},null,{"$f":"'7'!Q12","v":3.0191947812657591E-2}]
[6,{"$f":"VLOOKUP('Utility Group'!$B8,vldatabase,2,FALSE)","v":"Black Hills Corp."},null,null,{"$f":"VLOOKUP('Utility Group'!$B8,vldatabase,19,FALSE)","v":3.5000000000000003E-2},null,{"$f":"VLOOKUP('Utility Group'!$B8,vldatabase,30,FALSE)","v":4.6899999999999997E-2},null,{"$f":"VLOOKUP('Utility Group'!$B8,vldatabase,31,FALSE)","v":5.7599999999999998E-2},null,{"$f":"'7'!Q13","v":3.8134783198695975E-2}]
[7,{"$f":"VLOOKUP('Utility Group'!$B9,vldatabase,2,FALSE)","v":"CenterPoint Energy"},null,null,{"$f":"VLOOKUP('Utility Group'!$B9,vldatabase,19,FALSE)","v":0.04},null,{"$f":"VLOOKUP('Utility Group'!$B9,vldatabase,30,FALSE)","v":-6.6500000000000004E-2},null,{"$f":"VLOOKUP('Utility Group'!$B9,vldatabase,31,FALSE)","v":0.05},null,{"$f":"'7'!Q14","v":7.4831748332976303E-2}]
[8,{"$f":"VLOOKUP('Utility Group'!$B10,vldatabase,2,FALSE)","v":"CMS Energy Corp."},null,null,{"$f":"VLOOKUP('Utility Group'!$B10,vldatabase,19,FALSE)","v":7.4999999999999997E-2},null,{"$f":"VLOOKUP('Utility Group'!$B10,vldatabase,30,FALSE)","v":7.0800000000000002E-2},null,{"$f":"VLOOKUP('Utility Group'!$B10,vldatabase,31,FALSE)","v":7.0099999999999996E-2},null,{"$f":"'7'!Q15","v":7.2438239194221959E-2}]
[9,{"$f":"VLOOKUP('Utility Group'!$B11,vldatabase,2,FALSE)","v":"DTE Energy Co."},null,null,{"$f":"VLOOKUP('Utility Group'!$B11,vldatabase,19,FALSE)","v":0.06},null,{"$f":"VLOOKUP('Utility Group'!$B11,vldatabase,30,FALSE)","v":5.9499999999999997E-2},null,{"$f":"VLOOKUP('Utility Group'!$B11,vldatabase,31,FALSE)","v":5.67E-2},null,{"$f":"'7'!Q16","v":5.293953456022106E-2}]
[10,{"$f":"VLOOKUP('Utility Group'!$B12,vldatabase,2,FALSE)","v":"Edison International"},null,null,{"$f":"VLOOKUP('Utility Group'!$B12,vldatabase,19,FALSE)","v":"n/a"},null,{"$f":"VLOOKUP('Utility Group'!$B12,vldatabase,30,FALSE)","v":1.4E-2},null,{"$f":"VLOOKUP('Utility Group'!$B12,vldatabase,31,FALSE)","v":2.8899999999999999E-2},null,{"$f":"'7'!Q17","v":5.602852331695217E-2}]
[11,{"$f":"VLOOKUP('Utility Group'!$B13,vldatabase,2,FALSE)","v":"Emera Inc."},null,null,{"$f":"VLOOKUP('Utility Group'!$B13,vldatabase,19,FALSE)","v":0.06},null,{"$f":"VLOOKUP('Utility Group'!$B13,vldatabase,30,FALSE)","v":5.74E-2},null,{"$f":"VLOOKUP('Utility Group'!$B13,vldatabase,31,FALSE)","v":"n/a"},null,{"$f":"'7'!Q18","v":3.7859415091167387E-2}]
[12,{"$f":"VLOOKUP('Utility Group'!$B14,vldatabase,2,FALSE)","v":"Entergy Corp."},null,null,{"$f":"VLOOKUP('Utility Group'!$B14,vldatabase,19,FALSE)","v":0.03},null,{"$f":"VLOOKUP('Utility Group'!$B14,vldatabase,30,FALSE)","v":5.3999999999999999E-2},null,{"$f":"VLOOKUP('Utility Group'!$B14,vldatabase,31,FALSE)","v":5.4300000000000001E-2},null,{"$f":"'7'!Q19","v":4.9052378422720977E-2}]
[13,{"$f":"VLOOKUP('Utility Group'!$B15,vldatabase,2,FALSE)","v":"Exelon Corp."},null,null,{"$f":"VLOOKUP('Utility Group'!$B15,vldatabase,19,FALSE)","v":0.05},null,{"$f":"VLOOKUP('Utility Group'!$B15,vldatabase,30,FALSE)","v":-3.4799999999999998E-2},null,{"$f":"VLOOKUP('Utility Group'!$B15,vldatabase,31,FALSE)","v":0.04},null,{"$f":"'7'!Q20","v":4.1465791008928859E-2}]
[14,{"$f":"VLOOKUP('Utility Group'!$B16,vldatabase,2,FALSE)","v":"FirstEnergy Corp."},null,null,{"$f":"VLOOKUP('Utility Group'!$B16,vldatabase,19,FALSE)","v":8.5000000000000006E-2},null,{"$f":"VLOOKUP('Utility Group'!$B16,vldatabase,30,FALSE)","v":-2.4E-2},null,{"$f":"VLOOKUP('Utility Group'!$B16,vldatabase,31,FALSE)","v":"n/a"},null,{"$f":"'7'!Q21","v":8.9738189600942375E-2}]
[15,{"$f":"VLOOKUP('Utility Group'!$B17,vldatabase,2,FALSE)","v":"Hawaiian Elec."},null,null,{"$f":"VLOOKUP('Utility Group'!$B17,vldatabase,19,FALSE)","v":1.4999999999999999E-2},null,{"$f":"VLOOKUP('Utility Group'!$B17,vldatabase,30,FALSE)","v":3.3000000000000002E-2},null,{"$f":"VLOOKUP('Utility Group'!$B17,vldatabase,31,FALSE)","v":1.67E-2},null,{"$f":"'7'!Q22","v":2.8872297435938839E-2}]
[16,{"$f":"VLOOKUP('Utility Group'!$B18,vldatabase,2,FALSE)","v":"IDACORP, Inc."},null,null,{"$f":"VLOOKUP('Utility Group'!$B18,vldatabase,19,FALSE)","v":3.5000000000000003E-2},null,{"$f":"VLOOKUP('Utility Group'!$B18,vldatabase,30,FALSE)","v":2.5999999999999999E-2},null,{"$f":"VLOOKUP('Utility Group'!$B18,vldatabase,31,FALSE)","v":2.63E-2},null,{"$f":"'7'!Q23","v":3.4126203397138122E-2}]
[17,{"$f":"VLOOKUP('Utility Group'!$B19,vldatabase,2,FALSE)","v":"NorthWestern Corp."},null,null,{"$f":"VLOOKUP('Utility Group'!$B19,vldatabase,19,FALSE)","v":1.4999999999999999E-2},null,{"$f":"VLOOKUP('Utility Group'!$B19,vldatabase,30,FALSE)","v":3.7999999999999999E-2},null,{"$f":"VLOOKUP('Utility Group'!$B19,vldatabase,31,FALSE)","v":3.39E-2},null,{"$f":"'7'!Q24","v":2.7451939360299465E-2}]
[18,{"$f":"VLOOKUP('Utility Group'!$B20,vldatabase,2,FALSE)","v":"OGE Energy Corp."},null,null,{"$f":"VLOOKUP('Utility Group'!$B20,vldatabase,19,FALSE)","v":0.03},null,{"$f":"VLOOKUP('Utility Group'!$B20,vldatabase,30,FALSE)","v":2.4E-2},null,{"$f":"VLOOKUP('Utility Group'!$B20,vldatabase,31,FALSE)","v":3.6900000000000002E-2},null,{"$f":"'7'!Q25","v":2.6677242575172792E-2}]
[19,{"$f":"VLOOKUP('Utility Group'!$B21,vldatabase,2,FALSE)","v":"Otter Tail Corp."},null,null,{"$f":"VLOOKUP('Utility Group'!$B21,vldatabase,19,FALSE)","v":0.05},null,{"$f":"VLOOKUP('Utility Group'!$B21,vldatabase,30,FALSE)","v":0.09},null,{"$f":"VLOOKUP('Utility Group'!$B21,vldatabase,31,FALSE)","v":"n/a"},null,{"$f":"'7'!Q26","v":5.3111205290994196E-2}]
[20,{"$f":"VLOOKUP('Utility Group'!$B22,vldatabase,2,FALSE)","v":"PNM Resources"},null,null,{"$f":"VLOOKUP('Utility Group'!$B22,vldatabase,19,FALSE)","v":0.06},null,{"$f":"VLOOKUP('Utility Group'!$B22,vldatabase,30,FALSE)","v":4.9500000000000002E-2},null,{"$f":"VLOOKUP('Utility Group'!$B22,vldatabase,31,FALSE)","v":4.87E-2},null,{"$f":"'7'!Q27","v":6.0486059372149514E-2}]
[21,{"$f":"VLOOKUP('Utility Group'!$B23,vldatabase,2,FALSE)","v":"Sempra Energy"},null,null,{"$f":"VLOOKUP('Utility Group'!$B23,vldatabase,19,FALSE)","v":0.1},null,{"$f":"VLOOKUP('Utility Group'!$B23,vldatabase,30,FALSE)","v":6.2700000000000006E-2},null,{"$f":"VLOOKUP('Utility Group'!$B23,vldatabase,31,FALSE)","v":7.3599999999999999E-2},null,{"$f":"'7'!Q28","v":7.3013393471566809E-2}]
[]
[]
[]
["(a)",{"$f":"'Proxy Group Risk Measures'!B35","v":"The Value Line Investment Survey (Jul. 24, Aug. 14 and Sep. 11, 2020)."}]
["(b)",{"$f":"'Electric Utility Data'!B53","v":"www.finance.yahoo.com (retreived Oct. 5, 2020)."}]
["(c)",{"$f":"'Electric Utility Data'!B54","v":"www.zacks.com (retrieved Oct. 5, 2020)."}]
["(d)",{"$f":"\"See \" & 'Exhibit List'!B9 &\".\"","v":"See Exh. AMM-7."}]

{"sheet":"6 (3)","index":16,"n_rows":43,"n_cols":20,"rows_kept":43,"cut":false,"hidden":false,"merged":[[5,3,5,9]]}
[{"$f":"'Exhibit List'!C7","v":"DCF MODEL - UTILITY GROUP"},null,null,null,null,null,null,null,null,null,null,null,{"$f":"'Exhibit List'!B7","v":"Exh. AMM-6"}]
[null,null,null,null,null,null,null,null,null,null,null,null,"Page 3 of 4"]
[{"$f":"'Exhibit List'!D7","v":"DCF COST OF EQUITY ESTIMATES"}]
[]
[null,null,null,null,"(a)",null,"(a)",null,"(a)",null,null,"(a)"]
[null,null,null,"Earnings Growth",null,null,null,null,null,null,null,"br+sv"]
[null,"Company ",null,null,"Value Line",null,"IBES",null,"Zacks",null,null,"Growth"]
[]
[{"$f":"A7+1","v":1},{"$f":"VLOOKUP('Utility Group'!$B3,vldatabase,2,FALSE)","v":"Algonquin Pwr & Util"},null,null,{"$f":"IF('6 (2)'!E8=\"n/a\",\"n/a\",'6 (1)'!$H8+'6 (2)'!E8)","v":"n/a"},null,{"$f":"IF('6 (2)'!G8=\"n/a\",\"n/a\",'6 (1)'!$H8+'6 (2)'!G8)","v":0.10108941143006139},null,{"$f":"IF('6 (2)'!I8=\"n/a\",\"n/a\",'6 (1)'!$H8+'6 (2)'!I8)","v":0.12278941143006139},null,null,{"$f":"IF('6 (2)'!K8=\"n/a\",\"n/a\",'6 (1)'!$H8+'6 (2)'!K8)","v":"n/a"},null,null,null,{"$f":"IF(E9=\"n/a\",\"n/a\",IF(E9<$E$42,\"nmf\",IF(E9>$E$43,\"nmf\",E9)))","v":"n/a"},{"$f":"IF(G9=\"n/a\",\"n/a\",IF(G9<$E$42,\"nmf\",IF(G9>$E$43,\"nmf\",G9)))","v":0.10108941143006139},{"$f":"IF(I9=\"n/a\",\"n/a\",IF(I9<$E$42,\"nmf\",IF(I9>$E$43,\"nmf\",I9)))","v":0.12278941143006139},null,{"$f":"IF(L9=\"n/a\",\"n/a\",IF(L9<$E$42,\"nmf\",IF(L9>$E$43,\"nmf\",L9)))","v":"n/a"}]
[{"$f":"A9+1","v":2},{"$f":"VLOOKUP('Utility Group'!$B4,vldatabase,2,FALSE)","v":"ALLETE"},null,null,{"$f":"IF('6 (2)'!E9=\"n/a\",\"n/a\",'6 (1)'!$H9+'6 (2)'!E9)","v":9.3386790722386315E-2},null,{"$f":"IF('6 (2)'!G9=\"n/a\",\"n/a\",'6 (1)'!$H9+'6 (2)'!G9)","v":0.11838679072238632},null,{"$f":"IF('6 (2)'!I9=\"n/a\",\"n/a\",'6 (1)'!$H9+'6 (2)'!I9)","v":"n/a"},null,null,{"$f":"IF('6 (2)'!K9=\"n/a\",\"n/a\",'6 (1)'!$H9+'6 (2)'!K9)","v":7.9897218009606613E-2},null,null,null,9.3386790722386315E-2,0.11838679072238632,"n/a",null,7.9897218009606613E-2]
[3,{"$f":"VLOOKUP('Utility Group'!$B5,vldatabase,2,FALSE)","v":"Ameren Corp."},null,null,{"$f":"IF('6 (2)'!E10=\"n/a\",\"n/a\",'6 (1)'!$H10+'6 (2)'!E10)","v":8.6557598920671941E-2},null,{"$f":"IF('6 (2)'!G10=\"n/a\",\"n/a\",'6 (1)'!$H10+'6 (2)'!G10)","v":8.6557598920671941E-2},null,{"$f":"IF('6 (2)'!I10=\"n/a\",\"n/a\",'6 (1)'!$H10+'6 (2)'!I10)","v":9.5457598920671946E-2},null,null,{"$f":"IF('6 (2)'!K10=\"n/a\",\"n/a\",'6 (1)'!$H10+'6 (2)'!K10)","v":8.6178781005952346E-2},null,null,null,8.6557598920671941E-2,8.6557598920671941E-2,9.5457598920671946E-2,null,8.6178781005952346E-2]
[4,{"$f":"VLOOKUP('Utility Group'!$B6,vldatabase,2,FALSE)","v":"Avangrid, Inc."},null,null,{"$f":"IF('6 (2)'!E11=\"n/a\",\"n/a\",'6 (1)'!$H11+'6 (2)'!E11)","v":7.5814578161246995E-2},null,{"$f":"IF('6 (2)'!G11=\"n/a\",\"n/a\",'6 (1)'!$H11+'6 (2)'!G11)","v":8.1814578161246987E-2},null,{"$f":"IF('6 (2)'!I11=\"n/a\",\"n/a\",'6 (1)'!$H11+'6 (2)'!I11)","v":8.8914578161246996E-2},null,null,{"$f":"IF('6 (2)'!K11=\"n/a\",\"n/a\",'6 (1)'!$H11+'6 (2)'!K11)","v":4.9407273123418492E-2},null,null,null,7.5814578161246995E-2,8.1814578161246987E-2,8.8914578161246996E-2,null,"nmf"]
[5,{"$f":"VLOOKUP('Utility Group'!$B7,vldatabase,2,FALSE)","v":"Avista Corp."},null,null,{"$f":"IF('6 (2)'!E12=\"n/a\",\"n/a\",'6 (1)'!$H12+'6 (2)'!E12)","v":5.6399336074540729E-2},null,{"$f":"IF('6 (2)'!G12=\"n/a\",\"n/a\",'6 (1)'!$H12+'6 (2)'!G12)","v":0.10439933607454073},null,{"$f":"IF('6 (2)'!I12=\"n/a\",\"n/a\",'6 (1)'!$H12+'6 (2)'!I12)","v":9.7799336074540721E-2},null,null,{"$f":"IF('6 (2)'!K12=\"n/a\",\"n/a\",'6 (1)'!$H12+'6 (2)'!K12)","v":7.6591283887198325E-2},null,null,null,"nmf",0.10439933607454073,9.7799336074540721E-2,null,7.6591283887198325E-2]
[6,{"$f":"VLOOKUP('Utility Group'!$B8,vldatabase,2,FALSE)","v":"Black Hills Corp."},null,null,{"$f":"IF('6 (2)'!E13=\"n/a\",\"n/a\",'6 (1)'!$H13+'6 (2)'!E13)","v":7.5771054379688813E-2},null,{"$f":"IF('6 (2)'!G13=\"n/a\",\"n/a\",'6 (1)'!$H13+'6 (2)'!G13)","v":8.7671054379688806E-2},null,{"$f":"IF('6 (2)'!I13=\"n/a\",\"n/a\",'6 (1)'!$H13+'6 (2)'!I13)","v":9.8371054379688821E-2},null,null,{"$f":"IF('6 (2)'!K13=\"n/a\",\"n/a\",'6 (1)'!$H13+'6 (2)'!K13)","v":7.8905837578384791E-2},null,null,null,7.5771054379688813E-2,8.7671054379688806E-2,9.8371054379688821E-2,null,7.8905837578384791E-2]
[7,{"$f":"VLOOKUP('Utility Group'!$B9,vldatabase,2,FALSE)","v":"CenterPoint Energy"},null,null,{"$f":"IF('6 (2)'!E14=\"n/a\",\"n/a\",'6 (1)'!$H14+'6 (2)'!E14)","v":7.2281205164992826E-2},null,{"$f":"IF('6 (2)'!G14=\"n/a\",\"n/a\",'6 (1)'!$H14+'6 (2)'!G14)","v":-3.4218794835007178E-2},null,{"$f":"IF('6 (2)'!I14=\"n/a\",\"n/a\",'6 (1)'!$H14+'6 (2)'!I14)","v":8.2281205164992821E-2},null,null,{"$f":"IF('6 (2)'!K14=\"n/a\",\"n/a\",'6 (1)'!$H14+'6 (2)'!K14)","v":0.10711295349796912},null,null,null,7.2281205164992826E-2,"nmf",8.2281205164992821E-2,null,0.10711295349796912]
[8,{"$f":"VLOOKUP('Utility Group'!$B10,vldatabase,2,FALSE)","v":"CMS Energy Corp."},null,null,{"$f":"IF('6 (2)'!E15=\"n/a\",\"n/a\",'6 (1)'!$H15+'6 (2)'!E15)","v":0.1030958874850073},null,{"$f":"IF('6 (2)'!G15=\"n/a\",\"n/a\",'6 (1)'!$H15+'6 (2)'!G15)","v":9.88958874850073E-2},null,{"$f":"IF('6 (2)'!I15=\"n/a\",\"n/a\",'6 (1)'!$H15+'6 (2)'!I15)","v":9.8195887485007294E-2},null,null,{"$f":"IF('6 (2)'!K15=\"n/a\",\"n/a\",'6 (1)'!$H15+'6 (2)'!K15)","v":0.10053412667922926},null,null,null,0.1030958874850073,9.88958874850073E-2,9.8195887485007294E-2,null,0.10053412667922926]
[9,{"$f":"VLOOKUP('Utility Group'!$B11,vldatabase,2,FALSE)","v":"DTE Energy Co."},null,null,{"$f":"IF('6 (2)'!E16=\"n/a\",\"n/a\",'6 (1)'!$H16+'6 (2)'!E16)","v":9.7284582739128198E-2},null,{"$f":"IF('6 (2)'!G16=\"n/a\",\"n/a\",'6 (1)'!$H16+'6 (2)'!G16)","v":9.6784582739128197E-2},null,{"$f":"IF('6 (2)'!I16=\"n/a\",\"n/a\",'6 (1)'!$H16+'6 (2)'!I16)","v":9.39845827391282E-2},null,null,{"$f":"IF('6 (2)'!K16=\"n/a\",\"n/a\",'6 (1)'!$H16+'6 (2)'!K16)","v":9.022411729934926E-2},null,null,null,9.7284582739128198E-2,9.6784582739128197E-2,9.39845827391282E-2,null,9.022411729934926E-2]
[10,{"$f":"VLOOKUP('Utility Group'!$B12,vldatabase,2,FALSE)","v":"Edison International"},null,null,{"$f":"IF('6 (2)'!E17=\"n/a\",\"n/a\",'6 (1)'!$H17+'6 (2)'!E17)","v":"n/a"},null,{"$f":"IF('6 (2)'!G17=\"n/a\",\"n/a\",'6 (1)'!$H17+'6 (2)'!G17)","v":6.4515517330708261E-2},null,{"$f":"IF('6 (2)'!I17=\"n/a\",\"n/a\",'6 (1)'!$H17+'6 (2)'!I17)","v":7.9415517330708257E-2},null,null,{"$f":"IF('6 (2)'!K17=\"n/a\",\"n/a\",'6 (1)'!$H17+'6 (2)'!K17)","v":0.10654404064766043},null,null,null,"n/a",6.4515517330708261E-2,7.9415517330708257E-2,null,0.10654404064766043]
[11,{"$f":"VLOOKUP('Utility Group'!$B13,vldatabase,2,FALSE)","v":"Emera Inc."},null,null,{"$f":"IF('6 (2)'!E18=\"n/a\",\"n/a\",'6 (1)'!$H18+'6 (2)'!E18)","v":0.10527757917039751},null,{"$f":"IF('6 (2)'!G18=\"n/a\",\"n/a\",'6 (1)'!$H18+'6 (2)'!G18)","v":0.10267757917039752},null,{"$f":"IF('6 (2)'!I18=\"n/a\",\"n/a\",'6 (1)'!$H18+'6 (2)'!I18)","v":"n/a"},null,null,{"$f":"IF('6 (2)'!K18=\"n/a\",\"n/a\",'6 (1)'!$H18+'6 (2)'!K18)","v":8.31369942615649E-2},null,null,null,0.10527757917039751,0.10267757917039752,"n/a",null,8.31369942615649E-2]
[12,{"$f":"VLOOKUP('Utility Group'!$B14,vldatabase,2,FALSE)","v":"Entergy Corp."},null,null,{"$f":"IF('6 (2)'!E19=\"n/a\",\"n/a\",'6 (1)'!$H19+'6 (2)'!E19)","v":6.8947594986009608E-2},null,{"$f":"IF('6 (2)'!G19=\"n/a\",\"n/a\",'6 (1)'!$H19+'6 (2)'!G19)","v":9.2947594986009602E-2},null,{"$f":"IF('6 (2)'!I19=\"n/a\",\"n/a\",'6 (1)'!$H19+'6 (2)'!I19)","v":9.324759498600961E-2},null,null,{"$f":"IF('6 (2)'!K19=\"n/a\",\"n/a\",'6 (1)'!$H19+'6 (2)'!K19)","v":8.7999973408730586E-2},null,null,null,6.8947594986009608E-2,9.2947594986009602E-2,9.324759498600961E-2,null,8.7999973408730586E-2]
[13,{"$f":"VLOOKUP('Utility Group'!$B15,vldatabase,2,FALSE)","v":"Exelon Corp."},null,null,{"$f":"IF('6 (2)'!E20=\"n/a\",\"n/a\",'6 (1)'!$H20+'6 (2)'!E20)","v":9.3370165745856354E-2},null,{"$f":"IF('6 (2)'!G20=\"n/a\",\"n/a\",'6 (1)'!$H20+'6 (2)'!G20)","v":8.5701657458563535E-3},null,{"$f":"IF('6 (2)'!I20=\"n/a\",\"n/a\",'6 (1)'!$H20+'6 (2)'!I20)","v":8.3370165745856345E-2},null,null,{"$f":"IF('6 (2)'!K20=\"n/a\",\"n/a\",'6 (1)'!$H20+'6 (2)'!K20)","v":8.4835956754785211E-2},null,null,null,9.3370165745856354E-2,"nmf",8.3370165745856345E-2,null,8.4835956754785211E-2]
[14,{"$f":"VLOOKUP('Utility Group'!$B16,vldatabase,2,FALSE)","v":"FirstEnergy Corp."},null,null,{"$f":"IF('6 (2)'!E21=\"n/a\",\"n/a\",'6 (1)'!$H21+'6 (2)'!E21)","v":0.14025181856090443},null,{"$f":"IF('6 (2)'!G21=\"n/a\",\"n/a\",'6 (1)'!$H21+'6 (2)'!G21)","v":3.1251818560904421E-2},null,{"$f":"IF('6 (2)'!I21=\"n/a\",\"n/a\",'6 (1)'!$H21+'6 (2)'!I21)","v":"n/a"},null,null,{"$f":"IF('6 (2)'!K21=\"n/a\",\"n/a\",'6 (1)'!$H21+'6 (2)'!K21)","v":0.14499000816184679},null,null,null,0.14025181856090443,"nmf","n/a",null,"nmf"]
[15,{"$f":"VLOOKUP('Utility Group'!$B17,vldatabase,2,FALSE)","v":"Hawaiian Elec."},null,null,{"$f":"IF('6 (2)'!E22=\"n/a\",\"n/a\",'6 (1)'!$H22+'6 (2)'!E22)","v":3.683773350796167E-2},null,{"$f":"IF('6 (2)'!G22=\"n/a\",\"n/a\",'6 (1)'!$H22+'6 (2)'!G22)","v":5.4837733507961672E-2},null,{"$f":"IF('6 (2)'!I22=\"n/a\",\"n/a\",'6 (1)'!$H22+'6 (2)'!I22)","v":3.853773350796167E-2},null,null,{"$f":"IF('6 (2)'!K22=\"n/a\",\"n/a\",'6 (1)'!$H22+'6 (2)'!K22)","v":5.071003094390051E-2},null,null,null,"nmf","nmf","nmf",null,"nmf"]
[16,{"$f":"VLOOKUP('Utility Group'!$B18,vldatabase,2,FALSE)","v":"IDACORP, Inc."},null,null,{"$f":"IF('6 (2)'!E23=\"n/a\",\"n/a\",'6 (1)'!$H23+'6 (2)'!E23)","v":6.8435332758355866E-2},null,{"$f":"IF('6 (2)'!G23=\"n/a\",\"n/a\",'6 (1)'!$H23+'6 (2)'!G23)","v":5.9435332758355872E-2},null,{"$f":"IF('6 (2)'!I23=\"n/a\",\"n/a\",'6 (1)'!$H23+'6 (2)'!I23)","v":5.9735332758355866E-2},null,null,{"$f":"IF('6 (2)'!K23=\"n/a\",\"n/a\",'6 (1)'!$H23+'6 (2)'!K23)","v":6.7561536155493984E-2},null,null,null,6.8435332758355866E-2,"nmf","nmf",null,6.7561536155493984E-2]
[17,{"$f":"VLOOKUP('Utility Group'!$B19,vldatabase,2,FALSE)","v":"NorthWestern Corp."},null,null,{"$f":"IF('6 (2)'!E24=\"n/a\",\"n/a\",'6 (1)'!$H24+'6 (2)'!E24)","v":6.3411956106493139E-2},null,{"$f":"IF('6 (2)'!G24=\"n/a\",\"n/a\",'6 (1)'!$H24+'6 (2)'!G24)","v":8.6411956106493132E-2},null,{"$f":"IF('6 (2)'!I24=\"n/a\",\"n/a\",'6 (1)'!$H24+'6 (2)'!I24)","v":8.2311956106493139E-2},null,null,{"$f":"IF('6 (2)'!K24=\"n/a\",\"n/a\",'6 (1)'!$H24+'6 (2)'!K24)","v":7.5863895466792591E-2},null,null,null,"nmf",8.6411956106493132E-2,8.2311956106493139E-2,null,7.5863895466792591E-2]
[18,{"$f":"VLOOKUP('Utility Group'!$B20,vldatabase,2,FALSE)","v":"OGE Energy Corp."},null,null,{"$f":"IF('6 (2)'!E25=\"n/a\",\"n/a\",'6 (1)'!$H25+'6 (2)'!E25)","v":8.3711790393013102E-2},null,{"$f":"IF('6 (2)'!G25=\"n/a\",\"n/a\",'6 (1)'!$H25+'6 (2)'!G25)","v":7.7711790393013097E-2},null,{"$f":"IF('6 (2)'!I25=\"n/a\",\"n/a\",'6 (1)'!$H25+'6 (2)'!I25)","v":9.0611790393013092E-2},null,null,{"$f":"IF('6 (2)'!K25=\"n/a\",\"n/a\",'6 (1)'!$H25+'6 (2)'!K25)","v":8.0389032968185892E-2},null,null,null,8.3711790393013102E-2,7.7711790393013097E-2,9.0611790393013092E-2,null,8.0389032968185892E-2]
[19,{"$f":"VLOOKUP('Utility Group'!$B21,vldatabase,2,FALSE)","v":"Otter Tail Corp."},null,null,{"$f":"IF('6 (2)'!E26=\"n/a\",\"n/a\",'6 (1)'!$H26+'6 (2)'!E26)","v":9.1075064235354788E-2},null,{"$f":"IF('6 (2)'!G26=\"n/a\",\"n/a\",'6 (1)'!$H26+'6 (2)'!G26)","v":0.13107506423535478},null,{"$f":"IF('6 (2)'!I26=\"n/a\",\"n/a\",'6 (1)'!$H26+'6 (2)'!I26)","v":"n/a"},null,null,{"$f":"IF('6 (2)'!K26=\"n/a\",\"n/a\",'6 (1)'!$H26+'6 (2)'!K26)","v":9.4186269526348981E-2},null,null,null,9.1075064235354788E-2,0.13107506423535478,"n/a",null,9.4186269526348981E-2]
[20,{"$f":"VLOOKUP('Utility Group'!$B22,vldatabase,2,FALSE)","v":"PNM Resources"},null,null,{"$f":"IF('6 (2)'!E27=\"n/a\",\"n/a\",'6 (1)'!$H27+'6 (2)'!E27)","v":9.0036234187273537E-2},null,{"$f":"IF('6 (2)'!G27=\"n/a\",\"n/a\",'6 (1)'!$H27+'6 (2)'!G27)","v":7.9536234187273541E-2},null,{"$f":"IF('6 (2)'!I27=\"n/a\",\"n/a\",'6 (1)'!$H27+'6 (2)'!I27)","v":7.8736234187273532E-2},null,null,{"$f":"IF('6 (2)'!K27=\"n/a\",\"n/a\",'6 (1)'!$H27+'6 (2)'!K27)","v":9.0522293559423053E-2},null,null,null,9.0036234187273537E-2,7.9536234187273541E-2,7.8736234187273532E-2,null,9.0522293559423053E-2]
[21,{"$f":"VLOOKUP('Utility Group'!$B23,vldatabase,2,FALSE)","v":"Sempra Energy"},null,null,{"$f":"IF('6 (2)'!E28=\"n/a\",\"n/a\",'6 (1)'!$H28+'6 (2)'!E28)","v":0.1360694794581267},null,{"$f":"IF('6 (2)'!G28=\"n/a\",\"n/a\",'6 (1)'!$H28+'6 (2)'!G28)","v":9.876947945812671E-2},null,{"$f":"IF('6 (2)'!I28=\"n/a\",\"n/a\",'6 (1)'!$H28+'6 (2)'!I28)","v":0.1096694794581267},null,null,{"$f":"IF('6 (2)'!K28=\"n/a\",\"n/a\",'6 (1)'!$H28+'6 (2)'!K28)","v":0.10908287292969351},null,null,null,0.1360694794581267,9.876947945812671E-2,0.1096694794581267,null,0.10908287292969351]
[]
[null,"Average  (b)",null,null,{"$f":"P33","v":9.2585422316775898E-2},null,{"$f":"Q33","v":9.4327778486256772E-2},null,{"$f":"R33","v":9.3010426170854602E-2},null,null,{"$f":"T33","v":8.8209834331551079E-2},null,null,"Max",{"$f":"MAX(P9:P29)","v":0.14025181856090443},{"$f":"MAX(Q9:Q29)","v":0.13107506423535478},{"$f":"MAX(R9:R29)","v":0.12278941143006139},null,{"$f":"MAX(T9:T29)","v":0.10908287292969351}]
[null,"Midpoint (b,c)",null,null,{"$f":"AVERAGE(P31:P32)","v":0.10434357565963015},null,{"$f":"AVERAGE(Q31:Q32)","v":9.7795290783031522E-2},null,{"$f":"AVERAGE(R31:R32)","v":0.10076282280866747},null,null,{"$f":"AVERAGE(T31:T32)","v":8.8322204542593749E-2},null,null,"Min",{"$f":"MIN(P9:P29)","v":6.8435332758355866E-2},{"$f":"MIN(Q9:Q29)","v":6.4515517330708261E-2},{"$f":"MIN(R9:R29)","v":7.8736234187273532E-2},null,{"$f":"MIN(T9:T29)","v":6.7561536155493984E-2}]
[null,null,null,null,null,null,null,null,null,null,null,null,null,null,"Average",{"$f":"AVERAGE(P9:P29)","v":9.2585422316775898E-2},{"$f":"AVERAGE(Q9:Q29)","v":9.4327778486256772E-2},{"$f":"AVERAGE(R9:R29)","v":9.3010426170854602E-2},null,{"$f":"AVERAGE(T9:T29)","v":8.8209834331551079E-2}]
[]
["(a)",{"$f":"\"Sum of dividend yield (\" & M1 & \", p. 1) and respective growth rate (\" & M1 & \", p. 2).\"","v":"Sum of dividend yield (Exh. AMM-6, p. 1) and respective growth rate (Exh. AMM-6, p. 2)."}]
["(b)","Excludes highlighted figures."]
["(c)","Average of low and high values."]
[]
[]
[]
[]
[null,"Min",null,null,6.4000000000000001E-2]
[null,"Max",null,null,0.14099999999999999]

{"sheet":"6 (4)","index":17,"n_rows":45,"n_cols":12,"rows_kept":45,"cut":false,"hidden":false,"merged":[[39,1,41,9],[44,1,45,9]]}
[{"$f":"'Exhibit List'!C8","v":"DCF MODEL - UTILITY GROUP"},null,null,null,null,null,null,null,null,{"$f":"'Exhibit List'!B8","v":"Exh. AMM-6"}]
[null,null,null,null,null,null,null,null,null,"Page 4 of 4"]
[{"$f":"'Exhibit List'!D8","v":"LOW-END THRESHOLD ADJUSTMENTS"}]
[]
[]
[null,"Atlantic Path 15 / Startrans / So. Cal Edison",null,null,null,null,"Pioneer Transmission"]
[null,null,null,"Baa Yield",null,null,null,"Baa Yield"]
[null,null,"2007-06-19",6.54E-2,null,null,"2008-04-14",6.8099999999999994E-2]
[null,null,"2007-07-19",6.4899999999999999E-2,null,null,"2008-05-14",6.7900000000000002E-2]
[null,null,"2007-08-18",6.5099999999999991E-2,null,null,"2008-06-13",6.93E-2]
[null,null,"2007-09-17",6.4500000000000002E-2,null,null,"2008-07-13",6.9699999999999998E-2]
[null,null,"2007-10-17",6.3600000000000004E-2,null,null,"2008-08-12",6.9800000000000001E-2]
[null,null,"2007-11-16",6.2699999999999992E-2,null,null,"2008-09-11",7.1500000000000008E-2]
[]
[null,null,null,null,null,null,"Current",null,"Projected"]
[null,"Historical Baa Bond Yield",null,null,null,null,{"$f":"I16","v":6.6875000000000004E-2},"(a)",{"$f":"AVERAGE(D8:D13,H8:H13)","v":6.6875000000000004E-2},"(a)"]
[null,"Current Baa Bond Yield",null,null,null,null,{"$f":"'Bond Yields'!C16","v":3.3700000000000001E-2},"(b)",{"$f":"'Bond Yields'!E39","v":4.7899999999999998E-2},"(c)"]
[null,null,"Change in Bond Yield",null,null,null,{"$f":"G17-G16","v":-3.3175000000000003E-2},null,{"$f":"I17-I16","v":-1.8975000000000006E-2}]
[]
[null,"Risk Premium/Interest Rate Relationship",null,null,null,null,{"$f":"'10 (4)'!B46","v":-0.42102669056778214},"(d)",{"$f":"G20","v":-0.42102669056778214},"(d)"]
[null,null,"Adjustment to Low-end Threshold",null,null,null,{"$f":"G20*G18","v":1.3967560459586173E-2},null,{"$f":"I20*I18","v":7.9889814535236692E-3}]
[]
[]
[null,"Current Baa Bond Yield",null,null,null,null,{"$f":"G17","v":3.3700000000000001E-2},null,{"$f":"I17","v":4.7899999999999998E-2}]
[null,"Original Threshold",null,null,null,null,0.01,null,0.01]
[null,"Adjustment",null,null,null,null,{"$f":"G21","v":1.3967560459586173E-2},null,{"$f":"I21","v":7.9889814535236692E-3}]
[null,"Adjusted Low-end Threshold",null,null,null,null,{"$f":"SUM(G24:G26)","v":5.7667560459586174E-2},null,{"$f":"SUM(I24:I26)","v":6.5888981453523676E-2},null,null,{"$f":"AVERAGE(G27:I27)","v":6.1778270956554929E-2}]
[]
[null,"Low-end Test -- FERC Opinion No. 569-A"]
[null,{"$f":"B17","v":"Current Baa Bond Yield"},null,null,null,null,{"$f":"G17","v":3.3700000000000001E-2}]
[]
[null,"CAPM Market Risk Premium (e)",null,null,null,null,{"$f":"'8'!I9","v":0.1017}]
[null,"Risk Premium Factor (f)",null,null,null,null,0.2]
[null,null,{"$f":"C21","v":"Adjustment to Low-end Threshold"},null,null,null,{"$f":"G32*G33","v":2.034E-2}]
[]
[null,{"$f":"B27","v":"Adjusted Low-end Threshold"},null,null,null,null,{"$f":"G30+G34","v":5.4040000000000005E-2}]
[]
["(a)","Average Baa utility bond yield for 6-mo. periods ending Nov. 2007 and Sep. 2008."]
["(b)",{"$f":"\"Average Baa utility bond yield for 6-months ended \"&'Bond Yields'!B14&\".\"","v":"Average Baa utility bond yield for 6-months ended Sep. 2020."}]
["(c)",{"$f":"\"Average Baa utility bond yield for 2021-25 based on data from \"&'Bond Yields'!B73& \"; \"&'Bond Yields'!B74&\", Moody's Investors Service at www.credittrends.com.\"","v":"Average Baa utility bond yield for 2021-25 based on data from IHS Markit, Long-Term Macro Forecast - Baseline (Jun. 29, 2020); Energy Information Administration, Annual Energy Outlook 2020 (Jan. 29, 2020), Moody's Investors Service at www.credittrends.com."}]
[]
[]
["(d)",{"$f":"'10 (4)'!I1&\", page 4.\"","v":"Exh. AMM-10, page 4."}]
["(e)",{"$f":"'8'!O1&\", page 1.\"","v":"Exh. AMM-8, page 1."}]
["(f)","171 FERC ¶ 61,154, Docket Nos. EL14-12-004 and EL15-45-013, Opinion No. 569-A, Order on Rehearing (issued May 21, 2020)."]

{"sheet":"7","index":18,"n_rows":37,"n_cols":34,"rows_kept":37,"cut":false,"hidden":false,"merged":[[5,31,5,33],[5,27,5,29],[5,2,5,4],[5,12,5,14],[5,19,5,21],[5,23,5,25]]}
[{"$f":"'Exhibit List'!$C$9","v":"DCF MODEL - UTILITY GROUP"},null,null,null,null,null,null,null,null,null,null,null,null,null,null,null,{"$f":"'Exhibit List'!$B$9","v":"Exh. AMM-7"},{"$f":"A1","v":"DCF MODEL - UTILITY GROUP"},null,null,null,null,null,null,null,null,null,null,null,null,null,null,null,{"$f":"Q1","v":"Exh. AMM-7"}]
[null,null,null,null,null,null,null,null,null,null,null,null,null,null,null,null,"Page 1 of 2",null,null,null,null,null,null,null,null,null,null,null,null,null,null,null,null,"Page 2 of 2"]
[{"$f":"'Exhibit List'!$D$9","v":"BR+SV GROWTH RATE"},null,null,null,null,null,null,null,null,null,null,null,null,null,null,null,null,{"$f":"A3","v":"BR+SV GROWTH RATE"}]
[]
[null,null,"(a)","(a)","(a)",null,null,null,"(b)","(c)",null,null,"(d)","(e)",null,null,null,null,null,"(a)","(a)","(f)",null,"(a)","(a)","(f)","(g)","(a)","(a)",null,"(h)","(a)","(a)","(g)"]
[null,null,2024,null,null,null,null,null,"Adjustment",null,null,null,"\"sv\" Factor",null,null,null,null,null,null,2019,null,null,null,2024,null,null,"Chg",2024,null,null,null,"Common Shares"]
[null,"Company                       ","EPS","DPS","BVPS",null,"   b   ","   r   ","Factor","Adjusted r","   br   ",null,"   s   ","   v   ","   sv   ",null,"br + sv",null,"Company                       ","Eq Ratio","Tot Cap","Com Eq",null,"Eq Ratio","Tot Cap","Com Eq","Equity","High","Low","Avg.","M/B",2019,2024,"Growth"]
[{"$f":"A7+1","v":1},{"$f":"VLOOKUP('Utility Group'!$B3,vldatabase,2,FALSE)","v":"Algonquin Pwr & Util"},{"$f":"VLOOKUP('Utility Group'!$B3,vldatabase,7,FALSE)","v":"n/a"},{"$f":"VLOOKUP('Utility Group'!$B3,vldatabase,8,FALSE)","v":"n/a"},{"$f":"VLOOKUP('Utility Group'!$B3,vldatabase,9,FALSE)","v":"n/a"},null,{"$f":"IF(E8=\"n/a\", \"n/a\",+(C8-D8)/C8)","v":"n/a"},{"$f":"IF(E8=\"n/a\",\"n/a\",C8/E8)","v":"n/a"},{"$f":"IF(AA8=\"n/a\",\"n/a\",2*(1+AA8)/(2+AA8))","v":"n/a"},{"$f":"IF(H8=\"n/a\",\"n/a\",H8*I8)","v":"n/a"},{"$f":"IF(G8=\"n/a\",\"n/a\",G8*J8)","v":"n/a"},null,{"$f":"IF(AE8=\"n/a\",\"n/a\",AE8*AH8)","v":"n/a"},{"$f":"IF(AE8=\"n/a\",\"n/a\",1-1/AE8)","v":"n/a"},{"$f":"IF(M8=\"n/a\",\"n/a\",M8*N8)","v":"n/a"},null,{"$f":"IF(K8=\"n/a\",\"n/a\",K8+O8)","v":"n/a"},{"$f":"A8","v":1},{"$f":"B8","v":"Algonquin Pwr & Util"},{"$f":"VLOOKUP('Utility Group'!$B3,vldatabase,14,FALSE)","v":"n/a"},{"$f":"VLOOKUP('Utility Group'!$B3,vldatabase,16,FALSE)","v":"n/a"},{"$f":"IF(U8=\"n/a\",\"n/a\",T8*U8)","v":"n/a"},null,{"$f":"VLOOKUP('Utility Group'!$B3,vldatabase,15,FALSE)","v":"n/a"},{"$f":"VLOOKUP('Utility Group'!$B3,vldatabase,17,FALSE)","v":"n/a"},{"$f":"IF(Y8=\"n/a\",\"n/a\",X8*Y8)","v":"n/a"},{"$f":"IF(V8=\"n/a\",\"n/a\",(+Z8/V8)^(1/5)-1)","v":"n/a"},{"$f":"VLOOKUP('Utility Group'!$B3,vldatabase,5,FALSE)","v":"n/a"},{"$f":"VLOOKUP('Utility Group'!$B3,vldatabase,6,FALSE)","v":"n/a"},{"$f":"IF(AB8=\"n/a\",\"n/a\",AVERAGE(AB8:AC8))","v":"n/a"},{"$f":"IF(AD8=\"n/a\",\"n/a\",AD8/E8)","v":"n/a"},{"$f":"VLOOKUP('Utility Group'!$B3,vldatabase,10,FALSE)","v":"n/a"},{"$f":"VLOOKUP('Utility Group'!$B3,vldatabase,11,FALSE)","v":"n/a"},{"$f":"IF(AF8=\"n/a\",\"n/a\",(+AG8/AF8)^(1/5)-1)","v":"n/a"}]
[{"$f":"A8+1","v":2},{"$f":"VLOOKUP('Utility Group'!$B4,vldatabase,2,FALSE)","v":"ALLETE"},{"$f":"VLOOKUP('Utility Group'!$B4,vldatabase,7,FALSE)","v":4.25},{"$f":"VLOOKUP('Utility Group'!$B4,vldatabase,8,FALSE)","v":2.9},{"$f":"VLOOKUP('Utility Group'!$B4,vldatabase,9,FALSE)","v":51.75},null,{"$f":"IF(E9=\"n/a\", \"n/a\",+(C9-D9)/C9)","v":0.31764705882352945},{"$f":"IF(E9=\"n/a\",\"n/a\",C9/E9)","v":8.2125603864734303E-2},{"$f":"IF(AA9=\"n/a\",\"n/a\",2*(1+AA9)/(2+AA9))","v":1.0233475444905209},{"$f":"IF(H9=\"n/a\",\"n/a\",H9*I9)","v":8.4043035054777088E-2},{"$f":"IF(G9=\"n/a\",\"n/a\",G9*J9)","v":2.6696022899752724E-2},null,{"$f":"IF(AE9=\"n/a\",\"n/a\",AE9*AH9)","v":1.4489954952572283E-2},{"$f":"IF(AE9=\"n/a\",\"n/a\",1-1/AE9)","v":0.33225806451612905},{"$f":"IF(M9=\"n/a\",\"n/a\",M9*N9)","v":4.8144043874675654E-3},null,{"$f":"IF(K9=\"n/a\",\"n/a\",K9+O9)","v":3.151042728722029E-2},{"$f":"A9","v":2},{"$f":"B9","v":"ALLETE"},{"$f":"VLOOKUP('Utility Group'!$B4,vldatabase,14,FALSE)","v":0.61399999999999999},{"$f":"VLOOKUP('Utility Group'!$B4,vldatabase,16,FALSE)","v":3632.8},{"$f":"IF(U9=\"n/a\",\"n/a\",T9*U9)","v":2230.5392000000002},null,{"$f":"VLOOKUP('Utility Group'!$B4,vldatabase,15,FALSE)","v":0.59},{"$f":"VLOOKUP('Utility Group'!$B4,vldatabase,17,FALSE)","v":4775},{"$f":"IF(Y9=\"n/a\",\"n/a\",X9*Y9)","v":2817.25},{"$f":"IF(V9=\"n/a\",\"n/a\",(+Z9/V9)^(1/5)-1)","v":4.7811366999208404E-2},{"$f":"VLOOKUP('Utility Group'!$B4,vldatabase,5,FALSE)","v":90},{"$f":"VLOOKUP('Utility Group'!$B4,vldatabase,6,FALSE)","v":65},{"$f":"IF(AB9=\"n/a\",\"n/a\",AVERAGE(AB9:AC9))","v":77.5},{"$f":"IF(AD9=\"n/a\",\"n/a\",AD9/E9)","v":1.4975845410628019},{"$f":"VLOOKUP('Utility Group'!$B4,vldatabase,10,FALSE)","v":51.7},{"$f":"VLOOKUP('Utility Group'!$B4,vldatabase,11,FALSE)","v":54.25},{"$f":"IF(AF9=\"n/a\",\"n/a\",(+AG9/AF9)^(1/5)-1)","v":9.675550565104718E-3}]
[3,{"$f":"VLOOKUP('Utility Group'!$B5,vldatabase,2,FALSE)","v":"Ameren Corp."},{"$f":"VLOOKUP('Utility Group'!$B5,vldatabase,7,FALSE)","v":4.5},{"$f":"VLOOKUP('Utility Group'!$B5,vldatabase,8,FALSE)","v":2.4500000000000002},{"$f":"VLOOKUP('Utility Group'!$B5,vldatabase,9,FALSE)","v":44.5},null,0.45555555555555549,0.10112359550561797,1.0397996372575538,0.10514827792492117,4.7900882165797416E-2,null,3.0347205148661297E-2,0.38620689655172413,1.1720299919482983E-2,null,5.9621182085280403E-2,3,"Ameren Corp.",{"$f":"VLOOKUP('Utility Group'!$B5,vldatabase,14,FALSE)","v":0.47099999999999997},{"$f":"VLOOKUP('Utility Group'!$B5,vldatabase,16,FALSE)","v":17116},8061.6359999999995,null,{"$f":"VLOOKUP('Utility Group'!$B5,vldatabase,15,FALSE)","v":0.49},{"$f":"VLOOKUP('Utility Group'!$B5,vldatabase,17,FALSE)","v":24500},12005,8.2898609085881425E-2,{"$f":"VLOOKUP('Utility Group'!$B5,vldatabase,5,FALSE)","v":85},{"$f":"VLOOKUP('Utility Group'!$B5,vldatabase,6,FALSE)","v":60},72.5,1.6292134831460674,{"$f":"VLOOKUP('Utility Group'!$B5,vldatabase,10,FALSE)","v":246.2},{"$f":"VLOOKUP('Utility Group'!$B5,vldatabase,11,FALSE)","v":270},1.8626905229178314E-2]
[4,{"$f":"VLOOKUP('Utility Group'!$B6,vldatabase,2,FALSE)","v":"Avangrid, Inc."},{"$f":"VLOOKUP('Utility Group'!$B6,vldatabase,7,FALSE)","v":2.5},{"$f":"VLOOKUP('Utility Group'!$B6,vldatabase,8,FALSE)","v":1.8},{"$f":"VLOOKUP('Utility Group'!$B6,vldatabase,9,FALSE)","v":51.75},null,0.27999999999999997,4.8309178743961352E-2,1.0048029927210287,4.8541207377827474E-2,1.3591538065791692E-2,null,-5.3154698531621136E-6,-0.21764705882352953,1.1568963798058724E-6,null,1.3592694962171498E-2,4,"Avangrid, Inc.",{"$f":"VLOOKUP('Utility Group'!$B6,vldatabase,14,FALSE)","v":0.69399999999999995},{"$f":"VLOOKUP('Utility Group'!$B6,vldatabase,16,FALSE)","v":21953},15235.382,null,{"$f":"VLOOKUP('Utility Group'!$B6,vldatabase,15,FALSE)","v":0.57499999999999996},{"$f":"VLOOKUP('Utility Group'!$B6,vldatabase,17,FALSE)","v":27800},15984.999999999998,9.6523455876555975E-3,{"$f":"VLOOKUP('Utility Group'!$B6,vldatabase,5,FALSE)","v":50},{"$f":"VLOOKUP('Utility Group'!$B6,vldatabase,6,FALSE)","v":35},42.5,0.82125603864734298,{"$f":"VLOOKUP('Utility Group'!$B6,vldatabase,10,FALSE)","v":309.01},{"$f":"VLOOKUP('Utility Group'!$B6,vldatabase,11,FALSE)","v":309},-6.4723662329679854E-6]
[5,{"$f":"VLOOKUP('Utility Group'!$B7,vldatabase,2,FALSE)","v":"Avista Corp."},{"$f":"VLOOKUP('Utility Group'!$B7,vldatabase,7,FALSE)","v":2.5},{"$f":"VLOOKUP('Utility Group'!$B7,vldatabase,8,FALSE)","v":1.9},{"$f":"VLOOKUP('Utility Group'!$B7,vldatabase,9,FALSE)","v":31.75},null,0.24000000000000005,7.874015748031496E-2,1.0181928137542391,8.017266250033378E-2,1.9241439000080112E-2,null,2.7706106634232178E-2,0.39523809523809517,1.0950508812577479E-2,null,3.0191947812657591E-2,5,"Avista Corp.",{"$f":"VLOOKUP('Utility Group'!$B7,vldatabase,14,FALSE)","v":0.50600000000000001},{"$f":"VLOOKUP('Utility Group'!$B7,vldatabase,16,FALSE)","v":3834.6},1940.3075999999999,null,{"$f":"VLOOKUP('Utility Group'!$B7,vldatabase,15,FALSE)","v":0.49},{"$f":"VLOOKUP('Utility Group'!$B7,vldatabase,17,FALSE)","v":4750},2327.5,3.7059850465761324E-2,{"$f":"VLOOKUP('Utility Group'!$B7,vldatabase,5,FALSE)","v":60},{"$f":"VLOOKUP('Utility Group'!$B7,vldatabase,6,FALSE)","v":45},52.5,1.6535433070866141,{"$f":"VLOOKUP('Utility Group'!$B7,vldatabase,10,FALSE)","v":67.180000000000007},{"$f":"VLOOKUP('Utility Group'!$B7,vldatabase,11,FALSE)","v":73},1.67555978216547E-2]
[6,{"$f":"VLOOKUP('Utility Group'!$B8,vldatabase,2,FALSE)","v":"Black Hills Corp."},{"$f":"VLOOKUP('Utility Group'!$B8,vldatabase,7,FALSE)","v":4.25},{"$f":"VLOOKUP('Utility Group'!$B8,vldatabase,8,FALSE)","v":2.75},{"$f":"VLOOKUP('Utility Group'!$B8,vldatabase,9,FALSE)","v":46.75},null,0.35294117647058826,9.0909090909090912E-2,1.023168899468563,9.30153544971421E-2,3.2828948646050155E-2,null,1.3372428547318729E-2,0.39677419354838706,5.3058345526458177E-3,null,3.8134783198695975E-2,6,"Black Hills Corp.",{"$f":"VLOOKUP('Utility Group'!$B8,vldatabase,14,FALSE)","v":0.42899999999999999},{"$f":"VLOOKUP('Utility Group'!$B8,vldatabase,16,FALSE)","v":5502.2},2360.4438,null,{"$f":"VLOOKUP('Utility Group'!$B8,vldatabase,15,FALSE)","v":0.48},{"$f":"VLOOKUP('Utility Group'!$B8,vldatabase,17,FALSE)","v":6200},2976,4.7436858748576061E-2,{"$f":"VLOOKUP('Utility Group'!$B8,vldatabase,5,FALSE)","v":90},{"$f":"VLOOKUP('Utility Group'!$B8,vldatabase,6,FALSE)","v":65},77.5,1.6577540106951871,{"$f":"VLOOKUP('Utility Group'!$B8,vldatabase,10,FALSE)","v":61.48},{"$f":"VLOOKUP('Utility Group'!$B8,vldatabase,11,FALSE)","v":64},8.0665939946729104E-3]
[7,{"$f":"VLOOKUP('Utility Group'!$B9,vldatabase,2,FALSE)","v":"CenterPoint Energy"},{"$f":"VLOOKUP('Utility Group'!$B9,vldatabase,7,FALSE)","v":1.6},{"$f":"VLOOKUP('Utility Group'!$B9,vldatabase,8,FALSE)","v":0.8},{"$f":"VLOOKUP('Utility Group'!$B9,vldatabase,9,FALSE)","v":15.25},null,0.5,0.10491803278688525,1.0384153881026108,0.10894849973535589,5.4474249867677946E-2,null,7.0029794720626343E-2,0.29069767441860461,2.0357498465298354E-2,null,7.4831748332976303E-2,7,"CenterPoint Energy",{"$f":"VLOOKUP('Utility Group'!$B9,vldatabase,14,FALSE)","v":0.29099999999999998},{"$f":"VLOOKUP('Utility Group'!$B9,vldatabase,16,FALSE)","v":22603},6577.473,null,{"$f":"VLOOKUP('Utility Group'!$B9,vldatabase,15,FALSE)","v":0.42},{"$f":"VLOOKUP('Utility Group'!$B9,vldatabase,17,FALSE)","v":23000},9660,7.9900172334933961E-2,{"$f":"VLOOKUP('Utility Group'!$B9,vldatabase,5,FALSE)","v":25},{"$f":"VLOOKUP('Utility Group'!$B9,vldatabase,6,FALSE)","v":18},21.5,1.4098360655737705,{"$f":"VLOOKUP('Utility Group'!$B9,vldatabase,10,FALSE)","v":502.24},{"$f":"VLOOKUP('Utility Group'!$B9,vldatabase,11,FALSE)","v":640},4.9672296255327986E-2]
[8,{"$f":"VLOOKUP('Utility Group'!$B10,vldatabase,2,FALSE)","v":"CMS Energy Corp."},{"$f":"VLOOKUP('Utility Group'!$B10,vldatabase,7,FALSE)","v":3.5},{"$f":"VLOOKUP('Utility Group'!$B10,vldatabase,8,FALSE)","v":2.15},{"$f":"VLOOKUP('Utility Group'!$B10,vldatabase,9,FALSE)","v":25.5},null,0.38571428571428573,0.13725490196078433,1.0428664939104344,0.14313853837986357,5.5210579089375947E-2,null,2.8349314096582048E-2,0.60769230769230764,1.7227660104846013E-2,null,7.2438239194221959E-2,8,"CMS Energy Corp.",{"$f":"VLOOKUP('Utility Group'!$B10,vldatabase,14,FALSE)","v":0.29399999999999998},{"$f":"VLOOKUP('Utility Group'!$B10,vldatabase,16,FALSE)","v":17082},5022.1079999999993,null,{"$f":"VLOOKUP('Utility Group'!$B10,vldatabase,15,FALSE)","v":0.32},{"$f":"VLOOKUP('Utility Group'!$B10,vldatabase,17,FALSE)","v":24100},7712,8.957265342338383E-2,{"$f":"VLOOKUP('Utility Group'!$B10,vldatabase,5,FALSE)","v":75},{"$f":"VLOOKUP('Utility Group'!$B10,vldatabase,6,FALSE)","v":55},65,2.5490196078431371,{"$f":"VLOOKUP('Utility Group'!$B10,vldatabase,10,FALSE)","v":283.86},{"$f":"VLOOKUP('Utility Group'!$B10,vldatabase,11,FALSE)","v":300},1.1121653991736036E-2]
[9,{"$f":"VLOOKUP('Utility Group'!$B11,vldatabase,2,FALSE)","v":"DTE Energy Co."},{"$f":"VLOOKUP('Utility Group'!$B11,vldatabase,7,FALSE)","v":8.5},{"$f":"VLOOKUP('Utility Group'!$B11,vldatabase,8,FALSE)","v":5.2},{"$f":"VLOOKUP('Utility Group'!$B11,vldatabase,9,FALSE)","v":79.25},null,0.38823529411764701,0.10725552050473186,1.032628276218682,0.11075508325373877,4.2999032322039756E-2,null,2.2908153306096836E-2,0.43392857142857144,9.9405022381813066E-3,null,5.293953456022106E-2,9,"DTE Energy Co.",{"$f":"VLOOKUP('Utility Group'!$B11,vldatabase,14,FALSE)","v":0.42299999999999999},{"$f":"VLOOKUP('Utility Group'!$B11,vldatabase,16,FALSE)","v":27607},11677.761,null,{"$f":"VLOOKUP('Utility Group'!$B11,vldatabase,15,FALSE)","v":0.41499999999999998},{"$f":"VLOOKUP('Utility Group'!$B11,vldatabase,17,FALSE)","v":39000},16185,6.7457576889145887E-2,{"$f":"VLOOKUP('Utility Group'!$B11,vldatabase,5,FALSE)","v":160},{"$f":"VLOOKUP('Utility Group'!$B11,vldatabase,6,FALSE)","v":120},140,1.7665615141955835,{"$f":"VLOOKUP('Utility Group'!$B11,vldatabase,10,FALSE)","v":192.21},{"$f":"VLOOKUP('Utility Group'!$B11,vldatabase,11,FALSE)","v":205},1.2967651067915531E-2]
[10,{"$f":"VLOOKUP('Utility Group'!$B12,vldatabase,2,FALSE)","v":"Edison International"},{"$f":"VLOOKUP('Utility Group'!$B12,vldatabase,7,FALSE)","v":5.25},{"$f":"VLOOKUP('Utility Group'!$B12,vldatabase,8,FALSE)","v":3},{"$f":"VLOOKUP('Utility Group'!$B12,vldatabase,9,FALSE)","v":46.5},null,0.42857142857142855,0.11290322580645161,1.0284923784743512,0.11612010724710416,4.9765760248758922E-2,null,1.495585210314805E-2,0.41874999999999996,6.2627630681932446E-3,null,5.602852331695217E-2,10,"Edison International",{"$f":"VLOOKUP('Utility Group'!$B12,vldatabase,14,FALSE)","v":0.39900000000000002},{"$f":"VLOOKUP('Utility Group'!$B12,vldatabase,16,FALSE)","v":33360},13310.640000000001,null,{"$f":"VLOOKUP('Utility Group'!$B12,vldatabase,15,FALSE)","v":0.375},{"$f":"VLOOKUP('Utility Group'!$B12,vldatabase,17,FALSE)","v":47200},17700,5.8656006073543487E-2,{"$f":"VLOOKUP('Utility Group'!$B12,vldatabase,5,FALSE)","v":95},{"$f":"VLOOKUP('Utility Group'!$B12,vldatabase,6,FALSE)","v":65},80,1.7204301075268817,{"$f":"VLOOKUP('Utility Group'!$B12,vldatabase,10,FALSE)","v":361.99},{"$f":"VLOOKUP('Utility Group'!$B12,vldatabase,11,FALSE)","v":378},8.693089034954804E-3]
[11,{"$f":"VLOOKUP('Utility Group'!$B13,vldatabase,2,FALSE)","v":"Emera Inc."},{"$f":"VLOOKUP('Utility Group'!$B13,vldatabase,7,FALSE)","v":4},{"$f":"VLOOKUP('Utility Group'!$B13,vldatabase,8,FALSE)","v":2.76},{"$f":"VLOOKUP('Utility Group'!$B13,vldatabase,9,FALSE)","v":44.95},null,0.31000000000000005,8.8987764182424905E-2,1.0256832942668492,9.1273263116071104E-2,2.8294711565982046E-2,null,2.5170272434698261E-2,0.38,9.5647035251853387E-3,null,3.7859415091167387E-2,11,"Emera Inc.",{"$f":"VLOOKUP('Utility Group'!$B13,vldatabase,14,FALSE)","v":0.38507529781973476},{"$f":"VLOOKUP('Utility Group'!$B13,vldatabase,16,FALSE)","v":22245},8566,null,{"$f":"VLOOKUP('Utility Group'!$B13,vldatabase,15,FALSE)","v":0.46387434554973822},{"$f":"VLOOKUP('Utility Group'!$B13,vldatabase,17,FALSE)","v":23875},11075,5.2720627934882858E-2,{"$f":"VLOOKUP('Utility Group'!$B13,vldatabase,5,FALSE)","v":85},{"$f":"VLOOKUP('Utility Group'!$B13,vldatabase,6,FALSE)","v":60},72.5,1.6129032258064515,{"$f":"VLOOKUP('Utility Group'!$B13,vldatabase,10,FALSE)","v":242.48},{"$f":"VLOOKUP('Utility Group'!$B13,vldatabase,11,FALSE)","v":262},1.5605568909512924E-2]
[12,{"$f":"VLOOKUP('Utility Group'!$B14,vldatabase,2,FALSE)","v":"Entergy Corp."},{"$f":"VLOOKUP('Utility Group'!$B14,vldatabase,7,FALSE)","v":7},{"$f":"VLOOKUP('Utility Group'!$B14,vldatabase,8,FALSE)","v":4.55},{"$f":"VLOOKUP('Utility Group'!$B14,vldatabase,9,FALSE)","v":64},null,0.35000000000000003,0.109375,1.026682456868073,0.11229339371994548,3.9302687801980922E-2,null,2.0416018821207815E-2,0.47755102040816322,9.7496906207400567E-3,null,4.9052378422720977E-2,12,"Entergy Corp.",{"$f":"VLOOKUP('Utility Group'!$B14,vldatabase,14,FALSE)","v":0.371},{"$f":"VLOOKUP('Utility Group'!$B14,vldatabase,16,FALSE)","v":27557},10223.646999999999,null,{"$f":"VLOOKUP('Utility Group'!$B14,vldatabase,15,FALSE)","v":0.39500000000000002},{"$f":"VLOOKUP('Utility Group'!$B14,vldatabase,17,FALSE)","v":33800},13351,5.4827855629139499E-2,{"$f":"VLOOKUP('Utility Group'!$B14,vldatabase,5,FALSE)","v":140},{"$f":"VLOOKUP('Utility Group'!$B14,vldatabase,6,FALSE)","v":105},122.5,1.9140625,{"$f":"VLOOKUP('Utility Group'!$B14,vldatabase,10,FALSE)","v":199.15},{"$f":"VLOOKUP('Utility Group'!$B14,vldatabase,11,FALSE)","v":210},1.0666328200467756E-2]
[13,{"$f":"VLOOKUP('Utility Group'!$B15,vldatabase,2,FALSE)","v":"Exelon Corp."},{"$f":"VLOOKUP('Utility Group'!$B15,vldatabase,7,FALSE)","v":3.5},{"$f":"VLOOKUP('Utility Group'!$B15,vldatabase,8,FALSE)","v":1.9},{"$f":"VLOOKUP('Utility Group'!$B15,vldatabase,9,FALSE)","v":40.25},null,0.45714285714285718,8.6956521739130432E-2,1.0219773995468513,8.8867599960595761E-2,4.0625188553415209E-2,null,4.3107818231469253E-3,0.19499999999999995,8.4060245551365021E-4,null,4.1465791008928859E-2,13,"Exelon Corp.",{"$f":"VLOOKUP('Utility Group'!$B15,vldatabase,14,FALSE)","v":0.504},{"$f":"VLOOKUP('Utility Group'!$B15,vldatabase,16,FALSE)","v":63943},32227.272000000001,null,{"$f":"VLOOKUP('Utility Group'!$B15,vldatabase,15,FALSE)","v":0.5},{"$f":"VLOOKUP('Utility Group'!$B15,vldatabase,17,FALSE)","v":80300},40150,4.4942518785697771E-2,{"$f":"VLOOKUP('Utility Group'!$B15,vldatabase,5,FALSE)","v":60},{"$f":"VLOOKUP('Utility Group'!$B15,vldatabase,6,FALSE)","v":40},50,1.2422360248447204,{"$f":"VLOOKUP('Utility Group'!$B15,vldatabase,10,FALSE)","v":973},{"$f":"VLOOKUP('Utility Group'!$B15,vldatabase,11,FALSE)","v":990},3.4701793676332748E-3]
[14,{"$f":"VLOOKUP('Utility Group'!$B16,vldatabase,2,FALSE)","v":"FirstEnergy Corp."},{"$f":"VLOOKUP('Utility Group'!$B16,vldatabase,7,FALSE)","v":3.25},{"$f":"VLOOKUP('Utility Group'!$B16,vldatabase,8,FALSE)","v":1.9},{"$f":"VLOOKUP('Utility Group'!$B16,vldatabase,9,FALSE)","v":20.5},null,0.41538461538461541,0.15853658536585366,1.0534790440400827,0.16701497039659849,6.9375449241663986E-2,null,3.4513119253014209E-2,0.59,2.0362740359278382E-2,null,8.9738189600942375E-2,14,"FirstEnergy Corp.",{"$f":"VLOOKUP('Utility Group'!$B16,vldatabase,14,FALSE)","v":0.26200000000000001},{"$f":"VLOOKUP('Utility Group'!$B16,vldatabase,16,FALSE)","v":26593},6967.366,null,{"$f":"VLOOKUP('Utility Group'!$B16,vldatabase,15,FALSE)","v":0.34},{"$f":"VLOOKUP('Utility Group'!$B16,vldatabase,17,FALSE)","v":35000},11900,0.1130012889906844,{"$f":"VLOOKUP('Utility Group'!$B16,vldatabase,5,FALSE)","v":60},{"$f":"VLOOKUP('Utility Group'!$B16,vldatabase,6,FALSE)","v":40},50,2.4390243902439024,{"$f":"VLOOKUP('Utility Group'!$B16,vldatabase,10,FALSE)","v":540.65},{"$f":"VLOOKUP('Utility Group'!$B16,vldatabase,11,FALSE)","v":580},1.4150378893735827E-2]
[15,{"$f":"VLOOKUP('Utility Group'!$B17,vldatabase,2,FALSE)","v":"Hawaiian Elec."},{"$f":"VLOOKUP('Utility Group'!$B17,vldatabase,7,FALSE)","v":2},{"$f":"VLOOKUP('Utility Group'!$B17,vldatabase,8,FALSE)","v":1.4},{"$f":"VLOOKUP('Utility Group'!$B17,vldatabase,9,FALSE)","v":24.5},null,0.30000000000000004,8.1632653061224483E-2,1.020296860103336,8.3289539600272314E-2,2.4986861880081698E-2,null,1.295145185285713E-2,0.30000000000000004,3.8854355558571394E-3,null,2.8872297435938839E-2,15,"Hawaiian Elec.",{"$f":"VLOOKUP('Utility Group'!$B17,vldatabase,14,FALSE)","v":0.54600000000000004},{"$f":"VLOOKUP('Utility Group'!$B17,vldatabase,16,FALSE)","v":4176.8999999999996},2280.5873999999999,null,{"$f":"VLOOKUP('Utility Group'!$B17,vldatabase,15,FALSE)","v":0.51500000000000001},{"$f":"VLOOKUP('Utility Group'!$B17,vldatabase,17,FALSE)","v":5425},2793.875,4.1434714816728668E-2,{"$f":"VLOOKUP('Utility Group'!$B17,vldatabase,5,FALSE)","v":40},{"$f":"VLOOKUP('Utility Group'!$B17,vldatabase,6,FALSE)","v":30},35,1.4285714285714286,{"$f":"VLOOKUP('Utility Group'!$B17,vldatabase,10,FALSE)","v":108.97},{"$f":"VLOOKUP('Utility Group'!$B17,vldatabase,11,FALSE)","v":114},9.0660162969999902E-3]
[16,{"$f":"VLOOKUP('Utility Group'!$B18,vldatabase,2,FALSE)","v":"IDACORP, Inc."},{"$f":"VLOOKUP('Utility Group'!$B18,vldatabase,7,FALSE)","v":5.5},{"$f":"VLOOKUP('Utility Group'!$B18,vldatabase,8,FALSE)","v":3.55},{"$f":"VLOOKUP('Utility Group'!$B18,vldatabase,9,FALSE)","v":58},null,0.35454545454545455,9.4827586206896547E-2,1.0167447881781722,9.6415454051378385E-2,3.418366098185234E-2,null,-1.3680377312909475E-4,0.41999999999999993,-5.745758471421978E-5,null,3.4126203397138122E-2,16,"IDACORP, Inc.",{"$f":"VLOOKUP('Utility Group'!$B18,vldatabase,14,FALSE)","v":0.58699999999999997},{"$f":"VLOOKUP('Utility Group'!$B18,vldatabase,16,FALSE)","v":4201.3},2466.1630999999998,null,{"$f":"VLOOKUP('Utility Group'!$B18,vldatabase,15,FALSE)","v":0.53500000000000003},{"$f":"VLOOKUP('Utility Group'!$B18,vldatabase,17,FALSE)","v":5450},2915.75,3.4059902204121917E-2,{"$f":"VLOOKUP('Utility Group'!$B18,vldatabase,5,FALSE)","v":115},{"$f":"VLOOKUP('Utility Group'!$B18,vldatabase,6,FALSE)","v":85},100,1.7241379310344827,{"$f":"VLOOKUP('Utility Group'!$B18,vldatabase,10,FALSE)","v":50.42},{"$f":"VLOOKUP('Utility Group'!$B18,vldatabase,11,FALSE)","v":50.4},-7.9346188414874952E-5]
[17,{"$f":"VLOOKUP('Utility Group'!$B19,vldatabase,2,FALSE)","v":"NorthWestern Corp."},{"$f":"VLOOKUP('Utility Group'!$B19,vldatabase,7,FALSE)","v":3.75},{"$f":"VLOOKUP('Utility Group'!$B19,vldatabase,8,FALSE)","v":2.8},{"$f":"VLOOKUP('Utility Group'!$B19,vldatabase,9,FALSE)","v":45.75},null,0.25333333333333335,8.1967213114754092E-2,1.0168847868674395,8.3351212038314706E-2,2.1115640383039726E-2,null,1.6246920454512152E-2,0.39,6.336298977259739E-3,null,2.7451939360299465E-2,17,"NorthWestern Corp.",{"$f":"VLOOKUP('Utility Group'!$B19,vldatabase,14,FALSE)","v":0.47499999999999998},{"$f":"VLOOKUP('Utility Group'!$B19,vldatabase,16,FALSE)","v":4289.8},2037.655,null,{"$f":"VLOOKUP('Utility Group'!$B19,vldatabase,15,FALSE)","v":0.5},{"$f":"VLOOKUP('Utility Group'!$B19,vldatabase,17,FALSE)","v":4825},2412.5,3.4349558712733819E-2,{"$f":"VLOOKUP('Utility Group'!$B19,vldatabase,5,FALSE)","v":85},{"$f":"VLOOKUP('Utility Group'!$B19,vldatabase,6,FALSE)","v":65},75,1.639344262295082,{"$f":"VLOOKUP('Utility Group'!$B19,vldatabase,10,FALSE)","v":50.45},{"$f":"VLOOKUP('Utility Group'!$B19,vldatabase,11,FALSE)","v":53},9.9106214772524126E-3]
[18,{"$f":"VLOOKUP('Utility Group'!$B20,vldatabase,2,FALSE)","v":"OGE Energy Corp."},{"$f":"VLOOKUP('Utility Group'!$B20,vldatabase,7,FALSE)","v":2.5},{"$f":"VLOOKUP('Utility Group'!$B20,vldatabase,8,FALSE)","v":1.95},{"$f":"VLOOKUP('Utility Group'!$B20,vldatabase,9,FALSE)","v":20.5},null,0.22000000000000003,0.12195121951219512,0.9992412056144061,0.12185868361151293,2.6808910394532849E-2,null,-2.3163783035565411E-4,0.56842105263157894,-1.3166781936005601E-4,null,2.6677242575172792E-2,18,"OGE Energy Corp.",{"$f":"VLOOKUP('Utility Group'!$B20,vldatabase,14,FALSE)","v":0.56399999999999995},{"$f":"VLOOKUP('Utility Group'!$B20,vldatabase,16,FALSE)","v":7334.7},4136.7707999999993,null,{"$f":"VLOOKUP('Utility Group'!$B20,vldatabase,15,FALSE)","v":0.51},{"$f":"VLOOKUP('Utility Group'!$B20,vldatabase,17,FALSE)","v":8050},4105.5,-1.5164381064664001E-3,{"$f":"VLOOKUP('Utility Group'!$B20,vldatabase,5,FALSE)","v":55},{"$f":"VLOOKUP('Utility Group'!$B20,vldatabase,6,FALSE)","v":40},47.5,2.3170731707317072,{"$f":"VLOOKUP('Utility Group'!$B20,vldatabase,10,FALSE)","v":200.1},{"$f":"VLOOKUP('Utility Group'!$B20,vldatabase,11,FALSE)","v":200},-9.9970010995598102E-5]
[19,{"$f":"VLOOKUP('Utility Group'!$B21,vldatabase,2,FALSE)","v":"Otter Tail Corp."},{"$f":"VLOOKUP('Utility Group'!$B21,vldatabase,7,FALSE)","v":2.75},{"$f":"VLOOKUP('Utility Group'!$B21,vldatabase,8,FALSE)","v":1.8},{"$f":"VLOOKUP('Utility Group'!$B21,vldatabase,9,FALSE)","v":23.25},null,0.34545454545454546,0.11827956989247312,1.0227251072199559,0.12096748580020984,4.1788767821890671E-2,null,2.0322323662493511E-2,0.55714285714285716,1.1322437469103528E-2,null,5.3111205290994196E-2,19,"Otter Tail Corp.",{"$f":"VLOOKUP('Utility Group'!$B21,vldatabase,14,FALSE)","v":0.53100000000000003},{"$f":"VLOOKUP('Utility Group'!$B21,vldatabase,16,FALSE)","v":1471.1},781.15409999999997,null,{"$f":"VLOOKUP('Utility Group'!$B21,vldatabase,15,FALSE)","v":0.53},{"$f":"VLOOKUP('Utility Group'!$B21,vldatabase,17,FALSE)","v":1850},980.5,4.6507093117495346E-2,{"$f":"VLOOKUP('Utility Group'!$B21,vldatabase,5,FALSE)","v":60},{"$f":"VLOOKUP('Utility Group'!$B21,vldatabase,6,FALSE)","v":45},52.5,2.2580645161290325,{"$f":"VLOOKUP('Utility Group'!$B21,vldatabase,10,FALSE)","v":40.159999999999997},{"$f":"VLOOKUP('Utility Group'!$B21,vldatabase,11,FALSE)","v":42},8.9998861933899832E-3]
[20,{"$f":"VLOOKUP('Utility Group'!$B22,vldatabase,2,FALSE)","v":"PNM Resources"},{"$f":"VLOOKUP('Utility Group'!$B22,vldatabase,7,FALSE)","v":2.75},{"$f":"VLOOKUP('Utility Group'!$B22,vldatabase,8,FALSE)","v":1.5},{"$f":"VLOOKUP('Utility Group'!$B22,vldatabase,9,FALSE)","v":29.25},null,0.45454545454545453,9.4017094017094016E-2,1.0468377114189762,9.8420639535117413E-2,4.4736654334144275E-2,null,4.4998300108586388E-2,0.35000000000000009,1.5749405038005239E-2,null,6.0486059372149514E-2,20,"PNM Resources",{"$f":"VLOOKUP('Utility Group'!$B22,vldatabase,14,FALSE)","v":0.39900000000000002},{"$f":"VLOOKUP('Utility Group'!$B22,vldatabase,16,FALSE)","v":4207.7},1678.8723,null,{"$f":"VLOOKUP('Utility Group'!$B22,vldatabase,15,FALSE)","v":0.49},{"$f":"VLOOKUP('Utility Group'!$B22,vldatabase,17,FALSE)","v":5475},2682.75,9.8278565948519914E-2,{"$f":"VLOOKUP('Utility Group'!$B22,vldatabase,5,FALSE)","v":55},{"$f":"VLOOKUP('Utility Group'!$B22,vldatabase,6,FALSE)","v":35},45,1.5384615384615385,{"$f":"VLOOKUP('Utility Group'!$B22,vldatabase,10,FALSE)","v":79.650000000000006},{"$f":"VLOOKUP('Utility Group'!$B22,vldatabase,11,FALSE)","v":92},2.9248895070581149E-2]
[21,{"$f":"VLOOKUP('Utility Group'!$B23,vldatabase,2,FALSE)","v":"Sempra Energy"},{"$f":"VLOOKUP('Utility Group'!$B23,vldatabase,7,FALSE)","v":9.5},{"$f":"VLOOKUP('Utility Group'!$B23,vldatabase,8,FALSE)","v":5.6},{"$f":"VLOOKUP('Utility Group'!$B23,vldatabase,9,FALSE)","v":88.75},null,0.41052631578947374,0.10704225352112676,1.0532581593809553,0.11274312691965155,4.628402052490959E-2,null,5.7840610310799227E-2,0.46212121212121215,2.6729372946657219E-2,null,7.3013393471566809E-2,21,"Sempra Energy",{"$f":"VLOOKUP('Utility Group'!$B23,vldatabase,14,FALSE)","v":0.434},{"$f":"VLOOKUP('Utility Group'!$B23,vldatabase,16,FALSE)","v":40734},17678.556,null,{"$f":"VLOOKUP('Utility Group'!$B23,vldatabase,15,FALSE)","v":0.51500000000000001},{"$f":"VLOOKUP('Utility Group'!$B23,vldatabase,17,FALSE)","v":58500},30127.5,0.11250830394509959,{"$f":"VLOOKUP('Utility Group'!$B23,vldatabase,5,FALSE)","v":190},{"$f":"VLOOKUP('Utility Group'!$B23,vldatabase,6,FALSE)","v":140},165,1.8591549295774648,{"$f":"VLOOKUP('Utility Group'!$B23,vldatabase,10,FALSE)","v":291.70999999999998},{"$f":"VLOOKUP('Utility Group'!$B23,vldatabase,11,FALSE)","v":340},3.1111237364142008E-2]
[]
[null,null,null,null,null,null,null,null,null,null,null,null,null,null,null,null,null,"(a)",{"$f":"'Proxy Group Risk Measures'!B35","v":"The Value Line Investment Survey (Jul. 24, Aug. 14 and Sep. 11, 2020)."}]
[null,null,null,null,null,null,null,null,null,null,null,null,null,null,null,null,null,"(h)","Average of High and Low expected market prices divided by 2024 BVPS."]
[null,null,null,null,null,null,null,null,null,null,null,null,null,null,null,null,null,"(e)","Computed as 1 - B/M Ratio."]
[null,null,null,null,null,null,null,null,null,null,null,null,null,null,null,null,null,"(b)","Computed using the formula 2*(1+5-Yr. Change in Equity)/(2+5 Yr. Change in Equity)."]
[null,null,null,null,null,null,null,null,null,null,null,null,null,null,null,null,null,"(g)","Five-year compound rate of change."]
[null,null,null,null,null,null,null,null,null,null,null,null,null,null,null,null,null,"(c)","Product of average year-end \"r\" for 2024 and Adjustment Factor."]
[null,null,null,null,null,null,null,null,null,null,null,null,null,null,null,null,null,"(d)","Product of change in common shares outstanding and M/B Ratio."]
[null,null,null,null,null,null,null,null,null,null,null,null,null,null,null,null,null,"(f)","Product of total capital and equity ratio."]

{"sheet":"8","index":19,"n_rows":43,"n_cols":15,"rows_kept":43,"cut":false,"hidden":false,"merged":[[5,2,5,6],[33,1,33,14],[34,1,35,14]]}
[{"$f":"'Exhibit List'!C10","v":"CAPM"},null,null,null,null,null,null,null,null,null,null,null,null,null,{"$f":"'Exhibit List'!B10","v":"Exh. AMM-8"}]
[null,null,null,null,null,null,null,null,null,null,null,null,null,null,"Page 1 of 1"]
[{"$f":"'Exhibit List'!D10","v":"UTILITY GROUP"}]
[]
[null,null,"(a)",null,"(b)",null,null,"(c)",null,"(d)",null,"(d)","(e)"]
[null,null,"Market Return (Rm)",null,null,null,null,null,null,null,null,null,null,"Size"]
[null,null,"Div",null,"Proj.",null,"Cost of","Risk-Free","Risk",null,"Unadjusted","Market","Size","Adjusted"]
[null,"Company","Yield",null,"Growth",null,"Equity","Rate","Premium","Beta","CAPM","Cap","Adjustment","CAPM"]
[{"$f":"A8+1","v":1},{"$f":"VLOOKUP('Utility Group'!$B3,vldatabase,2,FALSE)","v":"Algonquin Pwr & Util"},{"$f":"'2020 10 Market DCF'!$J$385","v":2.3300000000000001E-2},null,{"$f":"'2020 10 Market DCF'!$P$386","v":9.2399999999999996E-2},null,{"$f":"C9+E9","v":0.1157},{"$f":"ROUND('Bond Yields'!$K$16,3)","v":1.4E-2},{"$f":"G9-H9","v":0.1017},{"$f":"VLOOKUP('Utility Group'!$B3,vldatabase,23,FALSE)","v":0.9},{"$f":"IF(J9=\"n/a\",\"n/a\",J9*I9+H9)","v":0.10553},{"$f":"VLOOKUP('Utility Group'!$B3,vldatabase,28,FALSE)","v":9094.3405220000004},{"$f":"IF(L9>'Size Premium'!$A$5,'Size Premium'!$B$5,IF(L9>'Size Premium'!$A$6,'Size Premium'!$B$6,IF(L9>'Size Premium'!$A$7,'Size Premium'!$B$7,IF(L9>'Size Premium'!$A$8,'Size Premium'!$B$8,IF(L9>'Size Premium'!$A$9,'Size Premium'!$B$9,IF(L9>'Size Premium'!$A$10,'Size Premium'!$B$10,IF(L9>'Size Premium'!$A$11,'Size Premium'!$B$11,IF(L9>'Size Premium'!$A$12,'Size Premium'!$B$12,\"ERROR\"))))))))","v":7.3000000000000001E-3},{"$f":"IF(K9=\"n/a\",\"n/a\",ROUND(K9+M9,3))","v":0.113}]
[{"$f":"A9+1","v":2},{"$f":"VLOOKUP('Utility Group'!$B4,vldatabase,2,FALSE)","v":"ALLETE"},{"$f":"'2020 10 Market DCF'!$J$385","v":2.3300000000000001E-2},null,{"$f":"'2020 10 Market DCF'!$P$386","v":9.2399999999999996E-2},null,{"$f":"C10+E10","v":0.1157},{"$f":"ROUND('Bond Yields'!$K$16,3)","v":1.4E-2},{"$f":"G10-H10","v":0.1017},{"$f":"VLOOKUP('Utility Group'!$B4,vldatabase,23,FALSE)","v":0.85},{"$f":"IF(J10=\"n/a\",\"n/a\",J10*I10+H10)","v":0.10044499999999999},{"$f":"VLOOKUP('Utility Group'!$B4,vldatabase,28,FALSE)","v":2800},{"$f":"IF(L10>'Size Premium'!$A$5,'Size Premium'!$B$5,IF(L10>'Size Premium'!$A$6,'Size Premium'!$B$6,IF(L10>'Size Premium'!$A$7,'Size Premium'!$B$7,IF(L10>'Size Premium'!$A$8,'Size Premium'!$B$8,IF(L10>'Size Premium'!$A$9,'Size Premium'!$B$9,IF(L10>'Size Premium'!$A$10,'Size Premium'!$B$10,IF(L10>'Size Premium'!$A$11,'Size Premium'!$B$11,IF(L10>'Size Premium'!$A$12,'Size Premium'!$B$12,\"ERROR\"))))))))","v":1.0999999999999999E-2},{"$f":"IF(K10=\"n/a\",\"n/a\",ROUND(K10+M10,3))","v":0.111}]
[3,{"$f":"VLOOKUP('Utility Group'!$B5,vldatabase,2,FALSE)","v":"Ameren Corp."},{"$f":"'2020 10 Market DCF'!$J$385","v":2.3300000000000001E-2},null,{"$f":"'2020 10 Market DCF'!$P$386","v":9.2399999999999996E-2},null,0.1157,{"$f":"ROUND('Bond Yields'!$K$16,3)","v":1.4E-2},0.1017,{"$f":"VLOOKUP('Utility Group'!$B5,vldatabase,23,FALSE)","v":0.8},9.536E-2,{"$f":"VLOOKUP('Utility Group'!$B5,vldatabase,28,FALSE)","v":20000},{"$f":"IF(L11>'Size Premium'!$A$5,'Size Premium'!$B$5,IF(L11>'Size Premium'!$A$6,'Size Premium'!$B$6,IF(L11>'Size Premium'!$A$7,'Size Premium'!$B$7,IF(L11>'Size Premium'!$A$8,'Size Premium'!$B$8,IF(L11>'Size Premium'!$A$9,'Size Premium'!$B$9,IF(L11>'Size Premium'!$A$10,'Size Premium'!$B$10,IF(L11>'Size Premium'!$A$11,'Size Premium'!$B$11,IF(L11>'Size Premium'!$A$12,'Size Premium'!$B$12,\"ERROR\"))))))))","v":5.0000000000000001E-3},0.1]
[4,{"$f":"VLOOKUP('Utility Group'!$B6,vldatabase,2,FALSE)","v":"Avangrid, Inc."},{"$f":"'2020 10 Market DCF'!$J$385","v":2.3300000000000001E-2},null,{"$f":"'2020 10 Market DCF'!$P$386","v":9.2399999999999996E-2},null,0.1157,{"$f":"ROUND('Bond Yields'!$K$16,3)","v":1.4E-2},0.1017,{"$f":"VLOOKUP('Utility Group'!$B6,vldatabase,23,FALSE)","v":0.8},9.536E-2,{"$f":"VLOOKUP('Utility Group'!$B6,vldatabase,28,FALSE)","v":15000},{"$f":"IF(L12>'Size Premium'!$A$5,'Size Premium'!$B$5,IF(L12>'Size Premium'!$A$6,'Size Premium'!$B$6,IF(L12>'Size Premium'!$A$7,'Size Premium'!$B$7,IF(L12>'Size Premium'!$A$8,'Size Premium'!$B$8,IF(L12>'Size Premium'!$A$9,'Size Premium'!$B$9,IF(L12>'Size Premium'!$A$10,'Size Premium'!$B$10,IF(L12>'Size Premium'!$A$11,'Size Premium'!$B$11,IF(L12>'Size Premium'!$A$12,'Size Premium'!$B$12,\"ERROR\"))))))))","v":5.0000000000000001E-3},0.1]
[5,{"$f":"VLOOKUP('Utility Group'!$B7,vldatabase,2,FALSE)","v":"Avista Corp."},{"$f":"'2020 10 Market DCF'!$J$385","v":2.3300000000000001E-2},null,{"$f":"'2020 10 Market DCF'!$P$386","v":9.2399999999999996E-2},null,0.1157,{"$f":"ROUND('Bond Yields'!$K$16,3)","v":1.4E-2},0.1017,{"$f":"VLOOKUP('Utility Group'!$B7,vldatabase,23,FALSE)","v":0.9},0.10553,{"$f":"VLOOKUP('Utility Group'!$B7,vldatabase,28,FALSE)","v":2400},{"$f":"IF(L13>'Size Premium'!$A$5,'Size Premium'!$B$5,IF(L13>'Size Premium'!$A$6,'Size Premium'!$B$6,IF(L13>'Size Premium'!$A$7,'Size Premium'!$B$7,IF(L13>'Size Premium'!$A$8,'Size Premium'!$B$8,IF(L13>'Size Premium'!$A$9,'Size Premium'!$B$9,IF(L13>'Size Premium'!$A$10,'Size Premium'!$B$10,IF(L13>'Size Premium'!$A$11,'Size Premium'!$B$11,IF(L13>'Size Premium'!$A$12,'Size Premium'!$B$12,\"ERROR\"))))))))","v":1.34E-2},0.11899999999999999]
[6,{"$f":"VLOOKUP('Utility Group'!$B8,vldatabase,2,FALSE)","v":"Black Hills Corp."},{"$f":"'2020 10 Market DCF'!$J$385","v":2.3300000000000001E-2},null,{"$f":"'2020 10 Market DCF'!$P$386","v":9.2399999999999996E-2},null,0.1157,{"$f":"ROUND('Bond Yields'!$K$16,3)","v":1.4E-2},0.1017,{"$f":"VLOOKUP('Utility Group'!$B8,vldatabase,23,FALSE)","v":0.95},0.11061499999999999,{"$f":"VLOOKUP('Utility Group'!$B8,vldatabase,28,FALSE)","v":3800},{"$f":"IF(L14>'Size Premium'!$A$5,'Size Premium'!$B$5,IF(L14>'Size Premium'!$A$6,'Size Premium'!$B$6,IF(L14>'Size Premium'!$A$7,'Size Premium'!$B$7,IF(L14>'Size Premium'!$A$8,'Size Premium'!$B$8,IF(L14>'Size Premium'!$A$9,'Size Premium'!$B$9,IF(L14>'Size Premium'!$A$10,'Size Premium'!$B$10,IF(L14>'Size Premium'!$A$11,'Size Premium'!$B$11,IF(L14>'Size Premium'!$A$12,'Size Premium'!$B$12,\"ERROR\"))))))))","v":1.0999999999999999E-2},0.122]
[7,{"$f":"VLOOKUP('Utility Group'!$B9,vldatabase,2,FALSE)","v":"CenterPoint Energy"},{"$f":"'2020 10 Market DCF'!$J$385","v":2.3300000000000001E-2},null,{"$f":"'2020 10 Market DCF'!$P$386","v":9.2399999999999996E-2},null,0.1157,{"$f":"ROUND('Bond Yields'!$K$16,3)","v":1.4E-2},0.1017,{"$f":"VLOOKUP('Utility Group'!$B9,vldatabase,23,FALSE)","v":1.1000000000000001},0.12587000000000001,{"$f":"VLOOKUP('Utility Group'!$B9,vldatabase,28,FALSE)","v":11000},{"$f":"IF(L15>'Size Premium'!$A$5,'Size Premium'!$B$5,IF(L15>'Size Premium'!$A$6,'Size Premium'!$B$6,IF(L15>'Size Premium'!$A$7,'Size Premium'!$B$7,IF(L15>'Size Premium'!$A$8,'Size Premium'!$B$8,IF(L15>'Size Premium'!$A$9,'Size Premium'!$B$9,IF(L15>'Size Premium'!$A$10,'Size Premium'!$B$10,IF(L15>'Size Premium'!$A$11,'Size Premium'!$B$11,IF(L15>'Size Premium'!$A$12,'Size Premium'!$B$12,\"ERROR\"))))))))","v":7.3000000000000001E-3},0.13300000000000001]
[8,{"$f":"VLOOKUP('Utility Group'!$B10,vldatabase,2,FALSE)","v":"CMS Energy Corp."},{"$f":"'2020 10 Market DCF'!$J$385","v":2.3300000000000001E-2},null,{"$f":"'2020 10 Market DCF'!$P$386","v":9.2399999999999996E-2},null,0.1157,{"$f":"ROUND('Bond Yields'!$K$16,3)","v":1.4E-2},0.1017,{"$f":"VLOOKUP('Utility Group'!$B10,vldatabase,23,FALSE)","v":0.8},9.536E-2,{"$f":"VLOOKUP('Utility Group'!$B10,vldatabase,28,FALSE)","v":17000},{"$f":"IF(L16>'Size Premium'!$A$5,'Size Premium'!$B$5,IF(L16>'Size Premium'!$A$6,'Size Premium'!$B$6,IF(L16>'Size Premium'!$A$7,'Size Premium'!$B$7,IF(L16>'Size Premium'!$A$8,'Size Premium'!$B$8,IF(L16>'Size Premium'!$A$9,'Size Premium'!$B$9,IF(L16>'Size Premium'!$A$10,'Size Premium'!$B$10,IF(L16>'Size Premium'!$A$11,'Size Premium'!$B$11,IF(L16>'Size Premium'!$A$12,'Size Premium'!$B$12,\"ERROR\"))))))))","v":5.0000000000000001E-3},0.1]
[9,{"$f":"VLOOKUP('Utility Group'!$B11,vldatabase,2,FALSE)","v":"DTE Energy Co."},{"$f":"'2020 10 Market DCF'!$J$385","v":2.3300000000000001E-2},null,{"$f":"'2020 10 Market DCF'!$P$386","v":9.2399999999999996E-2},null,0.1157,{"$f":"ROUND('Bond Yields'!$K$16,3)","v":1.4E-2},0.1017,{"$f":"VLOOKUP('Utility Group'!$B11,vldatabase,23,FALSE)","v":0.9},0.10553,{"$f":"VLOOKUP('Utility Group'!$B11,vldatabase,28,FALSE)","v":23000},{"$f":"IF(L17>'Size Premium'!$A$5,'Size Premium'!$B$5,IF(L17>'Size Premium'!$A$6,'Size Premium'!$B$6,IF(L17>'Size Premium'!$A$7,'Size Premium'!$B$7,IF(L17>'Size Premium'!$A$8,'Size Premium'!$B$8,IF(L17>'Size Premium'!$A$9,'Size Premium'!$B$9,IF(L17>'Size Premium'!$A$10,'Size Premium'!$B$10,IF(L17>'Size Premium'!$A$11,'Size Premium'!$B$11,IF(L17>'Size Premium'!$A$12,'Size Premium'!$B$12,\"ERROR\"))))))))","v":5.0000000000000001E-3},0.111]
[10,{"$f":"VLOOKUP('Utility Group'!$B12,vldatabase,2,FALSE)","v":"Edison International"},{"$f":"'2020 10 Market DCF'!$J$385","v":2.3300000000000001E-2},null,{"$f":"'2020 10 Market DCF'!$P$386","v":9.2399999999999996E-2},null,0.1157,{"$f":"ROUND('Bond Yields'!$K$16,3)","v":1.4E-2},0.1017,{"$f":"VLOOKUP('Utility Group'!$B12,vldatabase,23,FALSE)","v":0.9},0.10553,{"$f":"VLOOKUP('Utility Group'!$B12,vldatabase,28,FALSE)","v":20000},{"$f":"IF(L18>'Size Premium'!$A$5,'Size Premium'!$B$5,IF(L18>'Size Premium'!$A$6,'Size Premium'!$B$6,IF(L18>'Size Premium'!$A$7,'Size Premium'!$B$7,IF(L18>'Size Premium'!$A$8,'Size Premium'!$B$8,IF(L18>'Size Premium'!$A$9,'Size Premium'!$B$9,IF(L18>'Size Premium'!$A$10,'Size Premium'!$B$10,IF(L18>'Size Premium'!$A$11,'Size Premium'!$B$11,IF(L18>'Size Premium'!$A$12,'Size Premium'!$B$12,\"ERROR\"))))))))","v":5.0000000000000001E-3},0.111]
[11,{"$f":"VLOOKUP('Utility Group'!$B13,vldatabase,2,FALSE)","v":"Emera Inc."},{"$f":"'2020 10 Market DCF'!$J$385","v":2.3300000000000001E-2},null,{"$f":"'2020 10 Market DCF'!$P$386","v":9.2399999999999996E-2},null,0.1157,{"$f":"ROUND('Bond Yields'!$K$16,3)","v":1.4E-2},0.1017,{"$f":"VLOOKUP('Utility Group'!$B13,vldatabase,23,FALSE)","v":0.75},9.0274999999999994E-2,{"$f":"VLOOKUP('Utility Group'!$B13,vldatabase,28,FALSE)","v":13100},{"$f":"IF(L19>'Size Premium'!$A$5,'Size Premium'!$B$5,IF(L19>'Size Premium'!$A$6,'Size Premium'!$B$6,IF(L19>'Size Premium'!$A$7,'Size Premium'!$B$7,IF(L19>'Size Premium'!$A$8,'Size Premium'!$B$8,IF(L19>'Size Premium'!$A$9,'Size Premium'!$B$9,IF(L19>'Size Premium'!$A$10,'Size Premium'!$B$10,IF(L19>'Size Premium'!$A$11,'Size Premium'!$B$11,IF(L19>'Size Premium'!$A$12,'Size Premium'!$B$12,\"ERROR\"))))))))","v":7.3000000000000001E-3},9.8000000000000004E-2]
[12,{"$f":"VLOOKUP('Utility Group'!$B14,vldatabase,2,FALSE)","v":"Entergy Corp."},{"$f":"'2020 10 Market DCF'!$J$385","v":2.3300000000000001E-2},null,{"$f":"'2020 10 Market DCF'!$P$386","v":9.2399999999999996E-2},null,0.1157,{"$f":"ROUND('Bond Yields'!$K$16,3)","v":1.4E-2},0.1017,{"$f":"VLOOKUP('Utility Group'!$B14,vldatabase,23,FALSE)","v":0.95},0.11061499999999999,{"$f":"VLOOKUP('Utility Group'!$B14,vldatabase,28,FALSE)","v":20000},{"$f":"IF(L20>'Size Premium'!$A$5,'Size Premium'!$B$5,IF(L20>'Size Premium'!$A$6,'Size Premium'!$B$6,IF(L20>'Size Premium'!$A$7,'Size Premium'!$B$7,IF(L20>'Size Premium'!$A$8,'Size Premium'!$B$8,IF(L20>'Size Premium'!$A$9,'Size Premium'!$B$9,IF(L20>'Size Premium'!$A$10,'Size Premium'!$B$10,IF(L20>'Size Premium'!$A$11,'Size Premium'!$B$11,IF(L20>'Size Premium'!$A$12,'Size Premium'!$B$12,\"ERROR\"))))))))","v":5.0000000000000001E-3},0.11600000000000001]
[13,{"$f":"VLOOKUP('Utility Group'!$B15,vldatabase,2,FALSE)","v":"Exelon Corp."},{"$f":"'2020 10 Market DCF'!$J$385","v":2.3300000000000001E-2},null,{"$f":"'2020 10 Market DCF'!$P$386","v":9.2399999999999996E-2},null,0.1157,{"$f":"ROUND('Bond Yields'!$K$16,3)","v":1.4E-2},0.1017,{"$f":"VLOOKUP('Utility Group'!$B15,vldatabase,23,FALSE)","v":0.95},0.11061499999999999,{"$f":"VLOOKUP('Utility Group'!$B15,vldatabase,28,FALSE)","v":37000},{"$f":"IF(L21>'Size Premium'!$A$5,'Size Premium'!$B$5,IF(L21>'Size Premium'!$A$6,'Size Premium'!$B$6,IF(L21>'Size Premium'!$A$7,'Size Premium'!$B$7,IF(L21>'Size Premium'!$A$8,'Size Premium'!$B$8,IF(L21>'Size Premium'!$A$9,'Size Premium'!$B$9,IF(L21>'Size Premium'!$A$10,'Size Premium'!$B$10,IF(L21>'Size Premium'!$A$11,'Size Premium'!$B$11,IF(L21>'Size Premium'!$A$12,'Size Premium'!$B$12,\"ERROR\"))))))))","v":-2.8E-3},0.108]
[14,{"$f":"VLOOKUP('Utility Group'!$B16,vldatabase,2,FALSE)","v":"FirstEnergy Corp."},{"$f":"'2020 10 Market DCF'!$J$385","v":2.3300000000000001E-2},null,{"$f":"'2020 10 Market DCF'!$P$386","v":9.2399999999999996E-2},null,0.1157,{"$f":"ROUND('Bond Yields'!$K$16,3)","v":1.4E-2},0.1017,{"$f":"VLOOKUP('Utility Group'!$B16,vldatabase,23,FALSE)","v":0.85},0.10044499999999999,{"$f":"VLOOKUP('Utility Group'!$B16,vldatabase,28,FALSE)","v":16000},{"$f":"IF(L22>'Size Premium'!$A$5,'Size Premium'!$B$5,IF(L22>'Size Premium'!$A$6,'Size Premium'!$B$6,IF(L22>'Size Premium'!$A$7,'Size Premium'!$B$7,IF(L22>'Size Premium'!$A$8,'Size Premium'!$B$8,IF(L22>'Size Premium'!$A$9,'Size Premium'!$B$9,IF(L22>'Size Premium'!$A$10,'Size Premium'!$B$10,IF(L22>'Size Premium'!$A$11,'Size Premium'!$B$11,IF(L22>'Size Premium'!$A$12,'Size Premium'!$B$12,\"ERROR\"))))))))","v":5.0000000000000001E-3},0.105]
[15,{"$f":"VLOOKUP('Utility Group'!$B17,vldatabase,2,FALSE)","v":"Hawaiian Elec."},{"$f":"'2020 10 Market DCF'!$J$385","v":2.3300000000000001E-2},null,{"$f":"'2020 10 Market DCF'!$P$386","v":9.2399999999999996E-2},null,0.1157,{"$f":"ROUND('Bond Yields'!$K$16,3)","v":1.4E-2},0.1017,{"$f":"VLOOKUP('Utility Group'!$B17,vldatabase,23,FALSE)","v":0.8},9.536E-2,{"$f":"VLOOKUP('Utility Group'!$B17,vldatabase,28,FALSE)","v":4000},{"$f":"IF(L23>'Size Premium'!$A$5,'Size Premium'!$B$5,IF(L23>'Size Premium'!$A$6,'Size Premium'!$B$6,IF(L23>'Size Premium'!$A$7,'Size Premium'!$B$7,IF(L23>'Size Premium'!$A$8,'Size Premium'!$B$8,IF(L23>'Size Premium'!$A$9,'Size Premium'!$B$9,IF(L23>'Size Premium'!$A$10,'Size Premium'!$B$10,IF(L23>'Size Premium'!$A$11,'Size Premium'!$B$11,IF(L23>'Size Premium'!$A$12,'Size Premium'!$B$12,\"ERROR\"))))))))","v":1.0999999999999999E-2},0.106]
[16,{"$f":"VLOOKUP('Utility Group'!$B18,vldatabase,2,FALSE)","v":"IDACORP, Inc."},{"$f":"'2020 10 Market DCF'!$J$385","v":2.3300000000000001E-2},null,{"$f":"'2020 10 Market DCF'!$P$386","v":9.2399999999999996E-2},null,0.1157,{"$f":"ROUND('Bond Yields'!$K$16,3)","v":1.4E-2},0.1017,{"$f":"VLOOKUP('Utility Group'!$B18,vldatabase,23,FALSE)","v":0.8},9.536E-2,{"$f":"VLOOKUP('Utility Group'!$B18,vldatabase,28,FALSE)","v":4600},{"$f":"IF(L24>'Size Premium'!$A$5,'Size Premium'!$B$5,IF(L24>'Size Premium'!$A$6,'Size Premium'!$B$6,IF(L24>'Size Premium'!$A$7,'Size Premium'!$B$7,IF(L24>'Size Premium'!$A$8,'Size Premium'!$B$8,IF(L24>'Size Premium'!$A$9,'Size Premium'!$B$9,IF(L24>'Size Premium'!$A$10,'Size Premium'!$B$10,IF(L24>'Size Premium'!$A$11,'Size Premium'!$B$11,IF(L24>'Size Premium'!$A$12,'Size Premium'!$B$12,\"ERROR\"))))))))","v":7.9000000000000008E-3},0.10299999999999999]
[17,{"$f":"VLOOKUP('Utility Group'!$B19,vldatabase,2,FALSE)","v":"NorthWestern Corp."},{"$f":"'2020 10 Market DCF'!$J$385","v":2.3300000000000001E-2},null,{"$f":"'2020 10 Market DCF'!$P$386","v":9.2399999999999996E-2},null,0.1157,{"$f":"ROUND('Bond Yields'!$K$16,3)","v":1.4E-2},0.1017,{"$f":"VLOOKUP('Utility Group'!$B19,vldatabase,23,FALSE)","v":0.9},0.10553,{"$f":"VLOOKUP('Utility Group'!$B19,vldatabase,28,FALSE)","v":2700},{"$f":"IF(L25>'Size Premium'!$A$5,'Size Premium'!$B$5,IF(L25>'Size Premium'!$A$6,'Size Premium'!$B$6,IF(L25>'Size Premium'!$A$7,'Size Premium'!$B$7,IF(L25>'Size Premium'!$A$8,'Size Premium'!$B$8,IF(L25>'Size Premium'!$A$9,'Size Premium'!$B$9,IF(L25>'Size Premium'!$A$10,'Size Premium'!$B$10,IF(L25>'Size Premium'!$A$11,'Size Premium'!$B$11,IF(L25>'Size Premium'!$A$12,'Size Premium'!$B$12,\"ERROR\"))))))))","v":1.0999999999999999E-2},0.11700000000000001]
[18,{"$f":"VLOOKUP('Utility Group'!$B20,vldatabase,2,FALSE)","v":"OGE Energy Corp."},{"$f":"'2020 10 Market DCF'!$J$385","v":2.3300000000000001E-2},null,{"$f":"'2020 10 Market DCF'!$P$386","v":9.2399999999999996E-2},null,0.1157,{"$f":"ROUND('Bond Yields'!$K$16,3)","v":1.4E-2},0.1017,{"$f":"VLOOKUP('Utility Group'!$B20,vldatabase,23,FALSE)","v":1.05},0.120785,{"$f":"VLOOKUP('Utility Group'!$B20,vldatabase,28,FALSE)","v":6400},{"$f":"IF(L26>'Size Premium'!$A$5,'Size Premium'!$B$5,IF(L26>'Size Premium'!$A$6,'Size Premium'!$B$6,IF(L26>'Size Premium'!$A$7,'Size Premium'!$B$7,IF(L26>'Size Premium'!$A$8,'Size Premium'!$B$8,IF(L26>'Size Premium'!$A$9,'Size Premium'!$B$9,IF(L26>'Size Premium'!$A$10,'Size Premium'!$B$10,IF(L26>'Size Premium'!$A$11,'Size Premium'!$B$11,IF(L26>'Size Premium'!$A$12,'Size Premium'!$B$12,\"ERROR\"))))))))","v":7.9000000000000008E-3},0.129]
[19,{"$f":"VLOOKUP('Utility Group'!$B21,vldatabase,2,FALSE)","v":"Otter Tail Corp."},{"$f":"'2020 10 Market DCF'!$J$385","v":2.3300000000000001E-2},null,{"$f":"'2020 10 Market DCF'!$P$386","v":9.2399999999999996E-2},null,0.1157,{"$f":"ROUND('Bond Yields'!$K$16,3)","v":1.4E-2},0.1017,{"$f":"VLOOKUP('Utility Group'!$B21,vldatabase,23,FALSE)","v":0.85},0.10044499999999999,{"$f":"VLOOKUP('Utility Group'!$B21,vldatabase,28,FALSE)","v":1600},{"$f":"IF(L27>'Size Premium'!$A$5,'Size Premium'!$B$5,IF(L27>'Size Premium'!$A$6,'Size Premium'!$B$6,IF(L27>'Size Premium'!$A$7,'Size Premium'!$B$7,IF(L27>'Size Premium'!$A$8,'Size Premium'!$B$8,IF(L27>'Size Premium'!$A$9,'Size Premium'!$B$9,IF(L27>'Size Premium'!$A$10,'Size Premium'!$B$10,IF(L27>'Size Premium'!$A$11,'Size Premium'!$B$11,IF(L27>'Size Premium'!$A$12,'Size Premium'!$B$12,\"ERROR\"))))))))","v":1.47E-2},0.115]
[20,{"$f":"VLOOKUP('Utility Group'!$B22,vldatabase,2,FALSE)","v":"PNM Resources"},{"$f":"'2020 10 Market DCF'!$J$385","v":2.3300000000000001E-2},null,{"$f":"'2020 10 Market DCF'!$P$386","v":9.2399999999999996E-2},null,0.1157,{"$f":"ROUND('Bond Yields'!$K$16,3)","v":1.4E-2},0.1017,{"$f":"VLOOKUP('Utility Group'!$B22,vldatabase,23,FALSE)","v":0.95},0.11061499999999999,{"$f":"VLOOKUP('Utility Group'!$B22,vldatabase,28,FALSE)","v":3100},{"$f":"IF(L28>'Size Premium'!$A$5,'Size Premium'!$B$5,IF(L28>'Size Premium'!$A$6,'Size Premium'!$B$6,IF(L28>'Size Premium'!$A$7,'Size Premium'!$B$7,IF(L28>'Size Premium'!$A$8,'Size Premium'!$B$8,IF(L28>'Size Premium'!$A$9,'Size Premium'!$B$9,IF(L28>'Size Premium'!$A$10,'Size Premium'!$B$10,IF(L28>'Size Premium'!$A$11,'Size Premium'!$B$11,IF(L28>'Size Premium'!$A$12,'Size Premium'!$B$12,\"ERROR\"))))))))","v":1.0999999999999999E-2},0.122]
[21,{"$f":"VLOOKUP('Utility Group'!$B23,vldatabase,2,FALSE)","v":"Sempra Energy"},{"$f":"'2020 10 Market DCF'!$J$385","v":2.3300000000000001E-2},null,{"$f":"'2020 10 Market DCF'!$P$386","v":9.2399999999999996E-2},null,0.1157,{"$f":"ROUND('Bond Yields'!$K$16,3)","v":1.4E-2},0.1017,{"$f":"VLOOKUP('Utility Group'!$B23,vldatabase,23,FALSE)","v":0.95},0.11061499999999999,{"$f":"VLOOKUP('Utility Group'!$B23,vldatabase,28,FALSE)","v":35000},{"$f":"IF(L29>'Size Premium'!$A$5,'Size Premium'!$B$5,IF(L29>'Size Premium'!$A$6,'Size Premium'!$B$6,IF(L29>'Size Premium'!$A$7,'Size Premium'!$B$7,IF(L29>'Size Premium'!$A$8,'Size Premium'!$B$8,IF(L29>'Size Premium'!$A$9,'Size Premium'!$B$9,IF(L29>'Size Premium'!$A$10,'Size Premium'!$B$10,IF(L29>'Size Premium'!$A$11,'Size Premium'!$B$11,IF(L29>'Size Premium'!$A$12,'Size Premium'!$B$12,\"ERROR\"))))))))","v":-2.8E-3},0.108]
[]
[null,"Average",null,null,null,null,null,null,null,null,{"$f":"AVERAGE(K9:K29)","v":0.10456142857142856},null,null,{"$f":"AVERAGE(N9:N29)","v":0.1117619047619048}]
[null,"Midpoint (f)",null,null,null,null,null,null,null,null,{"$f":"AVERAGE(K42:K43)","v":0.1080725},null,null,{"$f":"AVERAGE(N42:N43)","v":0.11550000000000001}]
[]
["(a)",{"$f":"\"Weighted average for \"&'2020 10 Market DCF'!B393","v":"Weighted average for dividend paying components of S&P 500 index from zacks.com (retrieved Oct. 1, 2020)."}]
["(b)",{"$f":"\"Average of weighted average earnings growth rates from Value Line Investment Survey, IBES, and Zacks Investment Research for dividend-paying stocks in the S&P 500 based on data from \"&'2020 10 Market DCF'!B395&\", \"&'2020 10 Market DCF'!B396&\", and \"&'2020 10 Market DCF'!B394&\".\"","v":"Average of weighted average earnings growth rates from Value Line Investment Survey, IBES, and Zacks Investment Research for dividend-paying stocks in the S&P 500 based on data from http://finance.yahoo.com (retrieved Oct. 2, 2020), www.zacks.com (retrieved Oct. 1, 2020), and www.valueline.com (retrieved Oct. 1, 2020)."}]
[]
["(c)",{"$f":"\"Average yield on 30-year Treasury bonds for the six-months ending \"&'Bond Yields'!B14&\" based on data from the Federal Reserve at \"&'Bond Yields'!B21&\".\"","v":"Average yield on 30-year Treasury bonds for the six-months ending Sep. 2020 based on data from the Federal Reserve at https://fred.stlouisfed.org/.."}]
["(d)",{"$f":"'Proxy Group Risk Measures'!B35","v":"The Value Line Investment Survey (Jul. 24, Aug. 14 and Sep. 11, 2020)."}]
["(e)",{"$f":"'Size Premium'!A18","v":"Duff & Phelps, 2020 CRSP Deciles Size Study -- Supplementary Data Exhibits, Cost of Capital Navigator."}]
["(f)","Average of low and high values."]
[]
[null,null,null,null,null,null,null,null,null,"Min",{"$f":"MIN(K9:K29)","v":9.0274999999999994E-2},null,null,{"$f":"MIN(N9:N29)","v":9.8000000000000004E-2}]
[null,null,null,null,null,null,null,null,null,"Max",{"$f":"MAX(K9:K29)","v":0.12587000000000001},null,null,{"$f":"MAX(N9:N29)","v":0.13300000000000001}]

{"sheet":"9","index":20,"n_rows":43,"n_cols":18,"rows_kept":43,"cut":false,"hidden":false,"merged":[[36,1,36,16],[5,2,5,4],[6,9,6,11],[6,7,6,8],[34,1,35,16]]}
[{"$f":"'Exhibit List'!C11","v":"EMPIRICAL CAPM"},null,null,null,null,null,null,null,null,null,null,null,null,null,null,null,null,{"$f":"'Exhibit List'!B11","v":"Exh. AMM-9"}]
[null,null,null,null,null,null,null,null,null,null,null,null,null,null,null,null,null,"Page 1 of 1"]
[{"$f":"'Exhibit List'!D11","v":"UTILITY GROUP"}]
[]
[null,null,"(a)","(b)",null,"(c)",null,"(d)",null,"(e)","(d)",null,null,null,"(e)","(f)"]
[null,null,"Market Return (Rm)",null,null,null,null,null,null,null,null,null,null,null,null,null,"Size"]
[null,null,"Div","Proj.","Cost of","Risk-Free","Risk","Unadjusted RP",null,"Beta Adjusted RP",null,null,"Total","Unadjusted","Market","Size","Adjusted"]
[null,"Company","Yield","Growth","Equity","Rate","Premium","Weight","RP1","Beta","Weight","RP2","RP","Ke","Cap","Adjustment","Ke"]
[{"$f":"A8+1","v":1},{"$f":"VLOOKUP('Utility Group'!$B3,vldatabase,2,FALSE)","v":"Algonquin Pwr & Util"},{"$f":"'8'!C9","v":2.3300000000000001E-2},{"$f":"'8'!E9","v":9.2399999999999996E-2},{"$f":"C9+D9","v":0.1157},{"$f":"'8'!H9","v":1.4E-2},{"$f":"E9-F9","v":0.1017},0.25,{"$f":"G9*H9","v":2.5425E-2},{"$f":"VLOOKUP('Utility Group'!$B3,vldatabase,23,FALSE)","v":0.9},0.75,{"$f":"IF(J9=\"n/a\",\"n/a\",G9*J9*K9)","v":6.86475E-2},{"$f":"IF(L9=\"n/a\",\"n/a\",L9+I9)","v":9.4072500000000003E-2},{"$f":"IF(M9=\"n/a\",\"n/a\",M9+F9)","v":0.1080725},{"$f":"VLOOKUP('Utility Group'!$B3,vldatabase,28,FALSE)","v":9094.3405220000004},{"$f":"IF(O9>'Size Premium'!$A$5,'Size Premium'!$B$5,IF(O9>'Size Premium'!$A$6,'Size Premium'!$B$6,IF(O9>'Size Premium'!$A$7,'Size Premium'!$B$7,IF(O9>'Size Premium'!$A$8,'Size Premium'!$B$8,IF(O9>'Size Premium'!$A$9,'Size Premium'!$B$9,IF(O9>'Size Premium'!$A$10,'Size Premium'!$B$10,IF(O9>'Size Premium'!$A$11,'Size Premium'!$B$11,IF(O9>'Size Premium'!$A$12,'Size Premium'!$B$12,\"ERROR\"))))))))","v":7.3000000000000001E-3},{"$f":"IF(N9=\"n/a\",\"n/a\",ROUND(N9+P9,3))","v":0.115}]
[{"$f":"A9+1","v":2},{"$f":"VLOOKUP('Utility Group'!$B4,vldatabase,2,FALSE)","v":"ALLETE"},{"$f":"'8'!C10","v":2.3300000000000001E-2},{"$f":"'8'!E10","v":9.2399999999999996E-2},{"$f":"C10+D10","v":0.1157},{"$f":"'8'!H10","v":1.4E-2},{"$f":"E10-F10","v":0.1017},0.25,{"$f":"G10*H10","v":2.5425E-2},{"$f":"VLOOKUP('Utility Group'!$B4,vldatabase,23,FALSE)","v":0.85},0.75,6.4833749999999996E-2,9.0258749999999999E-2,0.10425875,{"$f":"VLOOKUP('Utility Group'!$B4,vldatabase,28,FALSE)","v":2800},{"$f":"IF(O10>'Size Premium'!$A$5,'Size Premium'!$B$5,IF(O10>'Size Premium'!$A$6,'Size Premium'!$B$6,IF(O10>'Size Premium'!$A$7,'Size Premium'!$B$7,IF(O10>'Size Premium'!$A$8,'Size Premium'!$B$8,IF(O10>'Size Premium'!$A$9,'Size Premium'!$B$9,IF(O10>'Size Premium'!$A$10,'Size Premium'!$B$10,IF(O10>'Size Premium'!$A$11,'Size Premium'!$B$11,IF(O10>'Size Premium'!$A$12,'Size Premium'!$B$12,\"ERROR\"))))))))","v":1.0999999999999999E-2},{"$f":"IF(N10=\"n/a\",\"n/a\",ROUND(N10+P10,3))","v":0.115}]
[3,{"$f":"VLOOKUP('Utility Group'!$B5,vldatabase,2,FALSE)","v":"Ameren Corp."},{"$f":"'8'!C11","v":2.3300000000000001E-2},{"$f":"'8'!E11","v":9.2399999999999996E-2},0.1157,{"$f":"'8'!H11","v":1.4E-2},0.1017,0.25,2.5425E-2,{"$f":"VLOOKUP('Utility Group'!$B5,vldatabase,23,FALSE)","v":0.8},0.75,6.1020000000000005E-2,8.6445000000000008E-2,0.10044500000000001,{"$f":"VLOOKUP('Utility Group'!$B5,vldatabase,28,FALSE)","v":20000},{"$f":"IF(O11>'Size Premium'!$A$5,'Size Premium'!$B$5,IF(O11>'Size Premium'!$A$6,'Size Premium'!$B$6,IF(O11>'Size Premium'!$A$7,'Size Premium'!$B$7,IF(O11>'Size Premium'!$A$8,'Size Premium'!$B$8,IF(O11>'Size Premium'!$A$9,'Size Premium'!$B$9,IF(O11>'Size Premium'!$A$10,'Size Premium'!$B$10,IF(O11>'Size Premium'!$A$11,'Size Premium'!$B$11,IF(O11>'Size Premium'!$A$12,'Size Premium'!$B$12,\"ERROR\"))))))))","v":5.0000000000000001E-3},0.105]
[4,{"$f":"VLOOKUP('Utility Group'!$B6,vldatabase,2,FALSE)","v":"Avangrid, Inc."},{"$f":"'8'!C12","v":2.3300000000000001E-2},{"$f":"'8'!E12","v":9.2399999999999996E-2},0.1157,{"$f":"'8'!H12","v":1.4E-2},0.1017,0.25,2.5425E-2,{"$f":"VLOOKUP('Utility Group'!$B6,vldatabase,23,FALSE)","v":0.8},0.75,6.1020000000000005E-2,8.6445000000000008E-2,0.10044500000000001,{"$f":"VLOOKUP('Utility Group'!$B6,vldatabase,28,FALSE)","v":15000},{"$f":"IF(O12>'Size Premium'!$A$5,'Size Premium'!$B$5,IF(O12>'Size Premium'!$A$6,'Size Premium'!$B$6,IF(O12>'Size Premium'!$A$7,'Size Premium'!$B$7,IF(O12>'Size Premium'!$A$8,'Size Premium'!$B$8,IF(O12>'Size Premium'!$A$9,'Size Premium'!$B$9,IF(O12>'Size Premium'!$A$10,'Size Premium'!$B$10,IF(O12>'Size Premium'!$A$11,'Size Premium'!$B$11,IF(O12>'Size Premium'!$A$12,'Size Premium'!$B$12,\"ERROR\"))))))))","v":5.0000000000000001E-3},0.105]
[5,{"$f":"VLOOKUP('Utility Group'!$B7,vldatabase,2,FALSE)","v":"Avista Corp."},{"$f":"'8'!C13","v":2.3300000000000001E-2},{"$f":"'8'!E13","v":9.2399999999999996E-2},0.1157,{"$f":"'8'!H13","v":1.4E-2},0.1017,0.25,2.5425E-2,{"$f":"VLOOKUP('Utility Group'!$B7,vldatabase,23,FALSE)","v":0.9},0.75,6.86475E-2,9.4072500000000003E-2,0.1080725,{"$f":"VLOOKUP('Utility Group'!$B7,vldatabase,28,FALSE)","v":2400},{"$f":"IF(O13>'Size Premium'!$A$5,'Size Premium'!$B$5,IF(O13>'Size Premium'!$A$6,'Size Premium'!$B$6,IF(O13>'Size Premium'!$A$7,'Size Premium'!$B$7,IF(O13>'Size Premium'!$A$8,'Size Premium'!$B$8,IF(O13>'Size Premium'!$A$9,'Size Premium'!$B$9,IF(O13>'Size Premium'!$A$10,'Size Premium'!$B$10,IF(O13>'Size Premium'!$A$11,'Size Premium'!$B$11,IF(O13>'Size Premium'!$A$12,'Size Premium'!$B$12,\"ERROR\"))))))))","v":1.34E-2},0.121]
[6,{"$f":"VLOOKUP('Utility Group'!$B8,vldatabase,2,FALSE)","v":"Black Hills Corp."},{"$f":"'8'!C14","v":2.3300000000000001E-2},{"$f":"'8'!E14","v":9.2399999999999996E-2},0.1157,{"$f":"'8'!H14","v":1.4E-2},0.1017,0.25,2.5425E-2,{"$f":"VLOOKUP('Utility Group'!$B8,vldatabase,23,FALSE)","v":0.95},0.75,7.2461249999999991E-2,9.7886249999999994E-2,0.11188624999999999,{"$f":"VLOOKUP('Utility Group'!$B8,vldatabase,28,FALSE)","v":3800},{"$f":"IF(O14>'Size Premium'!$A$5,'Size Premium'!$B$5,IF(O14>'Size Premium'!$A$6,'Size Premium'!$B$6,IF(O14>'Size Premium'!$A$7,'Size Premium'!$B$7,IF(O14>'Size Premium'!$A$8,'Size Premium'!$B$8,IF(O14>'Size Premium'!$A$9,'Size Premium'!$B$9,IF(O14>'Size Premium'!$A$10,'Size Premium'!$B$10,IF(O14>'Size Premium'!$A$11,'Size Premium'!$B$11,IF(O14>'Size Premium'!$A$12,'Size Premium'!$B$12,\"ERROR\"))))))))","v":1.0999999999999999E-2},0.123]
[7,{"$f":"VLOOKUP('Utility Group'!$B9,vldatabase,2,FALSE)","v":"CenterPoint Energy"},{"$f":"'8'!C15","v":2.3300000000000001E-2},{"$f":"'8'!E15","v":9.2399999999999996E-2},0.1157,{"$f":"'8'!H15","v":1.4E-2},0.1017,0.25,2.5425E-2,{"$f":"VLOOKUP('Utility Group'!$B9,vldatabase,23,FALSE)","v":1.1000000000000001},0.75,8.3902500000000005E-2,0.10932750000000001,0.12332750000000001,{"$f":"VLOOKUP('Utility Group'!$B9,vldatabase,28,FALSE)","v":11000},{"$f":"IF(O15>'Size Premium'!$A$5,'Size Premium'!$B$5,IF(O15>'Size Premium'!$A$6,'Size Premium'!$B$6,IF(O15>'Size Premium'!$A$7,'Size Premium'!$B$7,IF(O15>'Size Premium'!$A$8,'Size Premium'!$B$8,IF(O15>'Size Premium'!$A$9,'Size Premium'!$B$9,IF(O15>'Size Premium'!$A$10,'Size Premium'!$B$10,IF(O15>'Size Premium'!$A$11,'Size Premium'!$B$11,IF(O15>'Size Premium'!$A$12,'Size Premium'!$B$12,\"ERROR\"))))))))","v":7.3000000000000001E-3},0.13100000000000001]
[8,{"$f":"VLOOKUP('Utility Group'!$B10,vldatabase,2,FALSE)","v":"CMS Energy Corp."},{"$f":"'8'!C16","v":2.3300000000000001E-2},{"$f":"'8'!E16","v":9.2399999999999996E-2},0.1157,{"$f":"'8'!H16","v":1.4E-2},0.1017,0.25,2.5425E-2,{"$f":"VLOOKUP('Utility Group'!$B10,vldatabase,23,FALSE)","v":0.8},0.75,6.1020000000000005E-2,8.6445000000000008E-2,0.10044500000000001,{"$f":"VLOOKUP('Utility Group'!$B10,vldatabase,28,FALSE)","v":17000},{"$f":"IF(O16>'Size Premium'!$A$5,'Size Premium'!$B$5,IF(O16>'Size Premium'!$A$6,'Size Premium'!$B$6,IF(O16>'Size Premium'!$A$7,'Size Premium'!$B$7,IF(O16>'Size Premium'!$A$8,'Size Premium'!$B$8,IF(O16>'Size Premium'!$A$9,'Size Premium'!$B$9,IF(O16>'Size Premium'!$A$10,'Size Premium'!$B$10,IF(O16>'Size Premium'!$A$11,'Size Premium'!$B$11,IF(O16>'Size Premium'!$A$12,'Size Premium'!$B$12,\"ERROR\"))))))))","v":5.0000000000000001E-3},0.105]
[9,{"$f":"VLOOKUP('Utility Group'!$B11,vldatabase,2,FALSE)","v":"DTE Energy Co."},{"$f":"'8'!C17","v":2.3300000000000001E-2},{"$f":"'8'!E17","v":9.2399999999999996E-2},0.1157,{"$f":"'8'!H17","v":1.4E-2},0.1017,0.25,2.5425E-2,{"$f":"VLOOKUP('Utility Group'!$B11,vldatabase,23,FALSE)","v":0.9},0.75,6.86475E-2,9.4072500000000003E-2,0.1080725,{"$f":"VLOOKUP('Utility Group'!$B11,vldatabase,28,FALSE)","v":23000},{"$f":"IF(O17>'Size Premium'!$A$5,'Size Premium'!$B$5,IF(O17>'Size Premium'!$A$6,'Size Premium'!$B$6,IF(O17>'Size Premium'!$A$7,'Size Premium'!$B$7,IF(O17>'Size Premium'!$A$8,'Size Premium'!$B$8,IF(O17>'Size Premium'!$A$9,'Size Premium'!$B$9,IF(O17>'Size Premium'!$A$10,'Size Premium'!$B$10,IF(O17>'Size Premium'!$A$11,'Size Premium'!$B$11,IF(O17>'Size Premium'!$A$12,'Size Premium'!$B$12,\"ERROR\"))))))))","v":5.0000000000000001E-3},0.113]
[10,{"$f":"VLOOKUP('Utility Group'!$B12,vldatabase,2,FALSE)","v":"Edison International"},{"$f":"'8'!C18","v":2.3300000000000001E-2},{"$f":"'8'!E18","v":9.2399999999999996E-2},0.1157,{"$f":"'8'!H18","v":1.4E-2},0.1017,0.25,2.5425E-2,{"$f":"VLOOKUP('Utility Group'!$B12,vldatabase,23,FALSE)","v":0.9},0.75,6.86475E-2,9.4072500000000003E-2,0.1080725,{"$f":"VLOOKUP('Utility Group'!$B12,vldatabase,28,FALSE)","v":20000},{"$f":"IF(O18>'Size Premium'!$A$5,'Size Premium'!$B$5,IF(O18>'Size Premium'!$A$6,'Size Premium'!$B$6,IF(O18>'Size Premium'!$A$7,'Size Premium'!$B$7,IF(O18>'Size Premium'!$A$8,'Size Premium'!$B$8,IF(O18>'Size Premium'!$A$9,'Size Premium'!$B$9,IF(O18>'Size Premium'!$A$10,'Size Premium'!$B$10,IF(O18>'Size Premium'!$A$11,'Size Premium'!$B$11,IF(O18>'Size Premium'!$A$12,'Size Premium'!$B$12,\"ERROR\"))))))))","v":5.0000000000000001E-3},0.113]
[11,{"$f":"VLOOKUP('Utility Group'!$B13,vldatabase,2,FALSE)","v":"Emera Inc."},{"$f":"'8'!C19","v":2.3300000000000001E-2},{"$f":"'8'!E19","v":9.2399999999999996E-2},0.1157,{"$f":"'8'!H19","v":1.4E-2},0.1017,0.25,2.5425E-2,{"$f":"VLOOKUP('Utility Group'!$B13,vldatabase,23,FALSE)","v":0.75},0.75,5.720625E-2,8.2631250000000003E-2,9.6631250000000002E-2,{"$f":"VLOOKUP('Utility Group'!$B13,vldatabase,28,FALSE)","v":13100},{"$f":"IF(O19>'Size Premium'!$A$5,'Size Premium'!$B$5,IF(O19>'Size Premium'!$A$6,'Size Premium'!$B$6,IF(O19>'Size Premium'!$A$7,'Size Premium'!$B$7,IF(O19>'Size Premium'!$A$8,'Size Premium'!$B$8,IF(O19>'Size Premium'!$A$9,'Size Premium'!$B$9,IF(O19>'Size Premium'!$A$10,'Size Premium'!$B$10,IF(O19>'Size Premium'!$A$11,'Size Premium'!$B$11,IF(O19>'Size Premium'!$A$12,'Size Premium'!$B$12,\"ERROR\"))))))))","v":7.3000000000000001E-3},0.104]
[12,{"$f":"VLOOKUP('Utility Group'!$B14,vldatabase,2,FALSE)","v":"Entergy Corp."},{"$f":"'8'!C20","v":2.3300000000000001E-2},{"$f":"'8'!E20","v":9.2399999999999996E-2},0.1157,{"$f":"'8'!H20","v":1.4E-2},0.1017,0.25,2.5425E-2,{"$f":"VLOOKUP('Utility Group'!$B14,vldatabase,23,FALSE)","v":0.95},0.75,7.2461249999999991E-2,9.7886249999999994E-2,0.11188624999999999,{"$f":"VLOOKUP('Utility Group'!$B14,vldatabase,28,FALSE)","v":20000},{"$f":"IF(O20>'Size Premium'!$A$5,'Size Premium'!$B$5,IF(O20>'Size Premium'!$A$6,'Size Premium'!$B$6,IF(O20>'Size Premium'!$A$7,'Size Premium'!$B$7,IF(O20>'Size Premium'!$A$8,'Size Premium'!$B$8,IF(O20>'Size Premium'!$A$9,'Size Premium'!$B$9,IF(O20>'Size Premium'!$A$10,'Size Premium'!$B$10,IF(O20>'Size Premium'!$A$11,'Size Premium'!$B$11,IF(O20>'Size Premium'!$A$12,'Size Premium'!$B$12,\"ERROR\"))))))))","v":5.0000000000000001E-3},0.11700000000000001]
[13,{"$f":"VLOOKUP('Utility Group'!$B15,vldatabase,2,FALSE)","v":"Exelon Corp."},{"$f":"'8'!C21","v":2.3300000000000001E-2},{"$f":"'8'!E21","v":9.2399999999999996E-2},0.1157,{"$f":"'8'!H21","v":1.4E-2},0.1017,0.25,2.5425E-2,{"$f":"VLOOKUP('Utility Group'!$B15,vldatabase,23,FALSE)","v":0.95},0.75,7.2461249999999991E-2,9.7886249999999994E-2,0.11188624999999999,{"$f":"VLOOKUP('Utility Group'!$B15,vldatabase,28,FALSE)","v":37000},{"$f":"IF(O21>'Size Premium'!$A$5,'Size Premium'!$B$5,IF(O21>'Size Premium'!$A$6,'Size Premium'!$B$6,IF(O21>'Size Premium'!$A$7,'Size Premium'!$B$7,IF(O21>'Size Premium'!$A$8,'Size Premium'!$B$8,IF(O21>'Size Premium'!$A$9,'Size Premium'!$B$9,IF(O21>'Size Premium'!$A$10,'Size Premium'!$B$10,IF(O21>'Size Premium'!$A$11,'Size Premium'!$B$11,IF(O21>'Size Premium'!$A$12,'Size Premium'!$B$12,\"ERROR\"))))))))","v":-2.8E-3},0.109]
[14,{"$f":"VLOOKUP('Utility Group'!$B16,vldatabase,2,FALSE)","v":"FirstEnergy Corp."},{"$f":"'8'!C22","v":2.3300000000000001E-2},{"$f":"'8'!E22","v":9.2399999999999996E-2},0.1157,{"$f":"'8'!H22","v":1.4E-2},0.1017,0.25,2.5425E-2,{"$f":"VLOOKUP('Utility Group'!$B16,vldatabase,23,FALSE)","v":0.85},0.75,6.4833749999999996E-2,9.0258749999999999E-2,0.10425875,{"$f":"VLOOKUP('Utility Group'!$B16,vldatabase,28,FALSE)","v":16000},{"$f":"IF(O22>'Size Premium'!$A$5,'Size Premium'!$B$5,IF(O22>'Size Premium'!$A$6,'Size Premium'!$B$6,IF(O22>'Size Premium'!$A$7,'Size Premium'!$B$7,IF(O22>'Size Premium'!$A$8,'Size Premium'!$B$8,IF(O22>'Size Premium'!$A$9,'Size Premium'!$B$9,IF(O22>'Size Premium'!$A$10,'Size Premium'!$B$10,IF(O22>'Size Premium'!$A$11,'Size Premium'!$B$11,IF(O22>'Size Premium'!$A$12,'Size Premium'!$B$12,\"ERROR\"))))))))","v":5.0000000000000001E-3},0.109]
[15,{"$f":"VLOOKUP('Utility Group'!$B17,vldatabase,2,FALSE)","v":"Hawaiian Elec."},{"$f":"'8'!C23","v":2.3300000000000001E-2},{"$f":"'8'!E23","v":9.2399999999999996E-2},0.1157,{"$f":"'8'!H23","v":1.4E-2},0.1017,0.25,2.5425E-2,{"$f":"VLOOKUP('Utility Group'!$B17,vldatabase,23,FALSE)","v":0.8},0.75,6.1020000000000005E-2,8.6445000000000008E-2,0.10044500000000001,{"$f":"VLOOKUP('Utility Group'!$B17,vldatabase,28,FALSE)","v":4000},{"$f":"IF(O23>'Size Premium'!$A$5,'Size Premium'!$B$5,IF(O23>'Size Premium'!$A$6,'Size Premium'!$B$6,IF(O23>'Size Premium'!$A$7,'Size Premium'!$B$7,IF(O23>'Size Premium'!$A$8,'Size Premium'!$B$8,IF(O23>'Size Premium'!$A$9,'Size Premium'!$B$9,IF(O23>'Size Premium'!$A$10,'Size Premium'!$B$10,IF(O23>'Size Premium'!$A$11,'Size Premium'!$B$11,IF(O23>'Size Premium'!$A$12,'Size Premium'!$B$12,\"ERROR\"))))))))","v":1.0999999999999999E-2},0.111]
[16,{"$f":"VLOOKUP('Utility Group'!$B18,vldatabase,2,FALSE)","v":"IDACORP, Inc."},{"$f":"'8'!C24","v":2.3300000000000001E-2},{"$f":"'8'!E24","v":9.2399999999999996E-2},0.1157,{"$f":"'8'!H24","v":1.4E-2},0.1017,0.25,2.5425E-2,{"$f":"VLOOKUP('Utility Group'!$B18,vldatabase,23,FALSE)","v":0.8},0.75,6.1020000000000005E-2,8.6445000000000008E-2,0.10044500000000001,{"$f":"VLOOKUP('Utility Group'!$B18,vldatabase,28,FALSE)","v":4600},{"$f":"IF(O24>'Size Premium'!$A$5,'Size Premium'!$B$5,IF(O24>'Size Premium'!$A$6,'Size Premium'!$B$6,IF(O24>'Size Premium'!$A$7,'Size Premium'!$B$7,IF(O24>'Size Premium'!$A$8,'Size Premium'!$B$8,IF(O24>'Size Premium'!$A$9,'Size Premium'!$B$9,IF(O24>'Size Premium'!$A$10,'Size Premium'!$B$10,IF(O24>'Size Premium'!$A$11,'Size Premium'!$B$11,IF(O24>'Size Premium'!$A$12,'Size Premium'!$B$12,\"ERROR\"))))))))","v":7.9000000000000008E-3},0.108]
[17,{"$f":"VLOOKUP('Utility Group'!$B19,vldatabase,2,FALSE)","v":"NorthWestern Corp."},{"$f":"'8'!C25","v":2.3300000000000001E-2},{"$f":"'8'!E25","v":9.2399999999999996E-2},0.1157,{"$f":"'8'!H25","v":1.4E-2},0.1017,0.25,2.5425E-2,{"$f":"VLOOKUP('Utility Group'!$B19,vldatabase,23,FALSE)","v":0.9},0.75,6.86475E-2,9.4072500000000003E-2,0.1080725,{"$f":"VLOOKUP('Utility Group'!$B19,vldatabase,28,FALSE)","v":2700},{"$f":"IF(O25>'Size Premium'!$A$5,'Size Premium'!$B$5,IF(O25>'Size Premium'!$A$6,'Size Premium'!$B$6,IF(O25>'Size Premium'!$A$7,'Size Premium'!$B$7,IF(O25>'Size Premium'!$A$8,'Size Premium'!$B$8,IF(O25>'Size Premium'!$A$9,'Size Premium'!$B$9,IF(O25>'Size Premium'!$A$10,'Size Premium'!$B$10,IF(O25>'Size Premium'!$A$11,'Size Premium'!$B$11,IF(O25>'Size Premium'!$A$12,'Size Premium'!$B$12,\"ERROR\"))))))))","v":1.0999999999999999E-2},0.11899999999999999]
[18,{"$f":"VLOOKUP('Utility Group'!$B20,vldatabase,2,FALSE)","v":"OGE Energy Corp."},{"$f":"'8'!C26","v":2.3300000000000001E-2},{"$f":"'8'!E26","v":9.2399999999999996E-2},0.1157,{"$f":"'8'!H26","v":1.4E-2},0.1017,0.25,2.5425E-2,{"$f":"VLOOKUP('Utility Group'!$B20,vldatabase,23,FALSE)","v":1.05},0.75,8.008875E-2,0.10551375,0.11951375,{"$f":"VLOOKUP('Utility Group'!$B20,vldatabase,28,FALSE)","v":6400},{"$f":"IF(O26>'Size Premium'!$A$5,'Size Premium'!$B$5,IF(O26>'Size Premium'!$A$6,'Size Premium'!$B$6,IF(O26>'Size Premium'!$A$7,'Size Premium'!$B$7,IF(O26>'Size Premium'!$A$8,'Size Premium'!$B$8,IF(O26>'Size Premium'!$A$9,'Size Premium'!$B$9,IF(O26>'Size Premium'!$A$10,'Size Premium'!$B$10,IF(O26>'Size Premium'!$A$11,'Size Premium'!$B$11,IF(O26>'Size Premium'!$A$12,'Size Premium'!$B$12,\"ERROR\"))))))))","v":7.9000000000000008E-3},0.127]
[19,{"$f":"VLOOKUP('Utility Group'!$B21,vldatabase,2,FALSE)","v":"Otter Tail Corp."},{"$f":"'8'!C27","v":2.3300000000000001E-2},{"$f":"'8'!E27","v":9.2399999999999996E-2},0.1157,{"$f":"'8'!H27","v":1.4E-2},0.1017,0.25,2.5425E-2,{"$f":"VLOOKUP('Utility Group'!$B21,vldatabase,23,FALSE)","v":0.85},0.75,6.4833749999999996E-2,9.0258749999999999E-2,0.10425875,{"$f":"VLOOKUP('Utility Group'!$B21,vldatabase,28,FALSE)","v":1600},{"$f":"IF(O27>'Size Premium'!$A$5,'Size Premium'!$B$5,IF(O27>'Size Premium'!$A$6,'Size Premium'!$B$6,IF(O27>'Size Premium'!$A$7,'Size Premium'!$B$7,IF(O27>'Size Premium'!$A$8,'Size Premium'!$B$8,IF(O27>'Size Premium'!$A$9,'Size Premium'!$B$9,IF(O27>'Size Premium'!$A$10,'Size Premium'!$B$10,IF(O27>'Size Premium'!$A$11,'Size Premium'!$B$11,IF(O27>'Size Premium'!$A$12,'Size Premium'!$B$12,\"ERROR\"))))))))","v":1.47E-2},0.11899999999999999]
[20,{"$f":"VLOOKUP('Utility Group'!$B22,vldatabase,2,FALSE)","v":"PNM Resources"},{"$f":"'8'!C28","v":2.3300000000000001E-2},{"$f":"'8'!E28","v":9.2399999999999996E-2},0.1157,{"$f":"'8'!H28","v":1.4E-2},0.1017,0.25,2.5425E-2,{"$f":"VLOOKUP('Utility Group'!$B22,vldatabase,23,FALSE)","v":0.95},0.75,7.2461249999999991E-2,9.7886249999999994E-2,0.11188624999999999,{"$f":"VLOOKUP('Utility Group'!$B22,vldatabase,28,FALSE)","v":3100},{"$f":"IF(O28>'Size Premium'!$A$5,'Size Premium'!$B$5,IF(O28>'Size Premium'!$A$6,'Size Premium'!$B$6,IF(O28>'Size Premium'!$A$7,'Size Premium'!$B$7,IF(O28>'Size Premium'!$A$8,'Size Premium'!$B$8,IF(O28>'Size Premium'!$A$9,'Size Premium'!$B$9,IF(O28>'Size Premium'!$A$10,'Size Premium'!$B$10,IF(O28>'Size Premium'!$A$11,'Size Premium'!$B$11,IF(O28>'Size Premium'!$A$12,'Size Premium'!$B$12,\"ERROR\"))))))))","v":1.0999999999999999E-2},0.123]
[21,{"$f":"VLOOKUP('Utility Group'!$B23,vldatabase,2,FALSE)","v":"Sempra Energy"},{"$f":"'8'!C29","v":2.3300000000000001E-2},{"$f":"'8'!E29","v":9.2399999999999996E-2},0.1157,{"$f":"'8'!H29","v":1.4E-2},0.1017,0.25,2.5425E-2,{"$f":"VLOOKUP('Utility Group'!$B23,vldatabase,23,FALSE)","v":0.95},0.75,7.2461249999999991E-2,9.7886249999999994E-2,0.11188624999999999,{"$f":"VLOOKUP('Utility Group'!$B23,vldatabase,28,FALSE)","v":35000},{"$f":"IF(O29>'Size Premium'!$A$5,'Size Premium'!$B$5,IF(O29>'Size Premium'!$A$6,'Size Premium'!$B$6,IF(O29>'Size Premium'!$A$7,'Size Premium'!$B$7,IF(O29>'Size Premium'!$A$8,'Size Premium'!$B$8,IF(O29>'Size Premium'!$A$9,'Size Premium'!$B$9,IF(O29>'Size Premium'!$A$10,'Size Premium'!$B$10,IF(O29>'Size Premium'!$A$11,'Size Premium'!$B$11,IF(O29>'Size Premium'!$A$12,'Size Premium'!$B$12,\"ERROR\"))))))))","v":-2.8E-3},0.109]
[null,null,null,null,null,null,null,null,null,null,0.75]
[null,"Average",null,null,null,null,null,null,null,null,null,null,null,{"$f":"AVERAGE(N9:N29)","v":0.10734607142857143},null,null,{"$f":"AVERAGE(Q9:Q29)","v":0.11433333333333333}]
[null,"Midpoint (g)",null,null,null,null,null,null,null,null,null,null,null,{"$f":"AVERAGE(N42:N43)","v":0.109979375},null,null,{"$f":"AVERAGE(Q42:Q43)","v":0.11749999999999999}]
[]
["(a)",{"$f":"'8'!B34","v":"Weighted average for dividend paying components of S&P 500 index from zacks.com (retrieved Oct. 1, 2020)."}]
["(b)",{"$f":"'8'!B35","v":"Average of weighted average earnings growth rates from Value Line Investment Survey, IBES, and Zacks Investment Research for dividend-paying stocks in the S&P 500 based on data from http://finance.yahoo.com (retrieved Oct. 2, 2020), www.zacks.com (retrieved Oct. 1, 2020), and www.valueline.com (retrieved Oct. 1, 2020)."}]
[]
["(c)",{"$f":"'8'!B37","v":"Average yield on 30-year Treasury bonds for the six-months ending Sep. 2020 based on data from the Federal Reserve at https://fred.stlouisfed.org/.."}]
["(d)","Roger A. Morin, New Regulatory Finance, Pub. Util. Reports, Inc. (2006) at 190."]
["(e)",{"$f":"'8'!B38","v":"The Value Line Investment Survey (Jul. 24, Aug. 14 and Sep. 11, 2020)."}]
["(f)",{"$f":"'8'!B39","v":"Duff & Phelps, 2020 CRSP Deciles Size Study -- Supplementary Data Exhibits, Cost of Capital Navigator."}]
["(g)","Average of low and high values."]
[null,null,null,null,null,null,null,null,null,null,null,null,"Min",{"$f":"MIN(N9:N29)","v":9.6631250000000002E-2},null,null,{"$f":"MIN(Q9:Q29)","v":0.104}]
[null,null,null,null,null,null,null,null,null,null,null,null,"Max",{"$f":"MAX(N9:N29)","v":0.12332750000000001},null,null,{"$f":"MAX(Q9:Q29)","v":0.13100000000000001}]

{"sheet":"10 (1)","index":21,"n_rows":29,"n_cols":7,"rows_kept":29,"cut":false,"hidden":false,"merged":[[26,8,27,13],[26,1,27,6]]}
[{"$f":"'Exhibit List'!C12","v":"ELECTRIC UTILITY RISK PREMIUM"},null,null,null,null,null,{"$f":"'Exhibit List'!B12","v":"Exh. AMM-10"}]
[null,null,null,null,null,null,"Page 1 of 4"]
[{"$f":"'Exhibit List'!D12","v":"CURRENT BOND YIELD"}]
[]
[]
["Current Equity Risk Premium"]
["(a)","Avg. Yield over Study Period",null,null,null,null,{"$f":"ROUND(+'10 (3)'!G53,4)","v":8.1000000000000003E-2}]
["(b)","Average Utility Bond Yield",null,null,null,null,{"$f":"'Bond Yields'!I16","v":3.0099999999999998E-2}]
[null,null,"Change in Bond Yield",null,null,null,{"$f":"-G7+G8","v":-5.0900000000000001E-2}]
[]
["(c)","Risk Premium/Interest Rate Relationship",null,null,null,null,{"$f":"ROUND('10 (4)'!B46,4)","v":-0.42099999999999999}]
[null,null,"Adjustment to Average Risk Premium",null,null,null,{"$f":"G9*G11","v":2.1428900000000001E-2}]
[]
["(a)","Average Risk Premium over Study Period",null,null,null,null,{"$f":"ROUND('10 (3)'!J53,4)","v":3.7600000000000001E-2}]
[null,null,"Adjusted Risk Premium",null,null,null,{"$f":"G12+G14","v":5.9028900000000002E-2}]
[]
[]
["Implied Cost of Equity"]
["(b)","Baa Utility Bond Yield",null,null,null,null,{"$f":"'Bond Yields'!C16","v":3.3700000000000001E-2}]
[null,"Adjusted Equity Risk Premium",null,null,null,null,{"$f":"G15","v":5.9028900000000002E-2}]
[]
[null,"Risk Premium Cost of Equity",null,null,null,null,{"$f":"G19+G20","v":9.2728900000000003E-2}]
[]
[]
[]
["(a)",{"$f":"G1 & \", page 3.\"","v":"Exh. AMM-10, page 3."}]
["(b)",{"$f":"\"Average bond yield on all utility bonds and Baa subset for the six-months ending \"&'Bond Yields'!B14&\" based on data from Moody's Investors Service at www.credittrends.com.\"","v":"Average bond yield on all utility bonds and Baa subset for the six-months ending Sep. 2020 based on data from Moody's Investors Service at www.credittrends.com."}]
[]
["(c)",{"$f":"G1 & \", page 4.\"","v":"Exh. AMM-10, page 4."}]

{"sheet":"10 (2)","index":22,"n_rows":30,"n_cols":7,"rows_kept":30,"cut":false,"hidden":false,"merged":[[26,1,28,6]]}
[{"$f":"'Exhibit List'!C13","v":"ELECTRIC UTILITY RISK PREMIUM"},null,null,null,null,null,{"$f":"'Exhibit List'!B13","v":"Exh. AMM-10"}]
[null,null,null,null,null,null,"Page 2 of 4"]
[{"$f":"'Exhibit List'!D13","v":"PROJECTED BOND YIELD"}]
[]
[]
["Current Equity Risk Premium"]
["(a)","Avg. Yield over Study Period",null,null,null,null,{"$f":"ROUND(+'10 (3)'!G53,4)","v":8.1000000000000003E-2}]
["(b)","Average Utility Bond Yield 2021-2025",null,null,null,null,{"$f":"'Bond Yields'!O39","v":4.4299999999999999E-2}]
[null,null,"Change in Bond Yield",null,null,null,{"$f":"-G7+G8","v":-3.6700000000000003E-2}]
[]
["(c)","Risk Premium/Interest Rate Relationship",null,null,null,null,{"$f":"ROUND('10 (4)'!B46,4)","v":-0.42099999999999999}]
[null,null,"Adjustment to Average Risk Premium",null,null,null,{"$f":"G9*G11","v":1.5450700000000001E-2}]
[]
["(a)","Average Risk Premium over Study Period",null,null,null,null,{"$f":"ROUND('10 (3)'!J53,4)","v":3.7600000000000001E-2}]
[null,null,"Adjusted Risk Premium",null,null,null,{"$f":"G12+G14","v":5.3050700000000006E-2}]
[]
[]
["Implied Cost of Equity"]
["(b)","Baa Utility Bond Yield 2021-2025",null,null,null,null,{"$f":"'Bond Yields'!E39","v":4.7899999999999998E-2}]
[null,"Adjusted Equity Risk Premium",null,null,null,null,{"$f":"G15","v":5.3050700000000006E-2}]
[]
[null,"Risk Premium Cost of Equity",null,null,null,null,{"$f":"G19+G20","v":0.1009507}]
[]
[]
[]
["(a)",{"$f":"G1 & \", page 3.\"","v":"Exh. AMM-10, page 3."}]
["(b)",{"$f":"\"Yields on all utility bonds and Baa subset based on data from \" &'Bond Yields'!B73&\"; \" & 'Bond Yields'!B74 & \"; & Moody's Investors Service at www.credittrends.com.\"","v":"Yields on all utility bonds and Baa subset based on data from IHS Markit, Long-Term Macro Forecast - Baseline (Jun. 29, 2020); Energy Information Administration, Annual Energy Outlook 2020 (Jan. 29, 2020); & Moody's Investors Service at www.credittrends.com."}]
[]
[]
["(c)",{"$f":"G1 & \", page 4.\"","v":"Exh. AMM-10, page 4."}]

{"sheet":"10 (3)","index":23,"n_rows":58,"n_cols":15,"rows_kept":58,"cut":false,"hidden":false,"merged":[[54,1,56,10]]}
[{"$f":"'Exhibit List'!C14","v":"ELECTRIC UTILITY RISK PREMIUM"},null,null,null,null,null,null,null,null,null,{"$f":"'Exhibit List'!B14","v":"Exh. AMM-10"}]
[null,null,null,null,null,null,null,null,null,null,"Page 3 of 4"]
[{"$f":"'Exhibit List'!D14","v":"AUTHORIZED RETURNS"}]
[null,null,null,"(a)",null,null,"(b)"]
[null,null,null,"Allowed",null,null,"Average Utility",null,null,"Risk"]
[null,"Year",null,"ROE",null,null,"Bond Yield",null,null,"Premium"]
[null,1974,null,0.13100000000000001,null,null,9.2700000000000005E-2,null,null,{"$f":"D7-G7","v":3.8300000000000001E-2}]
[null,{"$f":"B7+1","v":1975},null,0.13200000000000001,null,null,9.8799999999999999E-2,null,null,{"$f":"D8-G8","v":3.3200000000000007E-2}]
[null,1976,null,0.13100000000000001,null,null,9.1700000000000004E-2,null,null,3.9300000000000002E-2,null,null,null,{"$f":"AVERAGE(G7:G9)","v":9.4399999999999998E-2},{"$f":"AVERAGE(J7:J9)","v":3.6933333333333339E-2}]
[null,1977,null,0.13300000000000001,null,null,8.5800000000000001E-2,null,null,4.7200000000000006E-2,null,null,null,{"$f":"AVERAGE(G8:G10)","v":9.2100000000000001E-2},{"$f":"AVERAGE(J8:J10)","v":3.9900000000000005E-2}]
[null,1978,null,0.13200000000000001,null,null,9.2200000000000004E-2,null,null,3.9800000000000002E-2,null,null,null,8.9899999999999994E-2,4.2100000000000005E-2]
[null,1979,null,0.13500000000000001,null,null,0.10390000000000001,null,null,3.1100000000000003E-2,null,null,null,9.3966666666666657E-2,3.9366666666666668E-2]
[null,1980,null,0.14230000000000001,null,null,0.13150000000000001,null,null,1.0800000000000004E-2,null,null,null,0.10920000000000001,2.7233333333333335E-2]
[null,1981,null,0.1522,null,null,0.15620000000000001,null,null,-4.0000000000000036E-3,null,null,null,0.13053333333333333,1.2633333333333335E-2]
[null,1982,null,0.1578,null,null,0.15329999999999999,null,null,4.500000000000004E-3,null,null,null,0.14699999999999999,3.7666666666666682E-3]
[null,1983,null,0.15359999999999999,null,null,0.1331,null,null,2.049999999999999E-2,null,null,null,0.14753333333333332,6.9999999999999967E-3]
[null,1984,null,0.1532,null,null,0.14030000000000001,null,null,1.2899999999999995E-2,null,null,null,0.14223333333333332,1.263333333333333E-2]
[null,1985,null,0.152,null,null,0.1229,null,null,2.9100000000000001E-2,null,null,null,0.1321,2.0833333333333329E-2]
[null,1986,null,0.13930000000000001,null,null,9.4600000000000004E-2,null,null,4.4700000000000004E-2,null,null,null,0.11926666666666667,2.8899999999999999E-2]
[null,1987,null,0.12989999999999999,null,null,9.98E-2,null,null,3.0099999999999988E-2,null,null,null,0.10576666666666668,3.4633333333333328E-2]
[null,1988,null,0.12790000000000001,null,null,0.1045,null,null,2.3400000000000018E-2,null,null,null,9.9633333333333338E-2,3.2733333333333337E-2]
[null,1989,null,0.12970000000000001,null,null,9.6600000000000005E-2,null,null,3.3100000000000004E-2,null,null,null,0.1003,2.8866666666666669E-2]
[null,1990,null,0.127,null,null,9.7600000000000006E-2,null,null,2.9399999999999996E-2,null,null,null,9.9566666666666678E-2,2.863333333333334E-2]
[null,1991,null,0.1255,null,null,9.2100000000000001E-2,null,null,3.3399999999999999E-2,null,null,null,9.5433333333333328E-2,3.1966666666666664E-2]
[null,1992,null,0.12089999999999999,null,null,8.5699999999999998E-2,null,null,3.5199999999999995E-2,null,null,null,9.1799999999999993E-2,3.2666666666666663E-2]
[null,1993,null,0.11409999999999999,null,null,7.5600000000000001E-2,null,null,3.8499999999999993E-2,null,null,null,8.4466666666666676E-2,3.5699999999999996E-2]
[null,1994,null,0.1134,null,null,8.3000000000000004E-2,null,null,3.0399999999999996E-2,null,null,null,8.1433333333333344E-2,3.4699999999999995E-2]
[null,1995,null,0.11550000000000001,null,null,7.9100000000000004E-2,null,null,3.6400000000000002E-2,null,null,null,7.9233333333333336E-2,3.5099999999999999E-2]
[null,1996,null,0.1139,null,null,7.7399999999999997E-2,null,null,3.6500000000000005E-2,null,null,null,7.9833333333333339E-2,3.4433333333333337E-2]
[null,1997,null,0.114,null,null,7.6300000000000007E-2,null,null,3.7699999999999997E-2,null,null,null,7.7600000000000002E-2,3.6866666666666666E-2]
[null,1998,null,0.1166,null,null,7.0000000000000007E-2,null,null,4.6599999999999989E-2,null,null,null,7.456666666666667E-2,4.0266666666666666E-2]
[null,1999,null,0.1077,null,null,7.5499999999999998E-2,null,null,3.2200000000000006E-2,null,null,null,7.3933333333333337E-2,3.8833333333333331E-2]
[null,2000,null,0.1143,null,null,8.09E-2,null,null,3.3399999999999999E-2,null,null,null,7.5466666666666668E-2,3.7399999999999996E-2]
[null,2001,null,0.1109,null,null,7.7200000000000005E-2,null,null,3.3699999999999994E-2,null,null,null,7.7866666666666653E-2,3.3099999999999997E-2]
[null,2002,null,0.1116,null,null,7.5300000000000006E-2,null,null,3.6299999999999999E-2,null,null,null,7.7800000000000008E-2,3.4466666666666666E-2]
[null,2003,null,0.10970000000000001,null,null,6.6100000000000006E-2,null,null,4.36E-2,null,null,null,7.2866666666666677E-2,3.7866666666666667E-2]
[null,2004,null,0.1075,null,null,6.2E-2,null,null,4.5499999999999999E-2,null,null,null,6.7800000000000013E-2,4.1800000000000004E-2]
[null,2005,null,0.10539999999999999,null,null,5.67E-2,null,null,4.8699999999999993E-2,null,null,null,6.1599999999999995E-2,4.5933333333333326E-2]
[null,2006,null,0.10340000000000001,null,null,6.08E-2,null,null,4.2600000000000006E-2,null,null,null,5.9833333333333329E-2,4.5600000000000002E-2]
[null,2007,null,0.1032,null,null,6.1100000000000002E-2,null,null,4.2099999999999999E-2,null,null,null,5.9533333333333327E-2,4.4466666666666661E-2]
[null,2008,null,0.1037,null,null,6.6500000000000004E-2,null,null,3.7199999999999997E-2,null,null,null,6.2800000000000009E-2,4.0633333333333334E-2]
[null,2009,null,0.1052,null,null,6.2799999999999995E-2,null,null,4.2400000000000007E-2,null,null,null,6.3466666666666657E-2,4.0566666666666668E-2]
[null,2010,null,0.10290000000000001,null,null,5.5599999999999997E-2,null,null,4.7300000000000009E-2,null,null,null,6.1633333333333339E-2,4.2300000000000004E-2]
[null,2011,null,0.1019,null,null,5.1299999999999998E-2,null,null,5.0600000000000006E-2,null,null,null,5.6566666666666661E-2,4.6766666666666679E-2]
[null,2012,null,0.1002,null,null,4.2599999999999999E-2,null,null,5.7599999999999998E-2,null,null,null,4.9833333333333334E-2,5.1833333333333342E-2]
[null,2013,null,9.8199999999999996E-2,null,null,4.5499999999999999E-2,null,null,5.2699999999999997E-2,null,null,null,4.6466666666666663E-2,5.3633333333333331E-2]
[null,2014,null,9.7600000000000006E-2,null,null,4.41E-2,null,null,5.3500000000000006E-2,null,null,null,4.4066666666666664E-2,5.4600000000000003E-2]
[null,2015,null,9.6000000000000002E-2,null,null,4.3700000000000003E-2,null,null,5.2299999999999999E-2,null,null,null,4.4433333333333332E-2,5.2833333333333336E-2]
[null,2016,null,9.6000000000000002E-2,null,null,4.1099999999999998E-2,null,null,5.4900000000000004E-2,null,null,null,4.2966666666666674E-2,5.3566666666666672E-2]
[null,2017,null,9.6799999999999997E-2,null,null,4.07E-2,null,null,5.6099999999999997E-2,null,null,null,{"$f":"AVERAGE(G48:G50)","v":4.1833333333333333E-2},{"$f":"AVERAGE(J48:J50)","v":5.4433333333333334E-2}]
[null,2018,null,9.5600000000000004E-2,null,null,4.3400000000000001E-2,null,null,5.2200000000000003E-2,null,null,null,4.1733333333333338E-2,5.4400000000000004E-2]
[null,2019,null,9.64E-2,null,null,3.8600000000000002E-2,null,null,5.7799999999999997E-2,null,null,null,{"$f":"AVERAGE(G50:G52)","v":4.0899999999999999E-2},{"$f":"AVERAGE(J50:J52)","v":5.5366666666666668E-2}]
[null,"Average",null,{"$f":"AVERAGE(D7:D52)","v":0.11863043478260871},null,null,{"$f":"AVERAGE(G7:G52)","v":8.1004347826086981E-2},null,null,{"$f":"AVERAGE(J7:J52)","v":3.762608695652174E-2}]
[]
["(a)","Major Rate Case Decisions, Regulatory Focus, Regulatory Research Associates (\"RRA\"); UtilityScope Regulatory Service, Argus.  Data for \"general\" rate cases (excluding limited-issue rider cases) beginning in 2006 (the first year such data presented by RRA)."]
[]
[]
["(b)","Moody's Investors Service."]

{"sheet":"10 (4)","index":24,"n_rows":46,"n_cols":9,"rows_kept":46,"cut":false,"hidden":false,"merged":[]}
[{"$f":"'Exhibit List'!C15","v":"ELECTRIC UTILITY RISK PREMIUM"},null,null,null,null,null,null,null,{"$f":"'Exhibit List'!B15","v":"Exh. AMM-10"}]
[null,null,null,null,null,null,null,null,"Page 4 of 4"]
[{"$f":"'Exhibit List'!D15","v":"REGRESSION RESULTS"}]
[]
[]
[]
[]
[]
[]
[]
[]
[]
[]
[]
[]
[]
[]
[]
[]
[]
[]
[]
[]
[]
[]
[]
[]
[]
["SUMMARY OUTPUT"]
[]
["Regression Statistics"]
["Multiple R",0.93662976655849206]
["R Square",0.87727531960341532]
["Adjusted R Square",0.87448612232167477]
["Standard Error",4.7862340344469612E-3]
["Observations",46]
[]
["ANOVA"]
[null,"df","SS","MS","F","Significance F"]
["Regression",1,7.2051751014222433E-3,7.2051751014222433E-3,314.52609155561913,1.1517787673561826E-21]
["Residual",44,1.0079535942299311E-3,2.2908036232498435E-5]
["Total",45,8.2131286956521748E-3]
[]
[null,"Coefficients","Standard Error","t Stat","P-value","Lower 95%","Upper 95%","Lower 95.0%","Upper 95.0%"]
["Intercept",7.1731079443340659E-2,2.04843984288826E-3,35.017420546849571,9.0299944264736109E-34,6.7602720205784977E-2,7.5859438680896341E-2,6.7602720205784977E-2,7.5859438680896341E-2]
["X Variable 1",-0.42102669056778214,2.3740031411704658E-2,-17.734883466085112,1.1517787673561826E-21,-0.46887158009120816,-0.37318180104435611,-0.46887158009120816,-0.37318180104435611]

{"sheet":"11","index":25,"n_rows":43,"n_cols":13,"rows_kept":43,"cut":false,"hidden":false,"merged":[]}
[{"$f":"'Exhibit List'!C16","v":"EXPECTED EARNINGS APPROACH"},null,null,null,null,null,null,null,null,{"$f":"'Exhibit List'!B16","v":"Exh. AMM-11"}]
[null,null,null,null,null,null,null,null,null,"Page 1 of 1"]
[{"$f":"'Exhibit List'!D16","v":"UTILITY GROUP"}]
[]
[null,null,null,"(a)",null,"(b)",null,"(c)"]
[null,null,null,"Expected Return",null,"Adjustment",null,"Adjusted Return"]
[null,"Company ",null,"on Common Equity",null,"Factor",null,"on Common Equity"]
[]
[{"$f":"A8+1","v":1},{"$f":"VLOOKUP('Utility Group'!$B3,vldatabase,2,FALSE)","v":"Algonquin Pwr & Util"},null,{"$f":"VLOOKUP('Utility Group'!$B3,vldatabase,18,FALSE)","v":"n/a"},null,{"$f":"'7'!I8","v":"n/a"},null,{"$f":"IF(D9=\"n/a\",\"n/a  \",D9*F9)","v":"n/a  "},null,null,null,null,{"$f":"IF(H9=\"n/a\",\"n/a\",IF(H9<$E$42,\"nmf\",IF(H9>$E$43,\"nmf\",H9)))","v":"nmf"}]
[{"$f":"A9+1","v":2},{"$f":"VLOOKUP('Utility Group'!$B4,vldatabase,2,FALSE)","v":"ALLETE"},null,{"$f":"VLOOKUP('Utility Group'!$B4,vldatabase,18,FALSE)","v":0.08},null,{"$f":"'7'!I9","v":1.0233475444905209},null,{"$f":"IF(D10=\"n/a\",\"n/a  \",D10*F10)","v":8.186780355924167E-2},null,null,null,null,{"$f":"IF(H10=\"n/a\",\"n/a\",IF(H10<$E$42,\"nmf\",IF(H10>$E$43,\"nmf\",H10)))","v":8.186780355924167E-2}]
[3,{"$f":"VLOOKUP('Utility Group'!$B5,vldatabase,2,FALSE)","v":"Ameren Corp."},null,{"$f":"VLOOKUP('Utility Group'!$B5,vldatabase,18,FALSE)","v":0.1},null,{"$f":"'7'!I10","v":1.0397996372575538},null,0.10397996372575538,null,null,null,null,{"$f":"IF(H11=\"n/a\",\"n/a\",IF(H11<$E$42,\"nmf\",IF(H11>$E$43,\"nmf\",H11)))","v":0.10397996372575538}]
[4,{"$f":"VLOOKUP('Utility Group'!$B6,vldatabase,2,FALSE)","v":"Avangrid, Inc."},null,{"$f":"VLOOKUP('Utility Group'!$B6,vldatabase,18,FALSE)","v":0.05},null,{"$f":"'7'!I11","v":1.0048029927210287},null,5.0240149636051439E-2,null,null,null,null,{"$f":"IF(H12=\"n/a\",\"n/a\",IF(H12<$E$42,\"nmf\",IF(H12>$E$43,\"nmf\",H12)))","v":"nmf"}]
[5,{"$f":"VLOOKUP('Utility Group'!$B7,vldatabase,2,FALSE)","v":"Avista Corp."},null,{"$f":"VLOOKUP('Utility Group'!$B7,vldatabase,18,FALSE)","v":7.4999999999999997E-2},null,{"$f":"'7'!I12","v":1.0181928137542391},null,7.6364461031567923E-2,null,null,null,null,{"$f":"IF(H13=\"n/a\",\"n/a\",IF(H13<$E$42,\"nmf\",IF(H13>$E$43,\"nmf\",H13)))","v":7.6364461031567923E-2}]
[6,{"$f":"VLOOKUP('Utility Group'!$B8,vldatabase,2,FALSE)","v":"Black Hills Corp."},null,{"$f":"VLOOKUP('Utility Group'!$B8,vldatabase,18,FALSE)","v":0.09},null,{"$f":"'7'!I13","v":1.023168899468563},null,9.2085200952170668E-2,null,null,null,null,{"$f":"IF(H14=\"n/a\",\"n/a\",IF(H14<$E$42,\"nmf\",IF(H14>$E$43,\"nmf\",H14)))","v":9.2085200952170668E-2}]
[7,{"$f":"VLOOKUP('Utility Group'!$B9,vldatabase,2,FALSE)","v":"CenterPoint Energy"},null,{"$f":"VLOOKUP('Utility Group'!$B9,vldatabase,18,FALSE)","v":0.105},null,{"$f":"'7'!I14","v":1.0384153881026108},null,0.10903361575077412,null,null,null,null,{"$f":"IF(H15=\"n/a\",\"n/a\",IF(H15<$E$42,\"nmf\",IF(H15>$E$43,\"nmf\",H15)))","v":0.10903361575077412}]
[8,{"$f":"VLOOKUP('Utility Group'!$B10,vldatabase,2,FALSE)","v":"CMS Energy Corp."},null,{"$f":"VLOOKUP('Utility Group'!$B10,vldatabase,18,FALSE)","v":0.13500000000000001},null,{"$f":"'7'!I15","v":1.0428664939104344},null,0.14078697667790865,null,null,null,null,{"$f":"IF(H16=\"n/a\",\"n/a\",IF(H16<$E$42,\"nmf\",IF(H16>$E$43,\"nmf\",H16)))","v":0.14078697667790865}]
[9,{"$f":"VLOOKUP('Utility Group'!$B11,vldatabase,2,FALSE)","v":"DTE Energy Co."},null,{"$f":"VLOOKUP('Utility Group'!$B11,vldatabase,18,FALSE)","v":0.11},null,{"$f":"'7'!I16","v":1.032628276218682},null,0.11358911038405502,null,null,null,null,{"$f":"IF(H17=\"n/a\",\"n/a\",IF(H17<$E$42,\"nmf\",IF(H17>$E$43,\"nmf\",H17)))","v":0.11358911038405502}]
[10,{"$f":"VLOOKUP('Utility Group'!$B12,vldatabase,2,FALSE)","v":"Edison International"},null,{"$f":"VLOOKUP('Utility Group'!$B12,vldatabase,18,FALSE)","v":0.11},null,{"$f":"'7'!I17","v":1.0284923784743512},null,0.11313416163217863,null,null,null,null,{"$f":"IF(H18=\"n/a\",\"n/a\",IF(H18<$E$42,\"nmf\",IF(H18>$E$43,\"nmf\",H18)))","v":0.11313416163217863}]
[11,{"$f":"VLOOKUP('Utility Group'!$B13,vldatabase,2,FALSE)","v":"Emera Inc."},null,{"$f":"VLOOKUP('Utility Group'!$B13,vldatabase,18,FALSE)","v":0.1},null,{"$f":"'7'!I18","v":1.0256832942668492},null,0.10256832942668492,null,null,null,null,{"$f":"IF(H19=\"n/a\",\"n/a\",IF(H19<$E$42,\"nmf\",IF(H19>$E$43,\"nmf\",H19)))","v":0.10256832942668492}]
[12,{"$f":"VLOOKUP('Utility Group'!$B14,vldatabase,2,FALSE)","v":"Entergy Corp."},null,{"$f":"VLOOKUP('Utility Group'!$B14,vldatabase,18,FALSE)","v":0.11},null,{"$f":"'7'!I19","v":1.026682456868073},null,0.11293507025548803,null,null,null,null,{"$f":"IF(H20=\"n/a\",\"n/a\",IF(H20<$E$42,\"nmf\",IF(H20>$E$43,\"nmf\",H20)))","v":0.11293507025548803}]
[13,{"$f":"VLOOKUP('Utility Group'!$B15,vldatabase,2,FALSE)","v":"Exelon Corp."},null,{"$f":"VLOOKUP('Utility Group'!$B15,vldatabase,18,FALSE)","v":0.09},null,{"$f":"'7'!I20","v":1.0219773995468513},null,9.1977965959216618E-2,null,null,null,null,{"$f":"IF(H21=\"n/a\",\"n/a\",IF(H21<$E$42,\"nmf\",IF(H21>$E$43,\"nmf\",H21)))","v":9.1977965959216618E-2}]
[14,{"$f":"VLOOKUP('Utility Group'!$B16,vldatabase,2,FALSE)","v":"FirstEnergy Corp."},null,{"$f":"VLOOKUP('Utility Group'!$B16,vldatabase,18,FALSE)","v":0.155},null,{"$f":"'7'!I21","v":1.0534790440400827},null,0.16328925182621282,null,null,null,null,{"$f":"IF(H22=\"n/a\",\"n/a\",IF(H22<$E$42,\"nmf\",IF(H22>$E$43,\"nmf\",H22)))","v":"nmf"}]
[15,{"$f":"VLOOKUP('Utility Group'!$B17,vldatabase,2,FALSE)","v":"Hawaiian Elec."},null,{"$f":"VLOOKUP('Utility Group'!$B17,vldatabase,18,FALSE)","v":8.5000000000000006E-2},null,{"$f":"'7'!I22","v":1.020296860103336},null,8.6725233108783564E-2,null,null,null,null,{"$f":"IF(H23=\"n/a\",\"n/a\",IF(H23<$E$42,\"nmf\",IF(H23>$E$43,\"nmf\",H23)))","v":8.6725233108783564E-2}]
[16,{"$f":"VLOOKUP('Utility Group'!$B18,vldatabase,2,FALSE)","v":"IDACORP, Inc."},null,{"$f":"VLOOKUP('Utility Group'!$B18,vldatabase,18,FALSE)","v":9.5000000000000001E-2},null,{"$f":"'7'!I23","v":1.0167447881781722},null,9.6590754876926352E-2,null,null,null,null,{"$f":"IF(H24=\"n/a\",\"n/a\",IF(H24<$E$42,\"nmf\",IF(H24>$E$43,\"nmf\",H24)))","v":9.6590754876926352E-2}]
[17,{"$f":"VLOOKUP('Utility Group'!$B19,vldatabase,2,FALSE)","v":"NorthWestern Corp."},null,{"$f":"VLOOKUP('Utility Group'!$B19,vldatabase,18,FALSE)","v":8.5000000000000006E-2},null,{"$f":"'7'!I24","v":1.0168847868674395},null,8.6435206883732366E-2,null,null,null,null,{"$f":"IF(H25=\"n/a\",\"n/a\",IF(H25<$E$42,\"nmf\",IF(H25>$E$43,\"nmf\",H25)))","v":8.6435206883732366E-2}]
[18,{"$f":"VLOOKUP('Utility Group'!$B20,vldatabase,2,FALSE)","v":"OGE Energy Corp."},null,{"$f":"VLOOKUP('Utility Group'!$B20,vldatabase,18,FALSE)","v":0.12},null,{"$f":"'7'!I25","v":0.9992412056144061},null,0.11990894467372873,null,null,null,null,{"$f":"IF(H26=\"n/a\",\"n/a\",IF(H26<$E$42,\"nmf\",IF(H26>$E$43,\"nmf\",H26)))","v":0.11990894467372873}]
[19,{"$f":"VLOOKUP('Utility Group'!$B21,vldatabase,2,FALSE)","v":"Otter Tail Corp."},null,{"$f":"VLOOKUP('Utility Group'!$B21,vldatabase,18,FALSE)","v":0.115},null,{"$f":"'7'!I26","v":1.0227251072199559},null,0.11761338733029493,null,null,null,null,{"$f":"IF(H27=\"n/a\",\"n/a\",IF(H27<$E$42,\"nmf\",IF(H27>$E$43,\"nmf\",H27)))","v":0.11761338733029493}]
[20,{"$f":"VLOOKUP('Utility Group'!$B22,vldatabase,2,FALSE)","v":"PNM Resources"},null,{"$f":"VLOOKUP('Utility Group'!$B22,vldatabase,18,FALSE)","v":9.5000000000000001E-2},null,{"$f":"'7'!I27","v":1.0468377114189762},null,9.9449582584802743E-2,null,null,null,null,{"$f":"IF(H28=\"n/a\",\"n/a\",IF(H28<$E$42,\"nmf\",IF(H28>$E$43,\"nmf\",H28)))","v":9.9449582584802743E-2}]
[21,{"$f":"VLOOKUP('Utility Group'!$B23,vldatabase,2,FALSE)","v":"Sempra Energy"},null,{"$f":"VLOOKUP('Utility Group'!$B23,vldatabase,18,FALSE)","v":0.105},null,{"$f":"'7'!I28","v":1.0532581593809553},null,0.11059210673500031,null,null,null,null,{"$f":"IF(H29=\"n/a\",\"n/a\",IF(H29<$E$42,\"nmf\",IF(H29>$E$43,\"nmf\",H29)))","v":0.11059210673500031}]
[null,"Average (d)",null,null,null,null,null,{"$f":"AVERAGE(M9:M29)","v":0.10309099308601725},null,null,null,"Max",{"$f":"MAX(M9:M29)","v":0.14078697667790865}]
[null,"Midpoint (d,e)",null,null,null,null,null,{"$f":"AVERAGE(M30:M31)","v":0.1085757188547383},null,null,null,"Min",{"$f":"MIN(M9:M29)","v":7.6364461031567923E-2}]
[]
[]
["(a)",{"$f":"'Proxy Group Risk Measures'!B35","v":"The Value Line Investment Survey (Jul. 24, Aug. 14 and Sep. 11, 2020)."}]
["(b)",{"$f":"\"Adjustment to convert year-end return to an average rate of return from \" & 'Exhibit List'!B9 & \".\"","v":"Adjustment to convert year-end return to an average rate of return from Exh. AMM-7."}]
["(c)","(a) x (b)."]
["(d)","Excludes highlighted values."]
["(e)","Average of low and high values."]
[]
[]
[]
[null,"Criteria Min",null,null,{"$f":"'6 (3)'!E42","v":6.4000000000000001E-2}]
[null,"Criteria Max",null,null,{"$f":"'6 (3)'!E43","v":0.14099999999999999}]

{"sheet":"12 (1)","index":26,"n_rows":55,"n_cols":10,"rows_kept":55,"cut":false,"hidden":false,"merged":[]}
[{"$f":"'Exhibit List'!C17","v":"DCF MODEL - NON-UTILITY GROUP"},null,null,null,null,null,null,null,null,{"$f":"'Exhibit List'!B17","v":"Exh. AMM-12"}]
[null,null,null,null,null,null,null,null,null,"Page 1 of 3"]
[{"$f":"'Exhibit List'!D17","v":"DIVIDEND YIELD"}]
[null,null,null,null,"(a)",null,"(b)"]
[null,"Company                ","Industry Group      ",null,"Price",null,"Dividends",null,"Yield"]
[{"$f":"A5+1","v":1},{"$f":"'Proxy Group Risk Measures'!B44","v":"Air Products & Chem."},"Chemical (Diversified)",null,{"$f":"TRANSPOSE('Stock Price (Non-Utility)'!C34:AU34)","v":286.44466666666665},null,5.36,null,{"$f":"G6/E6","v":1.8712165467676133E-2}]
[{"$f":"A6+1","v":2},{"$f":"'Proxy Group Risk Measures'!B45","v":"Amdocs Ltd."},"IT Services",null,60.72849999999999,null,1.31,null,2.1571420338062034E-2]
[3,{"$f":"'Proxy Group Risk Measures'!B46","v":"Amgen"},"Biotechnology",null,246.84933333333336,null,6.7,null,2.7142062364627274E-2]
[4,{"$f":"'Proxy Group Risk Measures'!B47","v":"Amphenol Corp."},"Electronics",null,105.69233333333334,null,1,null,9.4614241966462405E-3]
[5,{"$f":"'Proxy Group Risk Measures'!B48","v":"Apple Inc."},"Computers/Peripherals",null,420.53133333333324,null,3.33,null,7.9185538295204333E-3]
[6,{"$f":"'Proxy Group Risk Measures'!B49","v":"AT&T Inc."},"Telecom. Services",null,29.878666666666664,null,2.1,null,7.028426078807623E-2]
[7,{"$f":"'Proxy Group Risk Measures'!B50","v":"Baxter Int'l Inc."},"Med Supp Invasive",null,85.166000000000011,null,0.98,null,1.1506939388958033E-2]
[8,{"$f":"'Proxy Group Risk Measures'!B51","v":"Bristol-Myers Squibb"},"Drug",null,60.511999999999993,null,1.8,null,2.9746166049709151E-2]
[9,{"$f":"'Proxy Group Risk Measures'!B52","v":"Brown & Brown"},"Financial Svcs. (Div.)",null,44.923666666666676,null,0.34,null,7.568393793917088E-3]
[10,{"$f":"'Proxy Group Risk Measures'!B53","v":"Brown-Forman 'B'"},"Beverage",null,68.980333333333334,null,0.72,null,1.0437757621737596E-2]
[11,{"$f":"'Proxy Group Risk Measures'!B54","v":"Church & Dwight"},"Household Products",null,90.85533333333332,null,0.96,null,1.0566248174754005E-2]
[12,{"$f":"'Proxy Group Risk Measures'!B55","v":"Cisco Systems"},"Telecom. Equipment",null,45.854666666666681,null,1.44,null,3.1403564886162069E-2]
[13,{"$f":"'Proxy Group Risk Measures'!B56","v":"Coca-Cola"},"Beverage",null,47.456666666666671,null,1.68,null,3.540071644307087E-2]
[14,{"$f":"'Proxy Group Risk Measures'!B57","v":"Colgate-Palmolive"},"Household Products",null,75.99966666666667,null,1.76,null,2.3157996307001345E-2]
[15,{"$f":"'Proxy Group Risk Measures'!B58","v":"Comcast Corp."},"Cable TV",null,42.845666666666673,null,0.92,null,2.147241650264126E-2]
[16,{"$f":"'Proxy Group Risk Measures'!B59","v":"Commerce Bancshs."},"Bank (Midwest)",null,58.374999999999993,null,1.08,null,1.8501070663811566E-2]
[17,{"$f":"'Proxy Group Risk Measures'!B60","v":"Costco Wholesale"},"Retail Store",null,332.54466666666667,null,2.8,null,8.4199215343502727E-3]
[18,{"$f":"'Proxy Group Risk Measures'!B61","v":"CVS Health"},"Pharmacy Services",null,64.308666666666653,null,2,null,3.1100007256668366E-2]
[19,{"$f":"'Proxy Group Risk Measures'!B62","v":"Danaher Corp."},"Diversified Co.",null,200.08966666666669,null,0.72,null,3.5983867232857263E-3]
[20,{"$f":"'Proxy Group Risk Measures'!B63","v":"Gen'l Mills"},"Automotive",null,64.152000000000015,null,1.96,null,3.0552437959845361E-2]
[21,{"$f":"'Proxy Group Risk Measures'!B64","v":"Hormel Foods"},"Food Processing",null,50.905999999999992,null,1,null,1.9644049817310341E-2]
[22,{"$f":"'Proxy Group Risk Measures'!B65","v":"Intel Corp."},"Hotel/Gaming",null,52.119333333333337,null,1.32,null,2.5326494327121092E-2]
[23,{"$f":"'Proxy Group Risk Measures'!B66","v":"Int'l Flavors & Frag."},"Wireless Networking",null,126.20533333333334,null,3.12,null,2.4721617681239039E-2]
[24,{"$f":"'Proxy Group Risk Measures'!B67","v":"Johnson & Johnson"},"Med Supp Non-Invasive",null,148.46299999999999,null,4.04,null,2.7212167341357781E-2]
[25,{"$f":"'Proxy Group Risk Measures'!B68","v":"Kellogg"},"Food Processing",null,68.974666666666678,null,2.2999999999999998,null,3.3345576153563622E-2]
[26,{"$f":"'Proxy Group Risk Measures'!B69","v":"Kimberly-Clark"},"Household Products",null,151.72066666666669,null,4.28,null,2.8209736313664142E-2]
[27,{"$f":"'Proxy Group Risk Measures'!B70","v":"Lilly (Eli)"},"Drug",null,157.03,null,2.96,null,1.8849901292746607E-2]
[28,{"$f":"'Proxy Group Risk Measures'!B71","v":"Lockheed Martin"},"Aerospace/Defense",null,381.26500000000004,null,10,null,2.6228476256671865E-2]
[29,{"$f":"'Proxy Group Risk Measures'!B72","v":"Marsh & McLennan"},"Financial Svcs. (Div.)",null,115.27033333333335,null,1.86,null,1.613598179352305E-2]
[30,{"$f":"'Proxy Group Risk Measures'!B73","v":"McCormick & Co."},"Food Processing",null,196.43966666666671,null,2.5,null,1.2726553869805654E-2]
[31,{"$f":"'Proxy Group Risk Measures'!B74","v":"McDonald's Corp."},"Restaurant",null,199.73633333333333,null,5,null,2.5033001840760068E-2]
[32,{"$f":"'Proxy Group Risk Measures'!B75","v":"Merck & Co."},"Drug",null,80.918333333333337,null,2.44,null,3.0153858828860371E-2]
[33,{"$f":"'Proxy Group Risk Measures'!B76","v":"Microsoft Corp."},"Computer Software",null,208.47100000000003,null,2.04,null,9.7855337193182724E-3]
[34,{"$f":"'Proxy Group Risk Measures'!B77","v":"Northrop Grumman"},"Aerospace/Defense",null,321.97099999999995,null,5.8,null,1.8014044743160099E-2]
[35,{"$f":"'Proxy Group Risk Measures'!B78","v":"Oracle Corp."},"Drug",null,55.426000000000009,null,0.96,null,1.732039115216685E-2]
[36,{"$f":"'Proxy Group Risk Measures'!B79","v":"PepsiCo, Inc."},"Beverage",null,136.364,null,4.09,null,2.9993253351324394E-2]
[37,{"$f":"'Proxy Group Risk Measures'!B80","v":"Pfizer, Inc."},"Drug",null,37.802999999999997,null,1.52,null,4.0208449064889032E-2]
[38,{"$f":"'Proxy Group Risk Measures'!B81","v":"Procter & Gamble"},"Household Products",null,130.60566666666668,null,3.16,null,2.4194968569510766E-2]
[39,{"$f":"'Proxy Group Risk Measures'!B82","v":"Public Storage"},"R.E.I.T.",null,195.48400000000007,null,8,null,4.0924065396656488E-2]
[40,{"$f":"'Proxy Group Risk Measures'!B83","v":"Texas Instruments"},"Environmental",null,133.78766666666667,null,3.6,null,2.6908309933900237E-2]
[41,{"$f":"'Proxy Group Risk Measures'!B84","v":"Travelers Cos."},"Insurance (Prop/Cas.)",null,116.88733333333334,null,3.4,null,2.908783957200951E-2]
[42,{"$f":"'Proxy Group Risk Measures'!B85","v":"United Parcel Serv."},"Air Transport",null,138.48466666666664,null,4.04,null,2.917290482219452E-2]
[43,{"$f":"'Proxy Group Risk Measures'!B86","v":"Verizon Communic."},"Telecom. Services",null,57.372999999999983,null,2.4900000000000002,null,4.3400205671657414E-2]
[44,{"$f":"'Proxy Group Risk Measures'!B87","v":"Walmart Inc."},"Retail Store",null,131.44666666666663,null,2.1800000000000002,null,1.6584673124714719E-2]
[45,{"$f":"'Proxy Group Risk Measures'!B88","v":"Waste Management"},"Environmental",null,109.21300000000001,null,2.1800000000000002,null,1.9960993654601557E-2]
[]
[null,"     Average",null,null,null,null,null,null,{"$f":"AVERAGE(I6:I50)","v":2.3592554635183303E-2}]
[]
["(a)",{"$f":"'Stock Price (Non-Utility)'!B37","v":"Average of closing prices for 30 trading days ended Aug. 21, 2020."}]
["(b)","The Value Line Investment Survey, Summary & Index (Aug. 21, 2020)."]

{"sheet":"12 (2)","index":27,"n_rows":55,"n_cols":9,"rows_kept":55,"cut":false,"hidden":false,"merged":[[53,1,53,5],[4,2,4,7]]}
[{"$f":"'Exhibit List'!C18","v":"DCF MODEL - NON-UTILITY GROUP"},null,null,null,null,null,null,null,{"$f":"'Exhibit List'!B18","v":"Exh. AMM-12"}]
[null,null,null,null,null,null,null,null,"Page 2 of 3"]
[{"$f":"'Exhibit List'!D18","v":"GROWTH RATES"}]
[null,null,null,"(a)",null,"(b)",null,"(c)"]
[null,null,"Earnings Growth"]
[null,"Company                ",null,"Value Line",null,"IBES",null,"Zacks"]
[{"$f":"A6+1","v":1},{"$f":"'12 (1)'!B6","v":"Air Products & Chem."},null,0.12,null,0.1033,null,8.77E-2]
[2,{"$f":"'12 (1)'!B7","v":"Amdocs Ltd."}," ",9.5000000000000001E-2,null,4.3999999999999997E-2,null,8.5000000000000006E-2]
[3,{"$f":"'12 (1)'!B8","v":"Amgen"},null,6.5000000000000002E-2,null,6.8699999999999997E-2,null,7.5300000000000006E-2]
[4,{"$f":"'12 (1)'!B9","v":"Amphenol Corp."},null,0.09,null,0.03,null,7.51E-2]
[5,{"$f":"'12 (1)'!B10","v":"Apple Inc."},null,0.14000000000000001,null,0.1246,null,0.1067]
[6,{"$f":"'12 (1)'!B11","v":"AT&T Inc."},null,5.5E-2,null,2.8999999999999998E-3,null,5.5300000000000002E-2]
[7,{"$f":"'12 (1)'!B12","v":"Baxter Int'l Inc."},null,0.09,null,0.1,null,9.7500000000000003E-2]
[8,{"$f":"'12 (1)'!B13","v":"Bristol-Myers Squibb"},null,0.125,null,0.184,null,8.6300000000000002E-2]
[9,{"$f":"'12 (1)'!B14","v":"Brown & Brown"},null,0.105,null,8.9300000000000004E-2,null,"n/a"]
[10,{"$f":"'12 (1)'!B15","v":"Brown-Forman 'B'"},null,0.11,null,3.3300000000000003E-2,null,"n/a"]
[11,{"$f":"'12 (1)'!B16","v":"Church & Dwight"},null,0.08,null,9.4799999999999995E-2,null,8.8599999999999998E-2]
[12,{"$f":"'12 (1)'!B17","v":"Cisco Systems"},null,7.0000000000000007E-2,null,6.1800000000000001E-2,null,5.3999999999999999E-2]
[13,{"$f":"'12 (1)'!B18","v":"Coca-Cola"},null,6.5000000000000002E-2,null,2.9399999999999999E-2,null,4.8099999999999997E-2]
[14,{"$f":"'12 (1)'!B19","v":"Colgate-Palmolive"},null,0.05,null,5.91E-2,null,5.8900000000000001E-2]
[15,{"$f":"'12 (1)'!B20","v":"Comcast Corp."},null,0.13500000000000001,null,4.9500000000000002E-2,null,9.7000000000000003E-2]
[16,{"$f":"'12 (1)'!B21","v":"Commerce Bancshs."},null,0.05,null,-8.6999999999999994E-2,null,"n/a"]
[17,{"$f":"'12 (1)'!B22","v":"Costco Wholesale"},null,0.09,null,7.1499999999999994E-2,null,8.4000000000000005E-2]
[18,{"$f":"'12 (1)'!B23","v":"CVS Health"},null,0.06,null,6.3399999999999998E-2,null,5.5899999999999998E-2]
[19,{"$f":"'12 (1)'!B24","v":"Danaher Corp."},null,0.15,null,0.13020000000000001,null,0.1164]
[20,{"$f":"'12 (1)'!B25","v":"Gen'l Mills"},null,0.03,null,4.9000000000000002E-2,null,7.4999999999999997E-2]
[21,{"$f":"'12 (1)'!B26","v":"Hormel Foods"},null,8.5000000000000006E-2,null,2.9000000000000001E-2,null,7.4999999999999997E-2]
[22,{"$f":"'12 (1)'!B27","v":"Intel Corp."},null,7.0000000000000007E-2,null,8.6199999999999999E-2,null,7.4999999999999997E-2]
[23,{"$f":"'12 (1)'!B28","v":"Int'l Flavors & Frag."},null,0.08,null,3.8E-3,null,"n/a"]
[24,{"$f":"'12 (1)'!B29","v":"Johnson & Johnson"},null,0.1,null,5.0799999999999998E-2,null,5.7500000000000002E-2]
[25,{"$f":"'12 (1)'!B30","v":"Kellogg"},null,0.03,null,1.7500000000000002E-2,null,0.06]
[26,{"$f":"'12 (1)'!B31","v":"Kimberly-Clark"},null,7.0000000000000007E-2,null,6.2E-2,null,5.45E-2]
[27,{"$f":"'12 (1)'!B32","v":"Lilly (Eli)"},null,0.1,null,0.13170000000000001,null,0.1565]
[28,{"$f":"'12 (1)'!B33","v":"Lockheed Martin"},null,8.5000000000000006E-2,null,9.11E-2,null,6.93E-2]
[29,{"$f":"'12 (1)'!B34","v":"Marsh & McLennan"},null,0.09,null,4.87E-2,null,0.06]
[30,{"$f":"'12 (1)'!B35","v":"McCormick & Co."},null,6.5000000000000002E-2,null,0.05,null,5.7799999999999997E-2]
[31,{"$f":"'12 (1)'!B36","v":"McDonald's Corp."},null,0.08,null,3.8800000000000001E-2,null,7.6799999999999993E-2]
[32,{"$f":"'12 (1)'!B37","v":"Merck & Co."},null,0.09,null,6.25E-2,null,6.7400000000000002E-2]
[33,{"$f":"'12 (1)'!B38","v":"Microsoft Corp."},null,0.15,null,0.15,null,0.1371]
[34,{"$f":"'12 (1)'!B39","v":"Northrop Grumman"},null,0.105,null,8.6199999999999999E-2,null,"n/a"]
[35,{"$f":"'12 (1)'!B40","v":"Oracle Corp."},null,0.105,null,9.0399999999999994E-2,null,0.11]
[36,{"$f":"'12 (1)'!B41","v":"PepsiCo, Inc."},null,0.06,null,5.4800000000000001E-2,null,5.6099999999999997E-2]
[37,{"$f":"'12 (1)'!B42","v":"Pfizer, Inc."},null,8.5000000000000006E-2,null,5.3699999999999998E-2,null,4.2900000000000001E-2]
[38,{"$f":"'12 (1)'!B43","v":"Procter & Gamble"},null,8.5000000000000006E-2,null,7.7200000000000005E-2,null,7.4099999999999999E-2]
[39,{"$f":"'12 (1)'!B44","v":"Public Storage"},null,"n/a",null,0.17,null,3.4500000000000003E-2]
[40,{"$f":"'12 (1)'!B45","v":"Texas Instruments"},null,2.5000000000000001E-2,null,0.1,null,9.3299999999999994E-2]
[41,{"$f":"'12 (1)'!B46","v":"Travelers Cos."},null,9.5000000000000001E-2,null,3.0499999999999999E-2,null,6.6600000000000006E-2]
[42,{"$f":"'12 (1)'!B47","v":"United Parcel Serv."},null,0.06,null,5.8999999999999997E-2,null,7.7700000000000005E-2]
[43,{"$f":"'12 (1)'!B48","v":"Verizon Communic."},null,0.04,null,1.23E-2,null,3.4099999999999998E-2]
[44,{"$f":"'12 (1)'!B49","v":"Walmart Inc."},null,7.4999999999999997E-2,null,6.4100000000000004E-2,null,5.6300000000000003E-2]
[45,{"$f":"'12 (1)'!B50","v":"Waste Management"},null,5.5E-2,null,-1.26E-2,null,6.2899999999999998E-2]
[]
["(a)","The Value Line Investment Survey (various editions as of Aug. 21, 2020)."]
["(b)","www.finance.yahoo.com (retrieved Aug. 24, 2020)."]
["(c)","www.zacks.com (retrieved Aug. 24, 2020)."]

{"sheet":"12 (3)","index":28,"n_rows":65,"n_cols":15,"rows_kept":65,"cut":false,"hidden":false,"merged":[[5,3,5,8]]}
[{"$f":"'Exhibit List'!C19","v":"DCF MODEL - NON-UTILITY GROUP"},null,null,null,null,null,null,null,null,{"$f":"'Exhibit List'!B19","v":"Exh. AMM-12"}]
[null,null,null,null,null,null,null,null,null,"Page 3 of 3"]
[{"$f":"'Exhibit List'!D19","v":"DCF COST OF EQUITY ESTIMATES"}]
[]
[null,null,null,null,"(a)",null,"(a)",null,"(a)"]
[null,null,null,"Earnings Growth"]
[null,"Company                ",null,null,"Value Line",null,"IBES",null,"Zacks"]
[{"$f":"A7+1","v":1},{"$f":"'12 (1)'!B6","v":"Air Products & Chem."},null,null,{"$f":"IF('12 (2)'!D7=\"n/a\",\"n/a\",'12 (1)'!$I6+'12 (2)'!D7)","v":0.13871216546767612},null,{"$f":"IF('12 (2)'!F7=\"n/a\",\"n/a\",'12 (1)'!$I6+'12 (2)'!F7)","v":0.12201216546767614},null,{"$f":"IF('12 (2)'!H7=\"n/a\",\"n/a\",'12 (1)'!$I6+'12 (2)'!H7)","v":0.10641216546767614},null,null,null,{"$f":"IF(E8=\"n/a\",\"n/a\",IF(E8<$E$64,\"nmf\",IF(E8>$E$65,\"nmf\",E8)))","v":0.13871216546767612},{"$f":"IF(G8=\"n/a\",\"n/a\",IF(G8<$E$64,\"nmf\",IF(G8>$E$65,\"nmf\",G8)))","v":0.12201216546767614},{"$f":"IF(I8=\"n/a\",\"n/a\",IF(I8<$E$64,\"nmf\",IF(I8>$E$65,\"nmf\",I8)))","v":0.10641216546767614}]
[2,{"$f":"'12 (1)'!B7","v":"Amdocs Ltd."},null,null,{"$f":"IF('12 (2)'!D8=\"n/a\",\"n/a\",'12 (1)'!$I7+'12 (2)'!D8)","v":0.11657142033806203},null,{"$f":"IF('12 (2)'!F8=\"n/a\",\"n/a\",'12 (1)'!$I7+'12 (2)'!F8)","v":6.5571420338062028E-2},null,{"$f":"IF('12 (2)'!H8=\"n/a\",\"n/a\",'12 (1)'!$I7+'12 (2)'!H8)","v":0.10657142033806204},null,null,null,{"$f":"IF(E9=\"n/a\",\"n/a\",IF(E9<$E$64,\"nmf\",IF(E9>$E$65,\"nmf\",E9)))","v":0.11657142033806203},{"$f":"IF(G9=\"n/a\",\"n/a\",IF(G9<$E$64,\"nmf\",IF(G9>$E$65,\"nmf\",G9)))","v":6.5571420338062028E-2},{"$f":"IF(I9=\"n/a\",\"n/a\",IF(I9<$E$64,\"nmf\",IF(I9>$E$65,\"nmf\",I9)))","v":0.10657142033806204}]
[3,{"$f":"'12 (1)'!B8","v":"Amgen"},null,null,{"$f":"IF('12 (2)'!D9=\"n/a\",\"n/a\",'12 (1)'!$I8+'12 (2)'!D9)","v":9.214206236462727E-2},null,{"$f":"IF('12 (2)'!F9=\"n/a\",\"n/a\",'12 (1)'!$I8+'12 (2)'!F9)","v":9.5842062364627278E-2},null,{"$f":"IF('12 (2)'!H9=\"n/a\",\"n/a\",'12 (1)'!$I8+'12 (2)'!H9)","v":0.10244206236462727},null,null,null,{"$f":"IF(E10=\"n/a\",\"n/a\",IF(E10<$E$64,\"nmf\",IF(E10>$E$65,\"nmf\",E10)))","v":9.214206236462727E-2},{"$f":"IF(G10=\"n/a\",\"n/a\",IF(G10<$E$64,\"nmf\",IF(G10>$E$65,\"nmf\",G10)))","v":9.5842062364627278E-2},{"$f":"IF(I10=\"n/a\",\"n/a\",IF(I10<$E$64,\"nmf\",IF(I10>$E$65,\"nmf\",I10)))","v":0.10244206236462727}]
[4,{"$f":"'12 (1)'!B9","v":"Amphenol Corp."},null,null,{"$f":"IF('12 (2)'!D10=\"n/a\",\"n/a\",'12 (1)'!$I9+'12 (2)'!D10)","v":9.9461424196646234E-2},null,{"$f":"IF('12 (2)'!F10=\"n/a\",\"n/a\",'12 (1)'!$I9+'12 (2)'!F10)","v":3.9461424196646236E-2},null,{"$f":"IF('12 (2)'!H10=\"n/a\",\"n/a\",'12 (1)'!$I9+'12 (2)'!H10)","v":8.4561424196646237E-2},null,null,null,9.9461424196646234E-2,"nmf",8.4561424196646237E-2]
[5,{"$f":"'12 (1)'!B10","v":"Apple Inc."},null,null,{"$f":"IF('12 (2)'!D11=\"n/a\",\"n/a\",'12 (1)'!$I10+'12 (2)'!D11)","v":0.14791855382952046},null,{"$f":"IF('12 (2)'!F11=\"n/a\",\"n/a\",'12 (1)'!$I10+'12 (2)'!F11)","v":0.13251855382952044},null,{"$f":"IF('12 (2)'!H11=\"n/a\",\"n/a\",'12 (1)'!$I10+'12 (2)'!H11)","v":0.11461855382952044},null,null,null,"nmf",0.13251855382952044,0.11461855382952044]
[6,{"$f":"'12 (1)'!B11","v":"AT&T Inc."},null,null,{"$f":"IF('12 (2)'!D12=\"n/a\",\"n/a\",'12 (1)'!$I11+'12 (2)'!D12)","v":0.12528426078807622},null,{"$f":"IF('12 (2)'!F12=\"n/a\",\"n/a\",'12 (1)'!$I11+'12 (2)'!F12)","v":7.318426078807623E-2},null,{"$f":"IF('12 (2)'!H12=\"n/a\",\"n/a\",'12 (1)'!$I11+'12 (2)'!H12)","v":0.12558426078807622},null,null,null,0.12528426078807622,7.318426078807623E-2,0.12558426078807622]
[7,{"$f":"'12 (1)'!B12","v":"Baxter Int'l Inc."},null,null,{"$f":"IF('12 (2)'!D13=\"n/a\",\"n/a\",'12 (1)'!$I12+'12 (2)'!D13)","v":0.10150693938895802},null,{"$f":"IF('12 (2)'!F13=\"n/a\",\"n/a\",'12 (1)'!$I12+'12 (2)'!F13)","v":0.11150693938895803},null,{"$f":"IF('12 (2)'!H13=\"n/a\",\"n/a\",'12 (1)'!$I12+'12 (2)'!H13)","v":0.10900693938895803},null,null,null,0.10150693938895802,0.11150693938895803,0.10900693938895803]
[8,{"$f":"'12 (1)'!B13","v":"Bristol-Myers Squibb"},null,null,{"$f":"IF('12 (2)'!D14=\"n/a\",\"n/a\",'12 (1)'!$I13+'12 (2)'!D14)","v":0.15474616604970914},null,{"$f":"IF('12 (2)'!F14=\"n/a\",\"n/a\",'12 (1)'!$I13+'12 (2)'!F14)","v":0.21374616604970914},null,{"$f":"IF('12 (2)'!H14=\"n/a\",\"n/a\",'12 (1)'!$I13+'12 (2)'!H14)","v":0.11604616604970916},null,null,null,"nmf","nmf",0.11604616604970916]
[9,{"$f":"'12 (1)'!B14","v":"Brown & Brown"},null,null,{"$f":"IF('12 (2)'!D15=\"n/a\",\"n/a\",'12 (1)'!$I14+'12 (2)'!D15)","v":0.11256839379391709},null,{"$f":"IF('12 (2)'!F15=\"n/a\",\"n/a\",'12 (1)'!$I14+'12 (2)'!F15)","v":9.6868393793917096E-2},null,{"$f":"IF('12 (2)'!H15=\"n/a\",\"n/a\",'12 (1)'!$I14+'12 (2)'!H15)","v":"n/a"},null,null,null,0.11256839379391709,9.6868393793917096E-2,"n/a"]
[10,{"$f":"'12 (1)'!B15","v":"Brown-Forman 'B'"},null,null,{"$f":"IF('12 (2)'!D16=\"n/a\",\"n/a\",'12 (1)'!$I15+'12 (2)'!D16)","v":0.1204377576217376},null,{"$f":"IF('12 (2)'!F16=\"n/a\",\"n/a\",'12 (1)'!$I15+'12 (2)'!F16)","v":4.3737757621737601E-2},null,{"$f":"IF('12 (2)'!H16=\"n/a\",\"n/a\",'12 (1)'!$I15+'12 (2)'!H16)","v":"n/a"},null,null,null,0.1204377576217376,"nmf","n/a"]
[11,{"$f":"'12 (1)'!B16","v":"Church & Dwight"},null,null,{"$f":"IF('12 (2)'!D17=\"n/a\",\"n/a\",'12 (1)'!$I16+'12 (2)'!D17)","v":9.0566248174754005E-2},null,{"$f":"IF('12 (2)'!F17=\"n/a\",\"n/a\",'12 (1)'!$I16+'12 (2)'!F17)","v":0.105366248174754},null,{"$f":"IF('12 (2)'!H17=\"n/a\",\"n/a\",'12 (1)'!$I16+'12 (2)'!H17)","v":9.9166248174754001E-2},null,null,null,9.0566248174754005E-2,0.105366248174754,9.9166248174754001E-2]
[12,{"$f":"'12 (1)'!B17","v":"Cisco Systems"},null,null,{"$f":"IF('12 (2)'!D18=\"n/a\",\"n/a\",'12 (1)'!$I17+'12 (2)'!D18)","v":0.10140356488616208},null,{"$f":"IF('12 (2)'!F18=\"n/a\",\"n/a\",'12 (1)'!$I17+'12 (2)'!F18)","v":9.3203564886162077E-2},null,{"$f":"IF('12 (2)'!H18=\"n/a\",\"n/a\",'12 (1)'!$I17+'12 (2)'!H18)","v":8.5403564886162076E-2},null,null,null,0.10140356488616208,9.3203564886162077E-2,8.5403564886162076E-2]
[13,{"$f":"'12 (1)'!B18","v":"Coca-Cola"},null,null,{"$f":"IF('12 (2)'!D19=\"n/a\",\"n/a\",'12 (1)'!$I18+'12 (2)'!D19)","v":0.10040071644307087},null,{"$f":"IF('12 (2)'!F19=\"n/a\",\"n/a\",'12 (1)'!$I18+'12 (2)'!F19)","v":6.4800716443070866E-2},null,{"$f":"IF('12 (2)'!H19=\"n/a\",\"n/a\",'12 (1)'!$I18+'12 (2)'!H19)","v":8.350071644307086E-2},null,null,null,0.10040071644307087,6.4800716443070866E-2,8.350071644307086E-2]
[14,{"$f":"'12 (1)'!B19","v":"Colgate-Palmolive"},null,null,{"$f":"IF('12 (2)'!D20=\"n/a\",\"n/a\",'12 (1)'!$I19+'12 (2)'!D20)","v":7.3157996307001344E-2},null,{"$f":"IF('12 (2)'!F20=\"n/a\",\"n/a\",'12 (1)'!$I19+'12 (2)'!F20)","v":8.2257996307001341E-2},null,{"$f":"IF('12 (2)'!H20=\"n/a\",\"n/a\",'12 (1)'!$I19+'12 (2)'!H20)","v":8.2057996307001349E-2},null,null,null,7.3157996307001344E-2,8.2257996307001341E-2,8.2057996307001349E-2]
[15,{"$f":"'12 (1)'!B20","v":"Comcast Corp."},null,null,{"$f":"IF('12 (2)'!D21=\"n/a\",\"n/a\",'12 (1)'!$I20+'12 (2)'!D21)","v":0.15647241650264127},null,{"$f":"IF('12 (2)'!F21=\"n/a\",\"n/a\",'12 (1)'!$I20+'12 (2)'!F21)","v":7.0972416502641258E-2},null,{"$f":"IF('12 (2)'!H21=\"n/a\",\"n/a\",'12 (1)'!$I20+'12 (2)'!H21)","v":0.11847241650264126},null,null,null,"nmf",7.0972416502641258E-2,0.11847241650264126]
[16,{"$f":"'12 (1)'!B21","v":"Commerce Bancshs."},null,null,{"$f":"IF('12 (2)'!D22=\"n/a\",\"n/a\",'12 (1)'!$I21+'12 (2)'!D22)","v":6.8501070663811572E-2},null,{"$f":"IF('12 (2)'!F22=\"n/a\",\"n/a\",'12 (1)'!$I21+'12 (2)'!F22)","v":-6.8498929336188424E-2},null,{"$f":"IF('12 (2)'!H22=\"n/a\",\"n/a\",'12 (1)'!$I21+'12 (2)'!H22)","v":"n/a"},null,null,null,6.8501070663811572E-2,"nmf","n/a"]
[17,{"$f":"'12 (1)'!B22","v":"Costco Wholesale"},null,null,{"$f":"IF('12 (2)'!D23=\"n/a\",\"n/a\",'12 (1)'!$I22+'12 (2)'!D23)","v":9.8419921534350266E-2},null,{"$f":"IF('12 (2)'!F23=\"n/a\",\"n/a\",'12 (1)'!$I22+'12 (2)'!F23)","v":7.9919921534350263E-2},null,{"$f":"IF('12 (2)'!H23=\"n/a\",\"n/a\",'12 (1)'!$I22+'12 (2)'!H23)","v":9.2419921534350274E-2},null,null,null,9.8419921534350266E-2,7.9919921534350263E-2,9.2419921534350274E-2]
[18,{"$f":"'12 (1)'!B23","v":"CVS Health"},null,null,{"$f":"IF('12 (2)'!D24=\"n/a\",\"n/a\",'12 (1)'!$I23+'12 (2)'!D24)","v":9.1100007256668364E-2},null,{"$f":"IF('12 (2)'!F24=\"n/a\",\"n/a\",'12 (1)'!$I23+'12 (2)'!F24)","v":9.4500007256668364E-2},null,{"$f":"IF('12 (2)'!H24=\"n/a\",\"n/a\",'12 (1)'!$I23+'12 (2)'!H24)","v":8.7000007256668371E-2},null,null,null,9.1100007256668364E-2,9.4500007256668364E-2,8.7000007256668371E-2]
[19,{"$f":"'12 (1)'!B24","v":"Danaher Corp."},null,null,{"$f":"IF('12 (2)'!D25=\"n/a\",\"n/a\",'12 (1)'!$I24+'12 (2)'!D25)","v":0.15359838672328571},null,{"$f":"IF('12 (2)'!F25=\"n/a\",\"n/a\",'12 (1)'!$I24+'12 (2)'!F25)","v":0.13379838672328573},null,{"$f":"IF('12 (2)'!H25=\"n/a\",\"n/a\",'12 (1)'!$I24+'12 (2)'!H25)","v":0.11999838672328574},null,null,null,"nmf",0.13379838672328573,0.11999838672328574]
[20,{"$f":"'12 (1)'!B25","v":"Gen'l Mills"},null,null,{"$f":"IF('12 (2)'!D26=\"n/a\",\"n/a\",'12 (1)'!$I25+'12 (2)'!D26)","v":6.0552437959845357E-2},null,{"$f":"IF('12 (2)'!F26=\"n/a\",\"n/a\",'12 (1)'!$I25+'12 (2)'!F26)","v":7.955243795984536E-2},null,{"$f":"IF('12 (2)'!H26=\"n/a\",\"n/a\",'12 (1)'!$I25+'12 (2)'!H26)","v":0.10555243795984535},null,null,null,"nmf",7.955243795984536E-2,0.10555243795984535]
[21,{"$f":"'12 (1)'!B26","v":"Hormel Foods"},null,null,{"$f":"IF('12 (2)'!D27=\"n/a\",\"n/a\",'12 (1)'!$I26+'12 (2)'!D27)","v":0.10464404981731035},null,{"$f":"IF('12 (2)'!F27=\"n/a\",\"n/a\",'12 (1)'!$I26+'12 (2)'!F27)","v":4.8644049817310339E-2},null,{"$f":"IF('12 (2)'!H27=\"n/a\",\"n/a\",'12 (1)'!$I26+'12 (2)'!H27)","v":9.4644049817310338E-2},null,null,null,0.10464404981731035,"nmf",9.4644049817310338E-2]
[22,{"$f":"'12 (1)'!B27","v":"Intel Corp."},null,null,{"$f":"IF('12 (2)'!D28=\"n/a\",\"n/a\",'12 (1)'!$I27+'12 (2)'!D28)","v":9.5326494327121092E-2},null,{"$f":"IF('12 (2)'!F28=\"n/a\",\"n/a\",'12 (1)'!$I27+'12 (2)'!F28)","v":0.11152649432712108},null,{"$f":"IF('12 (2)'!H28=\"n/a\",\"n/a\",'12 (1)'!$I27+'12 (2)'!H28)","v":0.1003264943271211},null,null,null,9.5326494327121092E-2,0.11152649432712108,0.1003264943271211]
[23,{"$f":"'12 (1)'!B28","v":"Int'l Flavors & Frag."},null,null,{"$f":"IF('12 (2)'!D29=\"n/a\",\"n/a\",'12 (1)'!$I28+'12 (2)'!D29)","v":0.10472161768123904},null,{"$f":"IF('12 (2)'!F29=\"n/a\",\"n/a\",'12 (1)'!$I28+'12 (2)'!F29)","v":2.852161768123904E-2},null,{"$f":"IF('12 (2)'!H29=\"n/a\",\"n/a\",'12 (1)'!$I28+'12 (2)'!H29)","v":"n/a"},null,null,null,0.10472161768123904,"nmf","n/a"]
[24,{"$f":"'12 (1)'!B29","v":"Johnson & Johnson"},null,null,{"$f":"IF('12 (2)'!D30=\"n/a\",\"n/a\",'12 (1)'!$I29+'12 (2)'!D30)","v":0.12721216734135779},null,{"$f":"IF('12 (2)'!F30=\"n/a\",\"n/a\",'12 (1)'!$I29+'12 (2)'!F30)","v":7.8012167341357783E-2},null,{"$f":"IF('12 (2)'!H30=\"n/a\",\"n/a\",'12 (1)'!$I29+'12 (2)'!H30)","v":8.471216734135778E-2},null,null,null,0.12721216734135779,7.8012167341357783E-2,8.471216734135778E-2]
[25,{"$f":"'12 (1)'!B30","v":"Kellogg"},null,null,{"$f":"IF('12 (2)'!D31=\"n/a\",\"n/a\",'12 (1)'!$I30+'12 (2)'!D31)","v":6.3345576153563621E-2},null,{"$f":"IF('12 (2)'!F31=\"n/a\",\"n/a\",'12 (1)'!$I30+'12 (2)'!F31)","v":5.0845576153563624E-2},null,{"$f":"IF('12 (2)'!H31=\"n/a\",\"n/a\",'12 (1)'!$I30+'12 (2)'!H31)","v":9.334557615356362E-2},null,null,null,"nmf","nmf",9.334557615356362E-2]
[26,{"$f":"'12 (1)'!B31","v":"Kimberly-Clark"},null,null,{"$f":"IF('12 (2)'!D32=\"n/a\",\"n/a\",'12 (1)'!$I31+'12 (2)'!D32)","v":9.8209736313664142E-2},null,{"$f":"IF('12 (2)'!F32=\"n/a\",\"n/a\",'12 (1)'!$I31+'12 (2)'!F32)","v":9.0209736313664135E-2},null,{"$f":"IF('12 (2)'!H32=\"n/a\",\"n/a\",'12 (1)'!$I31+'12 (2)'!H32)","v":8.2709736313664142E-2},null,null,null,9.8209736313664142E-2,9.0209736313664135E-2,8.2709736313664142E-2]
[27,{"$f":"'12 (1)'!B32","v":"Lilly (Eli)"},null,null,{"$f":"IF('12 (2)'!D33=\"n/a\",\"n/a\",'12 (1)'!$I32+'12 (2)'!D33)","v":0.11884990129274661},null,{"$f":"IF('12 (2)'!F33=\"n/a\",\"n/a\",'12 (1)'!$I32+'12 (2)'!F33)","v":0.15054990129274662},null,{"$f":"IF('12 (2)'!H33=\"n/a\",\"n/a\",'12 (1)'!$I32+'12 (2)'!H33)","v":0.17534990129274661},null,null,null,0.11884990129274661,"nmf","nmf"]
[28,{"$f":"'12 (1)'!B33","v":"Lockheed Martin"},null,null,{"$f":"IF('12 (2)'!D34=\"n/a\",\"n/a\",'12 (1)'!$I33+'12 (2)'!D34)","v":0.11122847625667187},null,{"$f":"IF('12 (2)'!F34=\"n/a\",\"n/a\",'12 (1)'!$I33+'12 (2)'!F34)","v":0.11732847625667187},null,{"$f":"IF('12 (2)'!H34=\"n/a\",\"n/a\",'12 (1)'!$I33+'12 (2)'!H34)","v":9.5528476256671865E-2},null,null,null,0.11122847625667187,0.11732847625667187,9.5528476256671865E-2]
[29,{"$f":"'12 (1)'!B34","v":"Marsh & McLennan"},null,null,{"$f":"IF('12 (2)'!D35=\"n/a\",\"n/a\",'12 (1)'!$I34+'12 (2)'!D35)","v":0.10613598179352304},null,{"$f":"IF('12 (2)'!F35=\"n/a\",\"n/a\",'12 (1)'!$I34+'12 (2)'!F35)","v":6.4835981793523054E-2},null,{"$f":"IF('12 (2)'!H35=\"n/a\",\"n/a\",'12 (1)'!$I34+'12 (2)'!H35)","v":7.6135981793523044E-2},null,null,null,0.10613598179352304,6.4835981793523054E-2,7.6135981793523044E-2]
[30,{"$f":"'12 (1)'!B35","v":"McCormick & Co."},null,null,{"$f":"IF('12 (2)'!D36=\"n/a\",\"n/a\",'12 (1)'!$I35+'12 (2)'!D36)","v":7.7726553869805662E-2},null,{"$f":"IF('12 (2)'!F36=\"n/a\",\"n/a\",'12 (1)'!$I35+'12 (2)'!F36)","v":6.2726553869805662E-2},null,{"$f":"IF('12 (2)'!H36=\"n/a\",\"n/a\",'12 (1)'!$I35+'12 (2)'!H36)","v":7.052655386980565E-2},null,null,null,7.7726553869805662E-2,"nmf",7.052655386980565E-2]
[31,{"$f":"'12 (1)'!B36","v":"McDonald's Corp."},null,null,{"$f":"IF('12 (2)'!D37=\"n/a\",\"n/a\",'12 (1)'!$I36+'12 (2)'!D37)","v":0.10503300184076007},null,{"$f":"IF('12 (2)'!F37=\"n/a\",\"n/a\",'12 (1)'!$I36+'12 (2)'!F37)","v":6.3833001840760073E-2},null,{"$f":"IF('12 (2)'!H37=\"n/a\",\"n/a\",'12 (1)'!$I36+'12 (2)'!H37)","v":0.10183300184076007},null,null,null,0.10503300184076007,"nmf",0.10183300184076007]
[32,{"$f":"'12 (1)'!B37","v":"Merck & Co."},null,null,{"$f":"IF('12 (2)'!D38=\"n/a\",\"n/a\",'12 (1)'!$I37+'12 (2)'!D38)","v":0.12015385882886037},null,{"$f":"IF('12 (2)'!F38=\"n/a\",\"n/a\",'12 (1)'!$I37+'12 (2)'!F38)","v":9.2653858828860375E-2},null,{"$f":"IF('12 (2)'!H38=\"n/a\",\"n/a\",'12 (1)'!$I37+'12 (2)'!H38)","v":9.7553858828860376E-2},null,null,null,0.12015385882886037,9.2653858828860375E-2,9.7553858828860376E-2]
[33,{"$f":"'12 (1)'!B38","v":"Microsoft Corp."},null,null,{"$f":"IF('12 (2)'!D39=\"n/a\",\"n/a\",'12 (1)'!$I38+'12 (2)'!D39)","v":0.15978553371931828},null,{"$f":"IF('12 (2)'!F39=\"n/a\",\"n/a\",'12 (1)'!$I38+'12 (2)'!F39)","v":0.15978553371931828},null,{"$f":"IF('12 (2)'!H39=\"n/a\",\"n/a\",'12 (1)'!$I38+'12 (2)'!H39)","v":0.14688553371931828},null,null,null,"nmf","nmf","nmf"]
[34,{"$f":"'12 (1)'!B39","v":"Northrop Grumman"},null,null,{"$f":"IF('12 (2)'!D40=\"n/a\",\"n/a\",'12 (1)'!$I39+'12 (2)'!D40)","v":0.12301404474316009},null,{"$f":"IF('12 (2)'!F40=\"n/a\",\"n/a\",'12 (1)'!$I39+'12 (2)'!F40)","v":0.10421404474316009},null,{"$f":"IF('12 (2)'!H40=\"n/a\",\"n/a\",'12 (1)'!$I39+'12 (2)'!H40)","v":"n/a"},null,null,null,0.12301404474316009,0.10421404474316009,"n/a"]
[35,{"$f":"'12 (1)'!B40","v":"Oracle Corp."},null,null,{"$f":"IF('12 (2)'!D41=\"n/a\",\"n/a\",'12 (1)'!$I40+'12 (2)'!D41)","v":0.12232039115216685},null,{"$f":"IF('12 (2)'!F41=\"n/a\",\"n/a\",'12 (1)'!$I40+'12 (2)'!F41)","v":0.10772039115216685},null,{"$f":"IF('12 (2)'!H41=\"n/a\",\"n/a\",'12 (1)'!$I40+'12 (2)'!H41)","v":0.12732039115216684},null,null,null,0.12232039115216685,0.10772039115216685,0.12732039115216684]
[36,{"$f":"'12 (1)'!B41","v":"PepsiCo, Inc."},null,null,{"$f":"IF('12 (2)'!D42=\"n/a\",\"n/a\",'12 (1)'!$I41+'12 (2)'!D42)","v":8.9993253351324395E-2},null,{"$f":"IF('12 (2)'!F42=\"n/a\",\"n/a\",'12 (1)'!$I41+'12 (2)'!F42)","v":8.4793253351324399E-2},null,{"$f":"IF('12 (2)'!H42=\"n/a\",\"n/a\",'12 (1)'!$I41+'12 (2)'!H42)","v":8.6093253351324395E-2},null,null,null,8.9993253351324395E-2,8.4793253351324399E-2,8.6093253351324395E-2]
[37,{"$f":"'12 (1)'!B42","v":"Pfizer, Inc."},null,null,{"$f":"IF('12 (2)'!D43=\"n/a\",\"n/a\",'12 (1)'!$I42+'12 (2)'!D43)","v":0.12520844906488904},null,{"$f":"IF('12 (2)'!F43=\"n/a\",\"n/a\",'12 (1)'!$I42+'12 (2)'!F43)","v":9.390844906488903E-2},null,{"$f":"IF('12 (2)'!H43=\"n/a\",\"n/a\",'12 (1)'!$I42+'12 (2)'!H43)","v":8.3108449064889039E-2},null,null,null,0.12520844906488904,9.390844906488903E-2,8.3108449064889039E-2]
[38,{"$f":"'12 (1)'!B43","v":"Procter & Gamble"},null,null,{"$f":"IF('12 (2)'!D44=\"n/a\",\"n/a\",'12 (1)'!$I43+'12 (2)'!D44)","v":0.10919496856951078},null,{"$f":"IF('12 (2)'!F44=\"n/a\",\"n/a\",'12 (1)'!$I43+'12 (2)'!F44)","v":0.10139496856951077},null,{"$f":"IF('12 (2)'!H44=\"n/a\",\"n/a\",'12 (1)'!$I43+'12 (2)'!H44)","v":9.8294968569510768E-2},null,null,null,0.10919496856951078,0.10139496856951077,9.8294968569510768E-2]
[39,{"$f":"'12 (1)'!B44","v":"Public Storage"},null,null,{"$f":"IF('12 (2)'!D45=\"n/a\",\"n/a\",'12 (1)'!$I44+'12 (2)'!D45)","v":"n/a"},null,{"$f":"IF('12 (2)'!F45=\"n/a\",\"n/a\",'12 (1)'!$I44+'12 (2)'!F45)","v":0.21092406539665651},null,{"$f":"IF('12 (2)'!H45=\"n/a\",\"n/a\",'12 (1)'!$I44+'12 (2)'!H45)","v":7.5424065396656498E-2},null,null,null,"n/a","nmf",7.5424065396656498E-2]
[40,{"$f":"'12 (1)'!B45","v":"Texas Instruments"},null,null,{"$f":"IF('12 (2)'!D46=\"n/a\",\"n/a\",'12 (1)'!$I45+'12 (2)'!D46)","v":5.1908309933900235E-2},null,{"$f":"IF('12 (2)'!F46=\"n/a\",\"n/a\",'12 (1)'!$I45+'12 (2)'!F46)","v":0.12690830993390023},null,{"$f":"IF('12 (2)'!H46=\"n/a\",\"n/a\",'12 (1)'!$I45+'12 (2)'!H46)","v":0.12020830993390023},null,null,null,"nmf",0.12690830993390023,0.12020830993390023]
[41,{"$f":"'12 (1)'!B46","v":"Travelers Cos."},null,null,{"$f":"IF('12 (2)'!D47=\"n/a\",\"n/a\",'12 (1)'!$I46+'12 (2)'!D47)","v":0.12408783957200951},null,{"$f":"IF('12 (2)'!F47=\"n/a\",\"n/a\",'12 (1)'!$I46+'12 (2)'!F47)","v":5.9587839572009513E-2},null,{"$f":"IF('12 (2)'!H47=\"n/a\",\"n/a\",'12 (1)'!$I46+'12 (2)'!H47)","v":9.568783957200952E-2},null,null,null,0.12408783957200951,"nmf",9.568783957200952E-2]
[42,{"$f":"'12 (1)'!B47","v":"United Parcel Serv."},null,null,{"$f":"IF('12 (2)'!D48=\"n/a\",\"n/a\",'12 (1)'!$I47+'12 (2)'!D48)","v":8.9172904822194518E-2},null,{"$f":"IF('12 (2)'!F48=\"n/a\",\"n/a\",'12 (1)'!$I47+'12 (2)'!F48)","v":8.8172904822194517E-2},null,{"$f":"IF('12 (2)'!H48=\"n/a\",\"n/a\",'12 (1)'!$I47+'12 (2)'!H48)","v":0.10687290482219453},null,null,null,8.9172904822194518E-2,8.8172904822194517E-2,0.10687290482219453]
[43,{"$f":"'12 (1)'!B48","v":"Verizon Communic."},null,null,{"$f":"IF('12 (2)'!D49=\"n/a\",\"n/a\",'12 (1)'!$I48+'12 (2)'!D49)","v":8.3400205671657415E-2},null,{"$f":"IF('12 (2)'!F49=\"n/a\",\"n/a\",'12 (1)'!$I48+'12 (2)'!F49)","v":5.5700205671657413E-2},null,{"$f":"IF('12 (2)'!H49=\"n/a\",\"n/a\",'12 (1)'!$I48+'12 (2)'!H49)","v":7.7500205671657413E-2},null,null,null,8.3400205671657415E-2,"nmf",7.7500205671657413E-2]
[44,{"$f":"'12 (1)'!B49","v":"Walmart Inc."},null,null,{"$f":"IF('12 (2)'!D50=\"n/a\",\"n/a\",'12 (1)'!$I49+'12 (2)'!D50)","v":9.1584673124714716E-2},null,{"$f":"IF('12 (2)'!F50=\"n/a\",\"n/a\",'12 (1)'!$I49+'12 (2)'!F50)","v":8.0684673124714723E-2},null,{"$f":"IF('12 (2)'!H50=\"n/a\",\"n/a\",'12 (1)'!$I49+'12 (2)'!H50)","v":7.2884673124714722E-2},null,null,null,9.1584673124714716E-2,8.0684673124714723E-2,7.2884673124714722E-2]
[45,{"$f":"'12 (1)'!B50","v":"Waste Management"},null,null,{"$f":"IF('12 (2)'!D51=\"n/a\",\"n/a\",'12 (1)'!$I50+'12 (2)'!D51)","v":7.4960993654601557E-2},null,{"$f":"IF('12 (2)'!F51=\"n/a\",\"n/a\",'12 (1)'!$I50+'12 (2)'!F51)","v":7.3609936546015567E-3},null,{"$f":"IF('12 (2)'!H51=\"n/a\",\"n/a\",'12 (1)'!$I50+'12 (2)'!H51)","v":8.2860993654601561E-2},null,null,null,7.4960993654601557E-2,"nmf",8.2860993654601561E-2]
[]
[null,"Average (b)",null,null,{"$f":"AVERAGE(M8:M52)","v":0.10367815311985579},null,{"$f":"AVERAGE(N8:N52)","v":9.480797337938919E-2},null,{"$f":"AVERAGE(O8:O52)","v":9.6378595764929423E-2},null,{"$f":"AVERAGE(E54:I54)","v":9.8288240754724795E-2},"Min",{"$f":"MIN(M8:M52)","v":6.8501070663811572E-2},{"$f":"MIN(N8:N52)","v":6.4800716443070866E-2},{"$f":"MIN(O8:O52)","v":7.052655386980565E-2}]
[null,"Midpoint (b,c)",null,null,{"$f":"AVERAGE(M54:M55)","v":0.10360661806574384},null,{"$f":"AVERAGE(N54:N55)","v":9.9299551583178297E-2},null,{"$f":"AVERAGE(O54:O55)","v":9.8923472510986238E-2},null,{"$f":"AVERAGE(E55:I55)","v":0.10060988071996946},"Max",{"$f":"MAX(M8:M52)","v":0.13871216546767612},{"$f":"MAX(N8:N52)","v":0.13379838672328573},{"$f":"MAX(O8:O52)","v":0.12732039115216684}]
[]
["(a)",{"$f":"\"Sum of dividend yield (\" & '12 (3)'!J1 & \", p. 1) and respective growth rate (\" & J1 & \", p. 2).\"","v":"Sum of dividend yield (Exh. AMM-12, p. 1) and respective growth rate (Exh. AMM-12, p. 2)."}]
["(b)","Excludes highlighted figures."]
["(c)","Average of low and high values."]
[]
[]
[]
[]
[null,"Criteria Min",null,null,{"$f":"'6 (3)'!E42","v":6.4000000000000001E-2}]
[null,"Criteria Max",null,null,{"$f":"'6 (3)'!E43","v":0.14099999999999999}]

{"sheet":"13","index":29,"n_rows":70,"n_cols":24,"rows_kept":70,"cut":false,"hidden":false,"merged":[[53,4,53,18],[12,4,12,18],[22,4,22,18],[24,4,24,18],[28,4,28,18],[35,4,35,18],[43,4,43,18]]}
[{"$f":"'Exhibit List'!C20","v":"FLOTATION COST STUDY"},null,null,null,null,null,null,null,null,null,null,null,null,null,null,null,null,null,null,null,{"$f":"'Exhibit List'!B20","v":"Exh. AMM-13"}]
[null,null,null,null,null,null,null,null,null,null,null,null,null,null,null,null,null,null,null,null,"Page 1 of 1"]
[{"$f":"'Exhibit List'!D20","v":"ELECTRIC & GAS UTILITIES"}]
[]
[null,null,null,null,-1,null,{"$f":"E5-1","v":-2},null,{"$f":"G5-1","v":-3},null,{"$f":"I5-1","v":-4},null,{"$f":"K5-1","v":-5},null,{"$f":"M5-1","v":-6},null,{"$f":"O5-1","v":-7},null,{"$f":"Q5-1","v":-8},null,{"$f":"S5-1","v":-9}]
[null,null,null,null,null,null,null,null,null,null,"Underwriting",null,null,null,null,null,"Total",null,"Gross Proceeds",null,"Flotation"]
[null,null,null,null,null,null,"Shares",null,"Offering",null,"Discount",null,"Underwriting",null,"Offering",null,"Flotation",null,"Before Flot.",null,"Cost",null,"Latest","Net"]
["No.","Sym","Company",null,"Date",null,"Issued",null,"Price",null,"(per share)",null,"Discount",null,"Expense",null,"Costs",null,"Costs",null,"(%)",null,"Price","Proceeds"]
[1,"ALE","ALLETE",null,"2014-02-27",null,3220000,null,49.75,null,1.74125,null,{"$f":"G9*K9","v":5606825},null,450000,null,{"$f":"O9+M9","v":6056825},null,{"$f":"I9*G9","v":160195000},null,{"$f":"Q9/S9","v":3.7809076438091074E-2}]
[{"$f":"A9+1","v":2},"LNT","Alliant Energy",null,"2019-11-14",null,3717502,null,52.63,null,0.39500000000000002,null,{"$f":"G10*K10","v":1468413.29},null,500000,null,{"$f":"O10+M10","v":1968413.29},null,{"$f":"I10*G10","v":195652130.26000002},null,{"$f":"Q10/S10","v":1.0060781282494583E-2}]
[3,"AEE","Ameren Corp.",null,"2019-08-05",null,7549205,null,74.3,null,0.12,null,905904.6,null,750000,null,1655904.6,null,560905931.5,null,2.9521966287140255E-3]
[4,"AEP","American Elec Pwr",null,"2009-04-02",null,{"$f":"60000000+9000000","v":69000000},null,24.5,null,0.73499999999999999,null,50715000,null,400000,null,51115000,null,1690500000,null,3.0236616385684707E-2]
[5,"AGR","Avangrid, Inc.",null,"N/A"]
[6,"AVA","Avista Corp.",null,"2006-12-13",null,{"$f":"2750000+412500","v":3162500},null,25.05,null,0.48,null,1518000,null,300000,null,1818000,null,79220625,null,2.294856926463279E-2]
[7,"BKH","Black Hills Corp.",null,"2015-11-19",null,{"$f":"5500000+825000","v":6325000},null,40.25,null,1.4087499999999999,null,8910343.75,null,1200000,null,10110343.75,null,254581250,null,3.9713622861070878E-2]
[8,"CNP","CenterPoint Energy",null,"2018-09-27",null,60550459,null,27.25,null,0.75,null,45412844.25,null,1000000,null,46412844.25,null,1650000007.75,null,2.8128996383030472E-2]
[9,"CMS","CMS Energy Corp.",null,"2005-03-31",null,{"$f":"20000000+3000000","v":23000000},null,12.25,null,0.42880000000000001,null,9862400,null,325000,null,10187400,null,281750000,null,3.6157586512866019E-2]
[10,"ED","Consolidated Edison (a)",null,"2019-05-07",null,5800000,null,84.83,null,{"$f":"W18-I18","v":0.59000000000000341},null,3422000.0000000196,null,400000,null,3822000.0000000196,null,492014000,null,7.7680716402379188E-3,null,85.42,{"$f":"S18-M18-O18","v":488192000}]
[11,"D","Dominion Energy (a)",null,"2018-03-29",null,20000000,null,67.325800000000001,null,{"$f":"W19-I19","v":1.8941999999999979},null,37883999.999999955,null,450000,null,38333999.999999955,null,1346516000,null,2.8469026732693824E-2,null,69.22,{"$f":"S19-M19-O19","v":1308182000}]
[12,"DTE","DTE Energy Co.",null,"2019-10-29",null,2400000,null,126,null,3.15,null,7560000,null,300000,null,7860000,null,302400000,null,2.5992063492063493E-2]
[13,"DUK","Duke Energy Corp. (a)",null,"2019-11-18",null,25000000,null,85.99,null,{"$f":"W21-I21","v":2.6600000000000108},null,66500000.000000268,null,592000,null,67092000.000000268,null,2149750000,null,3.1209210373299344E-2,null,88.65,{"$f":"S21-M21-O21","v":2082657999.9999998}]
[14,"EIX","Edison International",null,"2019-07-30",null,28000000,null,68.5,null,1.6268750000000001,null,45552500,null,725000,null,46277500,null,1918000000,null,2.4127997914494263E-2]
[15,"EE","El Paso Electric Co.",null,"N/A"]
[16,"ETR","Entergy Corp.",null,"2018-06-08",null,13289037,null,75.25,null,0.8,null,{"$f":"G24*K24","v":10631229.600000001},null,650000,null,{"$f":"O24+M24","v":11281229.600000001},null,{"$f":"I24*G24","v":1000000034.25},null,{"$f":"Q24/S24","v":1.1281229213617901E-2}]
[17,"EVRG","Evergy Inc.",null,"N/A"]
[18,"ES","Eversource Energy",null,"2019-05-30",null,15600000,null,71.48,null,{"$f":"W26-I26","v":1.6899999999999977},null,26363999.999999963,null,615000,null,26978999.999999963,null,1115088000,null,2.4194503034738031E-2,null,73.17,{"$f":"S26-M26-O26","v":1088109000}]
[19,"EXC","Exelon Corp.",null,"2014-06-13",null,{"$f":"50000000+7500000","v":57500000},null,35,null,1.05,null,60375000,null,600000,null,60975000,null,2012500000,null,3.0298136645962735E-2]
[20,"FE","FirstEnergy Corp.",null,"2003-09-15",null,{"$f":"28000000+4200000","v":32200000},null,30,null,0.97499999999999998,null,31395000,null,423000,null,31818000,null,966000000,null,3.2937888198757766E-2]
[21,"FTS","Fortis Inc.",null,"N/A"]
[22,"HE","Hawaiian Elec.",null,"2013-03-20",null,{"$f":"6100000+900000","v":7000000},null,26.75,null,1.00312,null,7021840,null,450000,null,7471840,null,187250000,null,3.99030173564753E-2]
[23,"IDA","IDACORP, Inc.",null,"2004-12-10",null,{"$f":"3500000+525000","v":4025000},null,30,null,1.2,null,4830000,null,300000,null,5130000,null,120750000,null,4.2484472049689442E-2]
[24,"MGEE","MGE Energy",null,"2004-09-10",null,{"$f":"1100000+165000","v":1265000},null,31.85,null,1.0349999999999999,null,1309275,null,125000,null,1434275,null,40290250,null,3.5598562927755477E-2]
[25,"NEE","NextEra Energy, Inc. (a)",null,"2016-11-03",null,{"$f":"12000000+1800000","v":13800000},null,124,null,{"$f":"W33-I33","v":1.8900000000000006},null,26082000.000000007,null,750000,null,26832000.000000007,null,1711200000,null,1.5680224403927072E-2,null,125.89,{"$f":"S33-M33-O33","v":1684368000}]
[26,"NWE","NorthWestern Corp. (a)",null,"2015-09-30",null,1100000,null,51.81,null,{"$f":"W34-I34","v":1.3299999999999983},null,1462999.9999999981,null,1000000,null,2462999.9999999981,null,56991000,null,4.3217350107911744E-2,null,53.14,{"$f":"S34-M34-O34","v":54528000}]
[27,"OGE","OGE Energy Corp.",null,"2003-08-22",null,{"$f":"4650000+674074","v":5324074},null,21.6,null,0.79,null,4206018.46,null,325000,null,4531018.46,null,114999998.40000001,null,3.9400161069915285E-2]
[28,"OTTR","Otter Tail Corp.",null,"N/A"]
[29,"PNW","Pinnacle West Capital",null,"2010-04-09",null,{"$f":"6000000+900000","v":6900000},null,38,null,1.33,null,9177000,null,190000,null,9367000,null,262200000,null,3.5724637681159417E-2]
[30,"PNM","PNM Resources",null,"2020-01-07",null,5375000,null,47.21,null,{"$f":"W38-I38","v":1.990000000000002},null,10696250.000000011,null,750000,null,11446250.000000011,null,253753750,null,4.5107707767865546E-2,null,49.2,{"$f":"S38-M38-O38","v":242307500}]
[31,"POR","Portland General Elec.",null,"2013-06-13",null,{"$f":"11100000+1665000","v":12765000},null,29.5,null,0.95874999999999999,null,12238443.75,null,600000,null,12838443.75,null,376567500,null,3.4093339839471014E-2]
[32,"PPL","PPL Corp.",null,"2018-05-10",null,55000000,null,27,null,0.29430000000000001,null,16186500,null,1000000,null,17186500,null,1485000000,null,1.1573400673400673E-2]
[33,"PEG","Pub Sv Enterprise Grp.",null,"2003-10-02",null,{"$f":"8250000+1237500","v":9487500},null,41.75,null,1.2524999999999999,null,11883093.75,null,350000,null,12233093.75,null,396103125,null,3.0883608277516114E-2]
[34,"SRE","Sempra Energy",null,"2018-01-05",null,{"$f":"23364486+3504672","v":26869158},null,107,null,1.9259999999999999,null,51749998.307999998,null,1500000,null,53249998.307999998,null,2874999906,null,1.8521739147493384E-2]
[35,"SO","Southern Company (a)",null,"2016-08-18",null,32500000,null,49.3,null,{"$f":"W43-I43","v":1.6600000000000037},null,53950000.000000119,null,557000,null,54507000.000000119,null,1602250000,null,3.4019035731003351E-2,null,50.96,{"$f":"S43-M43-O43","v":1547743000}]
[36,"WEC","WEC Energy Group",null,"N/A"]
[37,"XEL","Xcel Energy Inc. (a)",null,"2019-10-30",null,10300000,null,62.69,null,{"$f":"W45-I45","v":0.63000000000000256},null,6489000.0000000261,null,650000,null,7139000.0000000261,null,645707000,null,1.105609819933813E-2,null,63.32,{"$f":"S45-M45-O45","v":638568000}]
[null,null,"Average",null,null,null,null,null,null,null,null,null,null,null,null,null,null,null,null,null,{"$f":"AVERAGE(U9:U45)","v":2.7791900910818439E-2}]
[]
[]
[1,"ATO","Atmos Energy Corp.",null,"2018-11-30",null,7008087,null,92.75,null,0.97689999999999999,null,{"$f":"G49*K49","v":6846200.1902999999},null,1000000,null,{"$f":"O49+M49","v":7846200.1902999999},null,{"$f":"I49*G49","v":650000069.25},null,{"$f":"Q49/S49","v":1.2071075929812295E-2}]
[{"$f":"A49+1","v":2},"CPK","Chesapeake Utilities",null,"2016-09-23",null,960488,null,62.26,null,2.33,null,{"$f":"G50*K50","v":2237937.04},null,{"$f":"S50-X50-M50","v":162045.83999999519},null,{"$f":"O50+M50","v":2399982.8799999952},null,{"$f":"I50*G50","v":59799982.879999995},null,4.0133504466314245E-2,null,null,57400000]
[{"$f":"A50+1","v":3},"NJR","New Jersey Resources",null,"2019-12-04",null,5700000,null,41.25,null,1.2375,null,{"$f":"G51*K51","v":7053750},null,500000,null,{"$f":"M51+O51","v":7553750},null,{"$f":"I51*G51","v":235125000},null,3.2126528442317913E-2]
[4,"NI","NiSource Inc.",null,"2017-05-03",null,"N/A",null,"N/A",null,"N/A",null,{"$f":"0.02*S52","v":10000000},null,57950,null,{"$f":"M52+O52","v":10057950},null,500000000,null,2.0115899999999999E-2]
[5,"NWN","Northwest Nat. Holding Co.",null,"2019-06-04",null,1250000,null,67,null,2.1775000000000002,null,{"$f":"G53*K53","v":2721875.0000000005},null,400000,null,{"$f":"M53+O53","v":3121875.0000000005},null,{"$f":"I53*G53","v":83750000},null,3.7276119402985079E-2]
[6,"OGS","ONE Gas, Inc.",null,"N/A"]
[7,"SJI","South Jersey Industries",null,"2018-04-20",null,11016949,null,29.5,null,1.0325,null,{"$f":"G55*K55","v":11374999.842499999},null,700000,null,{"$f":"M55+O55","v":12074999.842499999},null,{"$f":"I55*G55","v":324999995.5},null,3.715384618366864E-2]
[8,"SWX","Southwest Gas",null,"2018-11-28",null,3100000,null,75.5,null,2.5480999999999998,null,{"$f":"G56*K56","v":7899109.9999999991},null,600000,null,{"$f":"M56+O56","v":8499110},null,{"$f":"I56*G56","v":234050000},null,3.631322367015595E-2]
[9,"SR","Spire Inc.",null,"2018-05-09",null,2000000,0.6875,63.05,null,2.1093799999999998,null,{"$f":"G57*K57","v":4218760},null,325000,null,{"$f":"M57+O57","v":4543760},null,{"$f":"I57*G57","v":126100000},null,3.6032989690721648E-2]
[10,"UGI","UGI Corporation",null,"2004-03-18",null,8625000,null,32.1,null,1.4044000000000001,null,{"$f":"G58*K58","v":12112950},null,{"$f":"S58-X58-M58","v":1149550},null,{"$f":"M58+O58","v":13262500},null,{"$f":"G58*I58","v":276862500},null,4.7902839857329904E-2,null,null,263600000]
[null,null,"Average",null,null,null,null,null,null,null,null,null,null,null,null,null,null,null,null,null,{"$f":"AVERAGE(U49:U58)","v":3.3236225293700634E-2}]
[]
[null,null,"Average - Electric & Gas",null,null,null,null,null,null,null,null,null,null,null,null,null,null,null,null,null,{"$f":"AVERAGE(U9:U45,U49:U58)","v":2.9016873896966933E-2}]
[]
[null,"Column Notes:"]
[null,"(1-4)","SEC Form 424B for each company."]
[null,"(5)","Column (2) * Column (4)"]
[null,"(6)","SEC Form 424B for each company."]
[null,"(7)","Column (5) + Column (6)"]
[null,"(8)","Column (2) * Column (3)"]
[null,"(9)","Column (7) / Column (8)"]
[null,"Note (a):  ","Underwriting discount computed as the difference between the current market price and the price offered to the issuing company by the underwriters."]

{"sheet":"14 (1)","index":30,"n_rows":39,"n_cols":15,"rows_kept":39,"cut":false,"hidden":false,"merged":[[5,2,5,12],[6,9,6,10],[7,4,7,5]]}
[]
[{"$f":"'Exhibit List'!C21","v":"REGULATORY MECHANISMS"},null,null,null,null,null,null,null,null,null,null,null,null,null,{"$f":"'Exhibit List'!B21","v":"Exh. AMM-14"}]
[null,null,null,null,null,null,null,null,null,null,null,null,null,null,"Page 1 of 4"]
[{"$f":"'Exhibit List'!D21","v":"UTILITY GROUP"}]
[]
[null,null,"Type of Adjustment Clause"]
[null,null,null,"Conserv.",null,null,null,null,null,"New Capital",null,"RTO-related",null,"Future","Formula"]
[null,null,null,"Program","Decoupling",null,null,"Renewables","Environ.","Generation","Generic","Trans.",null,"Test","Rates /"]
[null,"Company","Fuel/PPA","Expense","Full","Partial","WNA","Expense","Compliance","Capacity","Infrastructure","Expense","Other*","Year","MRP"]
[{"$f":"A6+1","v":1},"Algonquin Pwr & Util","✓","✓","--","✓","--","--","✓","--","✓","✓","✓","P","✓"]
[{"$f":"A10+1","v":2},"ALLETE","✓","✓","--","--","--","✓","✓","--","--","✓","--","C","✓"]
[{"$f":"A11+1","v":3},"Ameren Corp.","✓","✓","--","✓","--","✓","✓","--","✓","✓","✓","O,P","✓"]
[4,"AVANGRID, Inc.","D","✓","✓","--","--","✓","--","D","--","✓","✓","C","✓"]
[5,"Black Hills Corp.","✓","✓","--","✓","--","✓","✓","✓","✓","✓","--","O","✓"]
[6,"CenterPoint Energy","✓","✓","--","✓","--","--","✓","--","✓","✓","✓","--","✓"]
[7,"CMS Energy Corp.","✓","✓","--","--","--","✓","--","--","--","✓","--","C","--"]
[8,"DTE Energy Co.","✓","✓","--","--","--","✓","--","--","--","✓","✓","C","--"]
[9,"Edison International","✓","--","✓","--","--","--","--","--","--","--","--","C","✓"]
[10,"Emera Inc.","✓","✓","--","--","--","--","✓","✓","--","--","✓","C","✓"]
[11,"Entergy Corp.","✓","✓","--","✓","--","✓","✓","✓","✓","✓","✓","O,P","✓"]
[12,"Exelon Corp.","D","✓","✓","✓","✓","✓","✓","D","✓","✓","✓","O,P","✓"]
[13,"FirstEnergy Corp.","D","✓","--","✓","--","✓","✓","--","✓","✓","✓","O,P","✓"]
[14,"Hawaiian Elec.","✓","✓","✓","--","--","✓","--","✓","✓","✓","✓","C","✓"]
[15,"IDACORP, Inc.","✓","✓","✓","--","--","✓","--","--","--","--","--","P,C","--"]
[16,"NorthWestern Corp.","✓","✓","--","--","--","✓","--","--","--","--","✓","--","--"]
[17,"OGE Energy Corp.","✓","✓","--","✓","--","✓","✓","✓","✓","✓","✓","P","✓"]
[18,"Otter Tail Corp.","✓","✓","--","--","--","✓","✓","✓","✓","✓","--","C,O","✓"]
[19,"PNM Resources","✓","✓","--","--","--","✓","✓","--","✓","✓","✓","O","--"]
[20,"Sempra Energy","✓","✓","✓","--","--","--","--","--","✓","✓","--","C","✓"]
[]
["Sources:"]
[{"$f":"O2 & \", pages 2-4, contain operating company data that are aggregated into the parent company data on this page.\"","v":"Exh. AMM-14, pages 2-4, contain operating company data that are aggregated into the parent company data on this page."}]
[]
["Notes:"]
["* Recover mechanisms for other expenses, such as taxes, franchise fees, bad debts, storm costs, pensions, societal benefits, vegetation management, and decommissioning."]
["D - Delivery-only utility."]
["C - Fully-forecasted test years commonly used in the state listed for this operating company."]
["O - Fully-forecasted test years occasionally used in the state listed for this operating company."]
["P - Partially-forecasted test years commonly or occasionally used in the state listed for this operating company."]

{"sheet":"14 (2-4)","index":31,"n_rows":110,"n_cols":16,"rows_kept":110,"cut":false,"hidden":false,"merged":[[1,5,1,6],[1,10,1,11],[0,5,0,6],[0,10,0,11],[99,0,101,13],[7,2,7,12],[10,5,10,6],[9,10,9,11]]}
[]
[]
[]
[{"$f":"'Exhibit List'!C22","v":"REGULATORY MECHANISMS"}]
[]
[{"$f":"'Exhibit List'!D22","v":"UTILITY GROUP OPERATING COS."}]
[]
[null,null,"Type of Adjustment Clause (a)",null,null,null,null,null,null,null,null,null,null,null,"(b)","(c)"]
[]
[null,null,null,null,"Conserv.",null,null,null,null,null,"New Capital",null,"RTO-related",null,"Future","Formula"]
[null,null,null,null,"Program","Decoupling",null,null,"Renewables","Environ.","Generation","Generic","Trans.",null,"Test","Rates /"]
[null,"Company","State","Fuel/PPA","Expense","Full","Partial","WNA","Expense","Compliance","Capacity","Infrastructure","Expense","Other*","Year","MRP"]
[1,"ALGONQUIN PWR. & UTIL."]
[null,"Empire District Electric","KS","✓","✓","--","--","--","--","✓","--","--","✓","✓","--","--"]
[null,"Empire District Electric","MO","✓","--","--","--","--","--","✓","--","--","✓","✓","P","--"]
[null,"Liberty Util. (Granite State Electric)","NH","D","--","--","✓","--","--","--","--","✓","--","--","--","✓"]
[2,"ALLETE"]
[null,"Minnesota Power","MN","✓","✓","--","--","--","✓","✓","--","--","✓","✓","C","✓"]
[3,"AMEREN CORP."]
[null,"Ameren Illinois","IL","D","✓","--","--","--","✓","✓","--","--","✓","✓","O","✓"]
[null,"Union Electric","MO","✓","✓","--","✓","--","✓","✓","--","✓","✓","✓","P","--"]
[4,"AVANGRID"]
[null,"United Illuminating","CT","D","✓","✓","--","--","--","--","--","--","✓","--","C","✓"]
[null,"Central Maine Power","ME","D","--","✓","--","--","--","--","--","--","--","✓","C","✓"]
[null,"New York State Electric & Gas","NY","D","--","✓","--","--","✓","--","--","--","--","✓","C","✓"]
[null,"Rochester Gas & Electric","NY","D","--","✓","--","--","✓","--","--","--","--","✓","C","✓"]
[5,"AVISTA CORP."]
[null,"Alaska Electric Light & Power","AK","✓","--","--","--","--","--","--","--","--","--","--","--","--"]
[null,"Avista Corp.","ID","✓","✓","✓","--","--","--","--","--","--","--","--","P","--"]
[null,"Avista Corp.","WA","✓","✓","--","✓","--","✓","--","--","--","--","--","--","✓"]
[6,"BLACK HILLS CORP."]
[null,"Black Hills Colorado Electric","CO","✓","✓","--","--","--","✓","--","✓","✓","--","✓","--","✓"]
[null,"Black Hills Power","SD","✓","✓","--","✓","--","✓","✓","--","--","✓","✓","--","--"]
[null,"Cheyenne Light Fuel & Power","WY","✓","✓","--","✓","--","✓","--","--","--","--","✓","O","--"]
[7,"CENTERPOINT ENERGY"]
[null,"CenterPoint Energy Houston Electric","TX","D","✓","--","--","--","--","--","--","✓","✓","✓","--","✓"]
[null,"Southern Indiana Gas & Electric","IN","✓","✓","--","✓","--","--","✓","--","✓","✓","✓","--","✓"]
[8,"CMS ENERGY"]
[null,"Consumers Energy","MI","✓","✓","--","--","--","✓","--","--","--","✓","--","C","--"]
[9,"DTE ENERGY CO."]
[null,"DTE Electric","MI","✓","✓","--","--","--","✓","--","--","--","✓","--","C","--"]
[10,"EDISON INTERNATIONAL"]
[null,"Southern California Edison ","CA","✓","--","✓","--","--","--","--","--","--","--","✓","C","✓"]
[11,"EMERA INC."]
[null,"Tampa Electric","FL","✓","✓","--","--","--","--","✓","✓","--","--","✓","C","✓"]
[null,"Emera Maine","ME","D","--","--","--","--","--","--","--","--","--","--","C","✓"]
[12,"ENTERGY CORP."]
[null,"Entergy Arkansas","AR","✓","✓","--","✓","--","✓","--","✓","✓","✓","✓","P","✓"]
[null,"Entergy New Orleans","LA","✓","✓","--","✓","--","--","✓","✓","--","✓","✓","O","✓"]
[null,"Entergy Louisiana","LA","✓","✓","--","✓","--","--","✓","✓","✓","✓","✓","O","✓"]
[null,"Entergy Mississippi","MS","✓","✓","--","✓","--","--","✓","--","--","✓","✓","O","✓"]
[null,"Entergy Texas ","TX","✓","✓","--","--","--","--","--","--","✓","--","✓","--","✓"]
[13,"EXELON CORP."]
[null,"Delmarva Power & Light","DE","D","--","--","--","--","--","--","--","✓","✓","✓","P","--"]
[null,"Potomac Electric Power","DC","D","--","--","✓","WNA","✓","--","--","✓","--","✓","P","--"]
[null,"Commonwealth Edison","IL","D","✓","--","--","--","✓","✓","--","✓","✓","✓","O","✓"]
[null,"Baltimore Gas & Electric","MD","D","✓","✓","--","--","--","--","--","--","--","✓","P","--"]
[null,"Delmarva Power & Light","MD","D","✓","✓","--","--","--","--","--","--","--","--","P","--"]
[null,"Potomac Electric Power","MD","D","✓","✓","--","--","--","--","--","--","--","✓","P","--"]
[null,"Atlantic City Electric","NJ","D","✓","--","--","--","✓","--","--","✓","--","✓","P","--"]
[null,"PECO Energy","PA","D","✓","--","--","--","--","--","--","✓","--","✓","O","--"]
[14,"FIRSTENERGY CORP."]
[null,"Potomac Edison","MD","D","✓","--","--","--","--","--","--","✓","--","✓","P","--"]
[null,"Jersey Central Power & Light","NJ","D","✓","--","--","--","✓","✓","--","✓","--","✓","P","--"]
[null,"Cleve. Elec. Illum./Ohio Ed./Toledo Ed.","OH","D","✓","--","✓","--","✓","--","--","✓","✓","✓","P","✓"]
[null,"Metropolitan Edison","PA","D","✓","--","--","--","--","--","--","✓","✓","✓","O","--"]
[null,"Pennsylvania Electric","PA","D","✓","--","--","--","--","--","--","✓","✓","✓","O","--"]
[null,"Pennsylvania Power","PA","D","✓","--","--","--","--","--","--","✓","--","✓","O","--"]
[null,"West Penn Power","PA","D","✓","--","--","--","--","--","--","✓","--","✓","O","--"]
[null,"Monongahela Power","WV","✓","✓","--","--","--","--","--","--","✓","--","✓","--","--"]
[null,"Potomac Edison","WV","✓","✓","--","--","--","--","--","--","✓","--","✓","--","--"]
[15,"HAWAIIAN ELEC."]
[null,"Hawaiian Electric","HI","✓","✓","✓","--","--","✓","--","✓","✓","--","✓","C","✓"]
[null,"Hawaii Electric Light","HI","✓","✓","✓","--","--","✓","--","✓","✓","--","✓","C","✓"]
[null,"Maui Electric","HI","✓","✓","✓","--","--","✓","--","✓","✓","--","✓","C","✓"]
[16,"IDACORP"]
[null,"Idaho Power","ID","✓","✓","✓","--","--","--","--","--","--","--","--","P","--"]
[null,"Idaho Power","OR","✓","✓","--","--","--","✓","--","--","--","--","--","C","--"]
[17,"NORTHWESTERN CORP."]
[null,"NorthWestern Corp.","MT","✓","✓","--","--","--","✓","--","--","--","--","✓","--","--"]
[null,"NorthWestern Corp.","SD","✓","✓","--","--","--","--","--","--","--","--","--","--","--"]
[18,"OGE ENERGY CORP."]
[null,"Oklahoma Gas & Electric","AR","✓","✓","--","✓","--","✓","✓","✓","--","✓","✓","P","--"]
[null,"Oklahoma Gas & Electric","OK","✓","✓","--","✓","--","✓","✓","--","✓","✓","✓","--","✓"]
[19,"OTTER TAIL CORP."]
[null,"Otter Tail Power","MN","✓","✓","--","--","--","✓","✓","--","--","✓","--","C","--"]
[null,"Otter Tail Power","ND","✓","--","--","--","--","--","✓","✓","✓","--","✓","O","✓"]
[null,"Otter Tail Power Corp.","SD","✓","✓","--","--","--","✓","✓","✓","✓","--","--","--","--"]
[20,"PNM RESOURCES"]
[null,"Public Service Co. of New Mexico","NM","✓","✓","--","--","--","✓","✓","--","✓","--","✓","O","--"]
[null,"Texas-New Mexico Power","TX","D","✓","--","--","--","--","--","--","✓","✓","✓","--","✓"]
[21,"SEMPRA ENERGY"]
[null,"San Diego Gas & Electric","CA","✓","--","✓","--","--","--","--","--","--","--","✓","C","✓"]
[null,"Oncor Electric Delivery","TX","D","✓","--","--","--","--","--","--","✓","✓","--","--","✓"]
[]
[]
["Sources:"]
["(a)  S&P Global Market Intelligence, Adjustment Clauses, RRA Regulatory Focus (Nov. 12, 2019)."]
["(b)  Edison Electric Institute, Alternative Regulation for Emerging Utility Challenges:  2015 Update (Nov. 11, 2015)."]
["(c)  Formula rates and Multiyear Rate plans approved in the state listed for this operating company.  See, (b); U.S. Department of Energy, State Performance-Based Regulation Using Multiyear Rate Plans for U.S. Electric Utilities,GRID Modernization Laboratory Consortium (Jul. 2017); The Brattle Group, Exploring the Use of Alternative Regulatory Mechanisms to Establish New Base Rates, Joint Utilities of Maryland (Mar. 29, 2018)."]
[]
[]
[]
["Notes:"]
["* Recover mechanisms for other expenses, such as taxes, franchise fees, bad debts, storm costs, pensions, societal benefits, vegetation management, and decommissioning."]
["D - Delivery-only utility."]
["C - Fully-forecasted test years commonly used in the state listed for this operating company."]
["O - Fully-forecasted test years occasionally used in the state listed for this operating company."]
["P - Partially-forecasted test years commonly or occasionally used in the state listed for this operating company."]
["LIR - Limited issue reopeners."]

{"sheet":"Stock Price (Utility)","index":32,"n_rows":69,"n_cols":23,"rows_kept":69,"cut":false,"hidden":false,"merged":[]}
[null,null,1,{"$f":"C1+1","v":2},{"$f":"D1+1","v":3},4,5,6,7,8,9,10,11,{"$f":"M1+1","v":12},{"$f":"N1+1","v":13},{"$f":"O1+1","v":14},{"$f":"P1+1","v":15},{"$f":"Q1+1","v":16},{"$f":"R1+1","v":17},{"$f":"S1+1","v":18},{"$f":"T1+1","v":19},{"$f":"U1+1","v":20},{"$f":"V1+1","v":21}]
[null,"Date",{"$f":"TRANSPOSE('Utility Group'!B3:B23)","v":"AQN"},"ALE","AEE","AGR","AVA","BKH","CNP","CMS","DTE","EIX","EMA","ETR","EXC","FE","HE","IDA","NWE","OGE","OTTR","PNM","SRE"]
[{"$f":"A2+1","v":1},"2020-10-02",14.76,53.12,79.81,52.38,34.61,55.34,19.93,61.66,114.16,51.5,55.25,103.65,35.94,29.52,62.5,82.97,50.03,31.06,37.049999999999997,42.86,120.5]
[{"$f":"A3+1","v":2},"2020-10-01",14.66,52.1,79.86,51.21,34.409999999999997,53.95,19.399999999999999,61.68,113.44,50.44,55.049999,101.28,35.83,28.76,62.85,81.86,49.01,30.2,36.549999999999997,41.9,119.13]
[3,"2020-09-30",14.54,51.74,79.08,50.46,34.119999999999997,53.49,19.350000000000001,61.41,115.04,50.84,54.700001,98.53,35.76,28.71,63.1,79.900000000000006,48.64,29.99,36.17,41.33,118.36]
[4,"2020-09-29",14.29,51.48,79.02,49.26,33.72,53.11,19,61.11,114.4,51.02,55.169998,95.78,35.32,28.6,61.975000000000001,80.099999999999994,48.41,29.67,36.04,41.04,116.18]
[5,"2020-09-28",14.36,52,78.42,49.35,34.119999999999997,53.92,19.02,61.4,114.81,51.89,55.25,96.68,35.74,28.45,64.025000000000006,81.23,49.15,29.66,36.54,41.45,116.71]
[6,"2020-09-25",14.2,51.53,78.209999999999994,49.15,33.9,53.31,18.989999999999998,61.34,114.72,51.65,54.490001999999997,96.98,35.520000000000003,28.6,64.424999999999997,80.55,48.69,29.31,36.14,40.97,117.61]
[7,"2020-09-24",13.99,50.94,76.7,48.88,33.409999999999997,52.82,18.899999999999999,59.58,112.99,50.84,54.169998,95.78,34.81,28.16,63.274999999999999,79.510000000000005,48.38,29.09,36.090000000000003,40.19,115.74]
[8,"2020-09-23",13.95,50.93,75.61,48.95,33.36,52.42,18.86,59.57,111.9,49.3,53.939999,95.17,34.479999999999997,27.58,64.349999999999994,79.569999999999993,48.01,29.06,35.799999999999997,39.450000000000003,114.5]
[9,"2020-09-22",14.28,52.3,77.06,49.47,34.6,53.34,18.91,60.69,112.01,50.42,54.27,97.28,35.21,28.57,64.099999999999994,81.33,49.09,28.96,36.76,40.68,119.05]
[10,"2020-09-21",13.99,51.75,76.62,48.14,34.33,54,18.899999999999999,59.99,111.3,49.7,53.880001,94.83,34.75,28.63,61.55,80.37,48.92,28.69,36.28,39.909999999999997,116.66]
[11,"2020-09-18",14.05,53.41,76.86,49.25,34.68,54.32,18.93,61.1,112.03,51.42,54.060001,95.43,35.07,28.96,63.524999999999999,81.98,48.69,28.85,36.340000000000003,40.04,119.98]
[12,"2020-09-17",14.2,53.22,77.62,49.43,34.57,55.36,19.29,61.34,116.86,52.63,54.040000999999997,97.63,35.93,29.8,63.625,83.5,49.97,29.38,36.909999999999997,40.090000000000003,121.03]
[13,"2020-09-16",14.14,52.55,77.94,50.08,35.25,54.95,19.739999999999998,61.94,119.04,52.54,53.990001999999997,96.84,36.26,29.76,61.975000000000001,82.97,50.38,29.73,37.04,40.85,120.84]
[14,"2020-09-15",14.23,51.58,77.5,49.91,34.58,54.45,19.010000000000002,61.11,118.56,51.51,54.650002000000001,96.54,36.164999999999999,29.35,63.05,82.14,50.05,29.48,36.74,41,117.63]
[15,"2020-09-14",14.05,51.58,76.98,48.74,34.22,54.49,19.54,61.42,120.38,51.65,54.049999,96.72,36.26,29.66,63.575000000000003,83.51,50.04,30.23,37.15,40.69,119.15]
[16,"2020-09-11",13.92,50.75,76.599999999999994,47.94,34.44,53.22,19.45,60.91,118.44,50.63,53.799999,95.45,35.83,29.33,66,82.91,50.23,30.16,36.770000000000003,40.840000000000003,117.8]
[17,"2020-09-10",13.79,50.36,76.459999999999994,48.12,35.5,53.33,19.45,60.8,117.92,50.5,54.16,95.85,35.840000000000003,29.05,64.375,83.94,50.98,30.37,37.08,40.89,118.12]
[18,"2020-09-09",14.03,52.1,78.38,49.05,36.17,54.85,19.53,61.69,119.71,51.54,54.919998,98.37,36.67,29.14,61.375,85.93,51.52,31.08,37.89,42.16,120.95]
[19,"2020-09-08",13.74,53.1,77.400000000000006,48.45,36.31,54.6,19.37,60.5,118.08,51.37,54.209999000000003,97.95,36.42,29.13,59.9,86.07,50.85,30.85,37.89,41.76,119.09]
[20,"2020-09-04",13.72,53.78,78.959999999999994,48.67,37.1,55.98,19.87,61.66,118.81,52.26,53.119999,97.9,37.090000000000003,29.4,59.825000000000003,88.02,51.83,31.54,38.19,43.01,120.89]
[21,"2020-09-03",13.81,54.13,79.099999999999994,48.4,37.11,56.02,20.149999999999999,61.91,119.12,52.96,53.490001999999997,98,37.29,29.39,59.25,89.08,52.46,31.81,38.44,43.38,122.72]
[22,"2020-09-02",14.19,54.45,80.23,48.44,37.01,56.15,20.45,61.76,120.46,52.57,53.860000999999997,100.48,38.03,29.14,56.4,90.21,52.27,32.33,38.79,43.98,124.55]
[23,"2020-09-01",13.93,53.27,78.48,47.52,36.520000000000003,55.13,20,60.22,117.79,51.81,52.860000999999997,97.69,36.33,28.26,55.024999999999999,88.33,51.5,31.39,38.04,43.11,122.25]
[24,"2020-08-31",13.83,53.96,79.11,48.04,36.86,56.08,20.07,60.49,118.67,52.48,53.25,99.14,36.909999999999997,28.59,53.6,89.9,51.64,31.86,38.85,43.68,123.65]
[25,"2020-08-28",13.74,54.05,78.66,48.57,37.049999999999997,56.59,19.95,60.05,117.86,52.17,53.310001,98.96,37.04,28.31,53.65,88.54,52.22,31.79,39.085000000000001,43.73,122.32]
[26,"2020-08-27",13.84,53.79,78.930000000000007,48.81,36.75,55.21,19.760000000000002,59.72,117.02,51.75,53.459999000000003,97.26,36.89,28.1,55.725000000000001,88.8,52.19,31.54,39.075000000000003,43.47,123.59]
[27,"2020-08-26",13.81,53.02,78.44,48.74,36.659999999999997,54.28,19.64,59.4,115.74,51.09,53.75,96.25,37.274999999999999,28.01,55.55,88.45,51.61,31.27,38.659999999999997,43.17,122.34]
[28,"2020-08-25",13.88,54.71,79.599999999999994,49.48,37.06,55.98,20.010000000000002,60.21,117,52,53.860000999999997,97.82,37.130000000000003,27.94,55.95,89.46,53.62,32.17,39.35,44.14,125.51]
[29,"2020-08-24",13.97,55.03,81.25,49.9,36.29,57.5,20.22,60.84,117.97,52.34,54.27,98.64,37.69,28.31,54.6,89.96,54.4,32.5,39.74,44.86,127.37]
[30,"2020-08-21",13.98,54.28,80.72,49.47,35.65,56.68,19.79,60.39,115.83,51.26,54.040000999999997,98.13,36.520000000000003,28.11,54.25,88.14,53.44,31.98,39.32,43.85,125.48]
[]
[null,"Average",{"$f":"AVERAGE(C3:C32)","v":14.062333333333335},{"$f":"AVERAGE(D3:D32)","v":52.70033333333334},78.320333333333323,49.142000000000003,35.345333333333329,{"$f":"AVERAGE(H3:H32)","v":54.695666666666675},19.516000000000002,60.863000000000021,{"$f":"AVERAGE(K3:K32)","v":116.40199999999999},51.469333333333324,54.11066679999999,97.567000000000007,36.200000000000003,28.777333333333331,60.44583333333334,84.64100000000002,50.607333333333337,30.533333333333335,37.492333333333335,41.949333333333335,120.32333333333335]
[]
[]
["(a)","Average of closing prices for 30 trading days ended Oct. 2, 2020."]
[]
[]
[]
[]
[]
[]
[]
[]
[]
[]
[]
[]
[]
[]
[]
[]
[]
[]
[]
[]
[]
[]
[]
[]
[]
[]
[]
[]
[]
[]
[]
[null,"2019-01-21",44.860000999999997,"Emera on MLK Day"]

{"sheet":"Stock Price (Non-Utility)","index":33,"n_rows":37,"n_cols":47,"rows_kept":37,"cut":false,"hidden":false,"merged":[]}
[null,null,1,2,3,4,5,6,7,8,9,10,11,12,13,14,15,16,17,18,19,20,21,22,23,24,25,26,27,28,29,30,31,32,33,34,35,36,37,38,39,40,41,42,43,44,45]
[null,"Date",{"$f":"TRANSPOSE('Proxy Group Risk Measures'!T44:T88)","v":"APD"},"DOX","AMGN","APH","AAPL","T","BAX","BMY","BRO","BF/B","CHD","CSCO","KO","CL","CMCSA","CBSH","COST","CVS","DHR","GIS","HRL","INTC","IFF","JNJ","K","KMB","LLY","LMT","MMC","MKC","MCD","MRK","MSFT","NOC","ORCL","PEP","PFE","PG","PSA","TXN","TRV","UPS","VZ","WMT","WM"]
[1,"2020-08-21",286.44,59.66,237.64,108.24,497.48,29.69,83.09,62.19,45.52,72.08,96.5,42.25,47.28,78.69,43.07,58.49,344.61,63.94,207.8,64.02,52.68,49.28,120.55,152.76,68.89,157.30000000000001,149.26,389.57,113.47,203.15,211.57,84.98,213.02,337.86,55.19,136.46,38.880000000000003,137.44,206.55,140.33000000000001,111.83,159.03,58.99,131.63,111.16]
[2,"2020-08-20",286.07,59.99,238.73,107.3,473.1,29.67,82.89,62.22,45.79,72.3,96.54,42.31,47.35,78.25,43.27,58.79,340.87,63.72,205.66,64.209999999999994,52.55,49.17,120.69,151.41999999999999,68.739999999999995,157.57,151.34,387.88,116.05,202.89,209.88,85.03,214.58,336.67,55.26,136.72,38.72,136.85,203.26,138.57,112.53,159.55000000000001,58.96,130.57,110.15]
[3,"2020-08-19",286.95,60.65,240.49,109.14,462.83,29.73,82.89,63.09,45.96,72.73,96.29,41.87,47.37,77.95,43.32,59.57,340.9,65.28,205.93,64.459999999999994,52.43,48.33,121.98,150.38999999999999,68.849999999999994,157.35,152.29,390.05,116.1,202.52,209.51,85.03,209.7,337.91,56.2,136.44999999999999,38.26,135.77000000000001,197.43,138.47999999999999,113.2,160.34,59.05,132.41,110.56]
[4,"2020-08-18",286.35000000000002,60.99,241.5,109.15,462.25,29.79,84.27,63.03,46.09,72.48,96.46,41.98,48.42,77.650000000000006,43.54,59.52,340.75,65.180000000000007,207.68,64.63,52.71,48.65,122.62,150.09,70.11,157.62,153.11000000000001,390.26,116.93,202.49,210.32,84.56,211.49,337.6,55.18,138.11000000000001,38.36,136.51,200.94,139.31,114.93,159.99,59.18,134.71,111.01]
[5,"2020-08-17",289.56,61.52,243.01,109.89,458.43,29.85,83.7,63.62,46,72.040000000000006,95.79,42.09,48.21,77.209999999999994,43.53,60.79,339.96,64.900000000000006,205.57,64.28,52.42,48.93,123.29,148.99,69.680000000000007,157.81,151.53,388.96,116.51,202.3,208.67,84.76,210.28,339.76,53.99,137.91999999999999,38.35,135.5,200.02,138.28,115.91,160.30000000000001,58.78,135.6,110.87]
[6,"2020-08-14",289.82,61.8,239.71,109.78,459.63,30.01,83.5,63.16,45.82,71.13,94.26,42.5,48.45,77.05,43.77,60.97,336.28,65.67,204.86,63.27,52.23,48.89,123.17,148.24,69.099999999999994,158.22999999999999,150.09,391.42,116.61,201.55,207.03,83.48,208.9,342.06,54.2,137.56,38.06,135.1,200.24,137.35,118.6,160.74,58.79,132.6,111.47]
[7,"2020-08-13",288.31,61.005000000000003,240.46,110.57,460.04,29.91,84.64,63.24,45.82,71.48,94.75,42.72,48.38,76.98,43.39,60.65,335.7,64.7,207.19,62.97,52.12,48.56,123.81,148,69.02,158.46,150.46,389.24,117.15,202.04,206.49,83.54,208.7,338.62,54.02,138.1,38.17,135.78,197.3,137.15,119.27,159.29,58.52,131.85,111.34]
[8,"2020-08-12",285.39999999999998,61.12,241.72,109.79,452.04,30.18,83.48,63.64,45.8,71.209999999999994,94.83,48.1,48.43,77.239999999999995,43.34,61.11,336.76,64.989999999999995,205.92,63.06,52.03,49.19,127,149.66,69.28,158.84,152.55000000000001,392.44,116.65,201.66,206.02,82.68,209.19,339.4,54.17,137.80000000000001,38.33,135.46,198.38,138.63999999999999,118.86,157.79,58.6,131.88999999999999,112.25]
[9,"2020-08-11",281.60000000000002,61.29,234.65,108.81,437.5,30.2,82.94,63.13,45.66,69.61,92.71,47.19,47.93,75.959999999999994,42.99,61.05,332.43,65.260000000000005,200.01,62.14,51.41,48.19,125.29,146.97,68.13,155.79,150.63,391.96,116.98,197.77,205,80.91,203.38,341.85,54.27,135.12,37.79,133.22999999999999,198.99,136.04,119.92,155.85,58.51,130.19999999999999,111.59]
[10,"2020-08-10",281.24,62.45,238.17,108.12,450.91,30.2,83.1,61.82,45.93,69.400000000000006,94.78,47.73,47.72,76.650000000000006,43.02,60.01,340,65.709999999999994,202.05,63.75,51.98,49.22,130.55000000000001,148.03,69.02,158.09,153,389.26,116.41,201.82,204.12,80.91,208.25,335.73,54.94,135.97999999999999,38.39,134.1,202.49,135.41,119.12,159.59,58.99,131.88,111.61]
[11,"2020-08-07",281.69,61.89,240.69,107.96,444.45,30.02,80.73,61.02,46.06,68.72,94.96,47.43,47.8,76.239999999999995,42.81,59.94,340.91,64.959999999999994,205.4,64.349999999999994,51.62,48.03,126.8,148.6,69.52,157.26,152.93,385.62,117.74,201.55,204.6,81.02,212.48,329.27,55.23,136.74,38.450000000000003,133.55000000000001,199.25,133.56,117.36,156.9,58.53,129.97,112.72]
[12,"2020-08-06",282.99,61.88,241.55,108.35,455.61,29.84,80.37,61.33,45.62,67.63,95.12,47.77,47.48,75.86,42.87,58.41,343.31,64.12,205.69,64.180000000000007,51.18,48.57,125.38,147.55000000000001,69.23,156.47,152.88,379.74,118.77,199.05,203.18,81.05,216.35,326.33999999999997,55.28,135.86000000000001,38.270000000000003,132.71,196.08,133.74,113.74,145.47,57.83,129.35,110.37]
[13,"2020-08-05",284.62,61.91,241.47,108.65,440.25,29.85,80.459999999999994,59.69,45.63,67.53,95.83,47.33,47.22,76.180000000000007,42.29,58.86,339.97,64.400000000000006,205.54,64.42,50.86,48.92,126.42,148.4,69.260000000000005,155.84,154.34,383.5,118.43,197.25,199.26,81.64,212.94,329.71,55.5,136.25,38.450000000000003,133.44,196.97,132.69999999999999,115.08,145.08000000000001,57.54,129.81,109.18]
[14,"2020-08-04",279.58,62.05,243.59,108.42,438.66,30.01,81.08,59.47,45.46,68.38,96.05,47.67,46.69,76.77,43.21,57.45,339.79,64.98,206.07,65.739999999999995,51.13,49.13,125.89,147.22,69.709999999999994,156.30000000000001,154.85,377.99,117.39,198.26,199.36,81.67,213.29,325.01,56,137.47,38.39,133.79,201.38,132.22999999999999,113.1,144.72,57.91,131.63999999999999,108.82]
[15,"2020-08-03",278.41000000000003,62.58,247.36,107.39,435.75,29.62,83.16,59.1,45.53,69.06,93.41,47.16,46.3,76.569999999999993,42.88,57.51,329.32,63.86,206.83,64.599999999999994,50.8,48.3,124.54,147.35,69.349999999999994,151.6,152.84,377.1,115.82,196.29,194.4,82.54,216.54,323.58999999999997,55.98,136.69999999999999,38.35,131.29,195.84,129.32,114.4,142.18,57.24,129.30000000000001,108.98]
[16,"2020-07-31",286.63,62.1,244.67,105.76,425.04,29.58,86.38,58.66,45.47,69.34,96.33,47.1,47.24,77.2,42.8,57.26,325.52999999999997,62.94,203.8,63.27,50.86,47.73,125.95,145.76,68.989999999999995,152.04,150.29,378.97,116.6,194.9,194.28,80.239999999999995,205.01,325.01,55.45,137.66,38.479999999999997,131.12,199.88,127.55,114.42,142.76,57.48,129.4,109.6]
[17,"2020-07-30",284.81,60.87,246.14,105.17,384.76,29.57,86.01,58.87,44.76,69.209999999999994,90.06,46.44,47.69,76.87,43.67,57.33,324.82,64,202.14,63.48,50.75,47.99,124.49,146.84,70.59,151.96,153,381.72,116.71,193.84,195.41,78.989999999999995,203.9,326.01,55.25,137.69,38.74,131.41999999999999,197.71,128.88999999999999,115.93,141.46,57.3,130.12,109.38]
[18,"2020-07-29",288.85000000000002,61.25,248.85,105.83,380.16,29.56,90.73,59.15,44.96,69.209999999999994,89.31,46.71,48.02,76.2,43.9,58.12,326.14,64.22,202.13,64.37,50.84,48.07,128.24,146.54,70.94,152.04,161.75,387.3,115.58,194.34,196.21,79.349999999999994,204.06,315.26,55.7,137.93,39.26,128.31,196.84,131.63999999999999,116.85,123.68,57.45,130.69,109.65]
[19,"2020-07-28",289.27,60.02,255.27,104.21,373.01,29.69,89.26,59.43,44.48,68.31,88.21,46.28,48.18,75.709999999999994,43.21,56.7,327.57,63.27,199.01,64.540000000000006,50.56,49.24,128.34,146.83000000000001,70.91,150.78,162.65,386.66,114.21,192.99,196.24,79.69,202.02,312.87,55.35,137.38,39.020000000000003,127.88,193.87,130.13,115.03,119.62,57.48,131.76,107.52]
[20,"2020-07-27",294.70999999999998,61.26,253.65,106.17,379.24,29.29,89.29,58.05,45.49,68.900000000000006,87.17,47.19,48.48,74.650000000000006,43.56,56.89,327.60000000000002,62.57,198.98,64.08,50.55,49.57,128.79,147.18,69.97,147.38,160.5,382.09,114.61,196.02,201.25,78.930000000000007,203.85,308.02,55.34,137.66999999999999,37.54,126.32,185.57,132.12,116.63,121.01,56.87,131.21,107.07]
[21,"2020-07-24",291.52,60.52,247.98,104.39,370.46,29.57,89.26,57.85,45.4,68,85.87,46.4,48.49,74.319999999999993,43.35,58.36,325.77999999999997,63.34,195.27,64.23,50.27,50.59,126.82,148.12,68.680000000000007,147.34,159.54,386.21,114.62,193.52,198.72,77.099999999999994,201.3,312.69,55.65,136.06,37.659999999999997,125.96,185.36,129.63,118.28,118.35,56.85,131.24,107.28]
[22,"2020-07-23",293.25,60.61,252.24,105.6,371.38,29.9,89.49,59.87,45.11,68.459999999999994,86.22,47.41,48.28,74.23,42.49,58.85,326.11,63.79,199.22,64.989999999999995,50.55,60.4,128.49,149.61000000000001,68.41,147.33000000000001,161.52000000000001,387.62,115.28,195.89,197.55,78.06,202.54,313.06,55.76,137.08000000000001,38.409999999999997,126.16,187.02,129.04,118.61,118.14,55.85,131.63999999999999,108.03]
[23,"2020-07-22",295.51,59.89,256.98,103.27,389.09,30.16,89.2,59.85,44.96,67.540000000000006,85.14,46.9,48.48,74.14,42.57,57.23,328.3,63.78,195.61,64.72,49.78,61.05,128.55000000000001,150.01,67.459999999999994,144.30000000000001,164.84,394.08,115.51,193.82,198.62,78.78,211.75,316,56.01,136.01,38.56,126.14,188.31,132.53,122.24,118.72,55.75,132.66,108.21]
[24,"2020-07-21",290.39,59.14,257.91000000000003,102.1,388,30.25,88.67,59.8,44.29,67.11,84.5,47.02,47.2,74.040000000000006,42.57,58.36,327.74,64.52,195,64.5,49.75,60.7,127.94,149.74,67.67,143.80000000000001,165.3,375.12,114.4,193.58,192.98,78.89,208.75,308.19,55.91,134.43,36.69,125.07,186.84,135.47999999999999,120.42,119.04,55.84,132.33000000000001,107.52]
[25,"2020-07-20",290.87,59.99,260.95,101.48,393.43,29.85,87.82,59.46,43.76,66.22,84.29,46.97,46.12,74.2,41.95,55.99,326.51,63.91,193.37,63.64,49.7,61.15,128.72,149.6,67.42,142.69,167.04,365.53,113.48,191.56,191.61,79.41,211.6,301.49,55.4,133.11000000000001,36.5,125.24,187.79,136.58000000000001,118.77,118.35,55.87,131.47,106.57]
[26,"2020-07-17",294,59.57,258.45999999999998,102.02,385.31,30.25,87.56,60.39,43.7,67.45,84.87,46.75,46.82,75.2,42.18,56.46,324.79000000000002,65.36,190.95,64.64,49.92,60,130.99,149.35,68.63,144.37,165.96,368.5,113.69,190.89,191.48,79.87,202.88,306.83999999999997,54.9,134.66,36.25,125.63,192.3,133.88999999999999,119.16,118.55,56.3,131.74,108.7]
[27,"2020-07-16",287.19,59.23,255.2,100.91,386.09,30.39,85.81,59.32,43.43,66.72,84.2,45.78,46.15,74.98,42.14,57.84,326.27,64.989999999999995,188.81,64.69,49.53,59.14,129.61000000000001,149.25,68.239999999999995,143.68,165,365.88,111.83,189.72,190.92,79.400000000000006,203.92,303.64999999999998,55.82,133.88,35.6,124.76,188.38,132.18,120.5,119.74,55.78,132.19999999999999,107.46]
[28,"2020-07-15",281.97000000000003,59.1,253.31,100.44,390.9,30.01,87.09,59.27,42.31,66.260000000000005,84.6,46.4,46.4,74.69,41.96,57.17,326.7,64.58,188.34,64.599999999999994,48.82,59.03,129.72,148.26,68.09,143.28,165.45,364.56,111.58,189.2,191.77,79.44,208.04,300.76,56.62,133.69,35.72,124.5,192.8,132.15,119.14,119.21,55.06,132,106.79]
[29,"2020-07-14",280.99,58.85,253.09,97.4,388.23,29.96,84.65,57.89,41.95,66.22,84.48,46.26,45.87,74.849999999999994,41.18,55.46,328,63.7,185.45,65.17,49.09,58.98,127.01,147.91999999999999,68.400000000000006,143.96,163.88,355.66,110.24,189.42,190.72,78.25,208.35,295.55,57.2,135.52000000000001,35.229999999999997,125.09,193.84,131.88999999999999,118.55,115.33,55.44,132.01,106.2]
[30,"2020-07-13",274.35000000000002,58.67,250.04,94.46,381.91,29.76,83.46,57.75,40.950000000000003,64.680000000000007,82.13,45.93,45.25,73.459999999999994,40.54,56.11,322.92,62.62,182.41,63.56,48.06,58.58,124.52,145.21,66.95,142.13999999999999,162.08000000000001,353.06,108.76,182.91,184.92,77.349999999999994,207.07,292.35000000000002,57.01,134.91,35.21,124.05,192.89,128.82,114.24,113.76,54.45,129.52000000000001,104.33]
[]
[null,"Average",{"$f":"AVERAGE(C3:C32)","v":286.44466666666665},{"$f":"AVERAGE(D3:D32)","v":60.72849999999999},246.84933333333336,105.69233333333334,420.53133333333324,29.878666666666664,85.166000000000011,60.511999999999993,44.923666666666676,68.980333333333334,90.85533333333332,45.854666666666681,47.456666666666671,75.99966666666667,42.845666666666673,58.374999999999993,332.54466666666667,64.308666666666653,200.08966666666669,64.152000000000015,50.905999999999992,52.119333333333337,126.20533333333334,148.46299999999999,68.974666666666678,151.72066666666669,157.03,381.26500000000004,115.27033333333335,196.43966666666671,199.73633333333333,80.918333333333337,208.47100000000003,321.97099999999995,55.426000000000009,136.364,37.802999999999997,130.60566666666668,195.48400000000007,133.78766666666667,116.88733333333334,138.48466666666664,57.372999999999983,131.44666666666663,109.21300000000001]
[]
[]
["(a)","Average of closing prices for 30 trading days ended Aug. 21, 2020."]

{"sheet":"2020 10 Market DCF","index":34,"n_rows":400,"n_cols":23,"rows_kept":400,"cut":false,"hidden":false,"merged":[[385,16,385,17],[0,4,0,6],[0,8,0,9],[0,10,0,12],[0,13,0,15],[0,16,0,18],[1,8,1,9],[1,10,1,12],[1,13,1,15],[1,16,1,18]]}
[null,null,null,null,"EPS Growth Rates",null,null,"Market","Weighted",null,"Weighted",null,null,"Weighted",null,null,"Weighted"]
[null,null,null,"Dividend","IBES","Zacks","VL","Cap","Dividend Yield",null,"IBES",null,null,"Zacks",null,null,"Value Line",null,null,null,"IBES",null,"Value"]
[null,"Company","Ticker","Yield","Screened","Screened","Screened","($Millions)","Weight","Product","Mkt. Cap.","Weight","Product","Mkt. Cap.","Weight","Product","Mkt. Cap.","Weight","Product",null,"Yahoo","Zacks","Line"]
[null,"(a)",null,"(b)","(c)","(d)","(b)","(b)",null,null,null,null,null,null,null,null,null,null,null,null,"(c)","(d)","(b)"]
[1,"Agilent Technologies, Inc.","A",7.4000000000000003E-3,{"$f":"IF(AND(U5>=$D$399,U5<=$D$400),U5,\"NMF\")","v":9.4E-2},{"$f":"IF(AND(V5>=$D$399,V5<=$D$400),V5,\"NMF\")","v":0.1},0.1,29.90429,{"$f":"H5/H$384","v":1.4272225033892659E-3},{"$f":"D5*I5","v":1.0561446525080568E-5},{"$f":"IF(E5=\"n/a\",\"--\",IF(E5=\"NMF\",\"--\",$H5))","v":29.90429},{"$f":"IF(K5=\"--\",\"--\",K5/K$384)","v":1.6514949465733261E-3},{"$f":"IF(L5=\"--\",\"--\",E5*L5)","v":1.5524052497789266E-4},{"$f":"IF(F5=\"n/a\",\"--\",IF(F5=\"NMF\",\"--\",$H5))","v":29.90429},{"$f":"IF(N5=\"--\",\"--\",N5/N$384)","v":1.5131246621010721E-3},{"$f":"IF(O5=\"--\",\"--\",F5*O5)","v":1.5131246621010721E-4},{"$f":"IF(G5=\"n/a\",\"--\",IF(G5=\"NMF\",\"--\",$H5))","v":29.90429},{"$f":"IF(Q5=\"--\",\"--\",Q5/Q$384)","v":1.4937991268211374E-3},{"$f":"IF(R5=\"--\",\"--\",G5*R5)","v":1.4937991268211374E-4},null,9.4E-2,0.1,0.1]
[2,"Advance Auto Parts, Inc.","AAP",6.8000000000000005E-3,{"$f":"IF(AND(U6>=$D$399,U6<=$D$400),U6,\"NMF\")","v":0.11899999999999999},{"$f":"IF(AND(V6>=$D$399,V6<=$D$400),V6,\"NMF\")","v":0.1293},{"$f":"IF(AND(W6>=$D$399,W6<=$D$400),W6,\"NMF\")","v":0.11},10.12541,4.8324882510311092E-4,3.2860920107011546E-6,10.12541,5.5918610496965562E-4,6.6543146491389009E-5,{"$f":"IF(F6=\"n/a\",\"--\",IF(F6=\"NMF\",\"--\",$H6))","v":10.12541},5.1233477152892834E-4,6.6244885958690428E-5,{"$f":"IF(G6=\"n/a\",\"--\",IF(G6=\"NMF\",\"--\",$H6))","v":10.12541},5.0579126328383029E-4,{"$f":"IF(R6=\"--\",\"--\",G6*R6)","v":5.563703896122133E-5},null,0.11899999999999999,0.1293,0.11]
[3,"Apple Inc.","AAPL",7.9000000000000008E-3,0.1246,0.11,0.155,1835.5820000000001,8.7605622377801839E-2,6.9208441678463462E-4,1835.5820000000001,0.10137189002049403,1.2630937496553557E-2,1835.5820000000001,9.2878459696211155E-2,1.0216630566583227E-2,1835.5820000000001,9.1692221711620545E-2,1.4212294365301184E-2,null,0.1246,0.11,0.155]
[4,"AbbVie Inc.","ABBV",5.4199999999999998E-2,7.9500000000000001E-2,5.96E-2,0.105,153.7396,7.3374294050139429E-3,3.9768867375175571E-4,153.7396,8.4904263732128241E-3,6.7498889667041951E-4,153.7396,7.7790571286445523E-3,4.636318048672153E-4,153.7396,7.6797034886242387E-3,8.06368866305545E-4,null,7.9500000000000001E-2,5.96E-2,0.105]
[5,"AmerisourceBergen Corporation","ABC",1.7899999999999999E-2,8.1699999999999995E-2,7.4800000000000005E-2,7.0000000000000007E-2,19.200890000000001,9.1638832733035712E-4,1.6403351059213392E-5,19.200890000000001,1.0603887537443729E-3,8.6633761180915264E-5,19.200890000000001,9.7154422302919946E-4,7.2671507882584129E-5,19.200890000000001,9.5913571986456494E-4,6.7139500390519556E-5,null,8.1699999999999995E-2,7.4800000000000005E-2,7.0000000000000007E-2]
[6,"Abbott Laboratories","ABT",1.3999999999999999E-2,0.14899999999999999,0.10980000000000001,0.105,181.88650000000001,8.680778104503125E-3,1.2153089346304374E-4,181.88650000000001,1.0044867662797188E-2,1.4966852817567809E-3,181.88650000000001,9.203259761500663E-3,1.0105179218127729E-3,181.88650000000001,9.0857162928982028E-3,9.5400021075431123E-4,null,0.14899999999999999,0.10980000000000001,0.105]
[7,"Accenture PLC","ACN",1.43E-2,9.5100000000000004E-2,0.1,7.4999999999999997E-2,146.82070000000002,7.0072155869062413E-3,1.0020318289275925E-4,146.82070000000002,8.1083230567372891E-3,7.7110152269571619E-4,146.82070000000002,7.4289682877253706E-3,7.4289682877253709E-4,146.82070000000002,7.3340859608861534E-3,5.5005644706646148E-4,null,9.5100000000000004E-2,0.1,7.4999999999999997E-2]
[8,"Analog Devices, Inc.","ADI",2.2000000000000002E-2,8.4400000000000003E-2,0.1,7.0000000000000007E-2,41.531179999999999,1.9821314830852101E-3,4.3606892627874626E-5,41.531179999999999,2.2936018175060231E-3,1.9357999339750836E-4,41.531179999999999,2.1014326942441638E-3,2.1014326942441638E-4,41.531179999999999,2.0745933248992529E-3,1.4522153274294772E-4,null,8.4400000000000003E-2,0.1,7.0000000000000007E-2]
[9,"Archer Daniels Midland Company","ADM",3.1899999999999998E-2,"NMF","NMF",0.09,25.10896,1.1983589227064393E-3,3.8227649634335412E-5,"--","--","--","--","--","--",25.10896,1.2542595902924585E-3,1.1288336312632126E-4,null,-8.7999999999999995E-2,"n/a",0.09]
[10,"Automatic Data Processing, Inc.","ADP",2.87E-2,0.1057,0.12,0.11,55.323860000000003,2.6404057065510427E-3,7.5779643778014927E-5,55.323860000000003,3.0553166523910173E-3,3.2294697015773053E-4,55.323860000000003,2.7993273529860439E-3,3.3591928235832526E-4,55.323860000000003,2.7635745159097524E-3,3.0399319675007279E-4,null,0.1057,0.12,0.11]
[11,"Ameren Corporation","AEE",2.75E-2,0.06,6.8900000000000003E-2,0.06,18.683229999999998,8.916823068528775E-4,2.4521263438454131E-5,18.683229999999998,1.0318004517300748E-3,6.1908027103804489E-5,18.683229999999998,9.4535118809731353E-4,6.5134696859904908E-5,18.683229999999998,9.3327722076660155E-4,5.599663324599609E-5,null,0.06,6.8900000000000003E-2,0.06]
[12,"American Electric Power Company, Inc.","AEP",3.7400000000000003E-2,5.6300000000000003E-2,5.5899999999999998E-2,0.06,39.274149999999999,1.8744116874697759E-3,7.0102997111369628E-5,39.274149999999999,2.168955031400605E-3,1.2211216826785406E-4,39.274149999999999,1.9872294225362591E-3,1.1108612471977688E-4,39.274149999999999,1.961848650365629E-3,1.1771091902193773E-4,null,5.6300000000000003E-2,5.5899999999999998E-2,0.06]
[13,"The AES Corporation","AES",3.2099999999999997E-2,7.6499999999999999E-2,8.0100000000000005E-2,"NMF",11.80926,5.6361283348893164E-4,1.8091971954994702E-5,11.80926,6.5217844037663219E-4,4.9891650688812362E-5,11.80926,5.9753575648054873E-4,4.7862614094091953E-5,"--","--","--",null,7.6499999999999999E-2,8.0100000000000005E-2,0.24]
[14,"Aflac Incorporated","AFL",3.2300000000000002E-2,1.6E-2,0.05,8.5000000000000006E-2,25.429400000000001,1.2136523531468897E-3,3.920097100664454E-5,25.429400000000001,1.4043645776038068E-3,2.2469833241660909E-5,25.429400000000001,1.2867000782306821E-3,6.4335003911534115E-5,25.429400000000001,1.2702664238336851E-3,1.0797264602586325E-4,null,1.6E-2,0.05,8.5000000000000006E-2]
[15,"American International Group, Inc.","AIG",4.8399999999999999E-2,3.9600000000000003E-2,0.1,"NMF",22.767700000000001,1.0866191369337239E-3,5.2592366227592239E-5,22.767700000000001,1.2573694775932657E-3,4.9791831312693324E-5,22.767700000000001,1.152020943126173E-3,1.152020943126173E-4,"--","--","--",null,3.9600000000000003E-2,0.1,0.28499999999999998]
[16,"Apartment Investment and Management Company","AIV",4.9000000000000002E-2,7.0999999999999994E-2,"NMF","NMF",5.1044399999999994,2.436162716185639E-4,1.1937197309309632E-5,5.1044399999999994,2.8189791046992745E-4,2.0014751643364847E-5,"--","--","--","--","--","--",null,7.0999999999999994E-2,"n/a",-1.4999999999999999E-2]
[17,"Assurant, Inc.","AIZ",2.12E-2,0.19400000000000001,"NMF",0.115,7.0729799999999994,3.3756749356103123E-4,7.1564308634938622E-6,7.0729799999999994,3.9061254178628563E-4,7.5778833106539408E-5,"--","--","--",7.0729799999999994,3.5331423511554251E-4,4.0631137038287393E-5,null,0.19400000000000001,"n/a",0.115]
[18,"Arthur J. Gallagher  Co.","AJG",1.7600000000000001E-2,0.1152,8.4100000000000008E-2,0.13,19.601939999999999,9.3552897855412015E-4,1.6465310022552517E-5,19.601939999999999,1.0825371494535916E-3,1.2470827961705375E-4,19.601939999999999,9.9183691834935691E-4,8.3413484833180923E-5,19.601939999999999,9.7916923812604558E-4,1.2729200095638592E-4,null,0.1152,8.4100000000000008E-2,0.13]
[19,"Albemarle Corporation","ALB",1.9199999999999998E-2,0.15,8.6599999999999996E-2,0.04,8.5516200000000016,4.0813757840208603E-4,7.8362415053200511E-6,8.5516200000000016,4.7227194543041784E-4,7.0840791814562667E-5,8.5516200000000016,4.3270270328828317E-4,3.7472054104765322E-5,8.5516200000000016,4.2717625092942104E-4,1.7087050037176843E-5,null,0.15,8.6599999999999996E-2,0.04]
[20,"The Allstate Corporation","ALL",2.41E-2,6.3500000000000001E-2,7.4999999999999997E-2,0.06,28.05106,1.338774606450195E-3,3.22644680154497E-5,28.05106,1.5491484277347888E-3,9.8370925161159089E-5,28.05106,1.419353232732725E-3,1.0645149245495437E-4,28.05106,1.4012253403912058E-3,8.4073520423472349E-5,null,6.3500000000000001E-2,7.4999999999999997E-2,0.06]
[21,"Allegion PLC","ALLE",1.34E-2,"NMF",6.0999999999999999E-2,0.09,8.7962600000000002,4.1981335178540826E-4,5.6254989139244708E-6,"--","--","--",8.7962600000000002,4.4508122213412116E-4,2.7149954550181391E-5,8.7962600000000002,4.3939667209258931E-4,3.9545700488333037E-5,null,-4.0000000000000001E-3,6.0999999999999999E-2,0.09]
[22,"Applied Materials, Inc.","AMAT",1.5600000000000001E-2,"NMF",0.12659999999999999,7.4999999999999997E-2,52.285449999999997,2.4953934983854924E-3,3.8928138574813683E-5,"--","--","--",52.285449999999997,2.6455871001803588E-3,3.3493132688283342E-4,52.285449999999997,2.6117978241733957E-3,1.9588483681300467E-4,null,0.20080000000000001,0.12659999999999999,7.4999999999999997E-2]
[23,"Amcor PLC","AMCR",5.2000000000000005E-2,5.4399999999999997E-2,7.2700000000000001E-2,"NMF",17.129020000000001,8.1750554201436671E-4,4.2510288184747073E-5,17.129020000000001,9.4596761768139066E-4,5.146063840186765E-5,17.129020000000001,8.6670984663479755E-4,6.3009805850349781E-5,"--","--","--",null,5.4399999999999997E-2,7.2700000000000001E-2,"n/a"]
[24,"AMETEK, Inc.","AME",7.6E-3,"NMF",7.1099999999999997E-2,0.125,21.888330000000003,1.0446500196998618E-3,7.9393401497189499E-6,"--","--","--",21.888330000000003,1.1075257742352942E-3,7.8745082548129416E-5,21.888330000000003,1.0933805230477938E-3,1.3667256538097422E-4,null,-1.2E-2,7.1099999999999997E-2,0.125]
[25,"Amgen Inc.","AMGN",2.8199999999999999E-2,6.8699999999999997E-2,7.2300000000000003E-2,6.5000000000000002E-2,142.25479999999999,6.7893018618779893E-3,1.9145831250495928E-4,142.25479999999999,7.8561665675994704E-3,5.3971864319408362E-4,142.25479999999999,7.1979386964965758E-3,5.2041096775670248E-4,142.25479999999999,7.1060070654115348E-3,4.6189045925174976E-4,null,6.8699999999999997E-2,7.2300000000000003E-2,6.5000000000000002E-2]
[26,"Ameriprise Financial, Inc.","AMP",2.86E-2,7.7700000000000005E-2,"NMF",0.11,17.530369999999998,8.3666051114204972E-4,2.3928490618662621E-5,17.530369999999998,9.6813258119689966E-4,7.5223901558999108E-5,"--","--","--",17.530369999999998,8.7568878575119014E-4,9.6325766432630913E-5,null,7.7700000000000005E-2,"n/a",0.11]
[27,"American Tower Corporation REIT","AMT",2.0400000000000001E-2,0.1487,0.14779999999999999,0.09,104.5518,4.9898754235547429E-3,1.0179345864051677E-4,104.5518,5.7739798990427485E-3,8.585908109876567E-4,104.5518,5.2902077610623389E-3,7.8189270708501366E-4,104.5518,5.2226415523517929E-3,4.7003773971166136E-4,null,0.1487,0.14779999999999999,0.09]
[28,"Anthem, Inc.","ANTM",1.67E-2,0.1452,0.1464,0.14000000000000001,61.953940000000003,2.9568352012914667E-3,4.9379147861567495E-5,61.953940000000003,3.4214695894905734E-3,4.9679738439403125E-4,61.953940000000003,3.1348022149440802E-3,4.5893504426781337E-4,61.953940000000003,3.0947647135286991E-3,4.332670598940179E-4,null,0.1452,0.1464,0.14000000000000001]
[29,"Aon plc","AON",9.0000000000000011E-3,6.7699999999999996E-2,"NMF",7.4999999999999997E-2,46.394910000000003,2.2142595458618042E-3,1.9928335912756239E-5,46.394910000000003,2.562206272468742E-3,1.7346136464613382E-4,"--","--","--",46.394910000000003,2.3175496240487657E-3,1.7381622180365742E-4,null,6.7699999999999996E-2,"n/a",7.4999999999999997E-2]
[30,"A. O. Smith Corporation","AOS",1.8500000000000003E-2,0.08,0.08,0.05,8.3611900000000006,3.9904905025711353E-4,7.3824074297566016E-6,8.3611900000000006,4.6175525425748041E-4,3.6940420340598431E-5,8.3611900000000006,4.2306715168669327E-4,3.3845372134935462E-5,8.3611900000000006,4.1766376400127292E-4,2.0883188200063647E-5,null,0.08,0.08,0.05]
[31,"Apache Corporation","APA",9.0000000000000011E-3,"NMF","NMF",0.03,4.1897799999999998,1.9996289162024173E-4,1.7996660245821758E-6,"--","--","--","--","--","--",4.1897799999999998,2.0929069727362412E-4,6.2787209182087229E-6,null,-0.24,"n/a",0.03]
[32,"Air Products and Chemicals, Inc.","APD",1.8799999999999997E-2,0.1033,8.77E-2,0.12,63.049769999999995,3.0091351634670958E-3,5.6571741073181395E-5,63.049769999999995,3.4819879200479425E-3,3.5968935214095247E-4,63.049769999999995,3.190250025223816E-3,2.7978492721212868E-4,63.049769999999995,3.1495043477799854E-3,3.7794052173359822E-4,null,0.1033,8.77E-2,0.12]
[33,"Amphenol Corporation","APH",9.7000000000000003E-3,0.03,7.51E-2,0.105,30.811400000000003,1.4705155494722675E-3,1.4264000829880995E-5,30.811400000000003,1.701591022453614E-3,5.1047730673608418E-5,30.811400000000003,1.5590234449258276E-3,1.1708266071392965E-4,30.811400000000003,1.5391116932097968E-3,1.6160672778702865E-4,null,0.03,7.51E-2,0.105]
[34,"Alexandria Real Estate Equities, Inc.","ARE",2.7099999999999999E-2,1E-3,4.99E-2,0.16500000000000001,17.376709999999999,8.2932688075420928E-4,2.2474758468439071E-5,17.376709999999999,9.5964655081495602E-4,9.5964655081495599E-7,17.376709999999999,8.7924269217487928E-4,4.3874210339526477E-5,17.376709999999999,8.6801305849508968E-4,1.4322215465168982E-4,null,1E-3,4.99E-2,0.16500000000000001]
[35,"Atmos Energy Corporation","ATO",2.6499999999999999E-2,7.2499999999999995E-2,7.2599999999999998E-2,7.0000000000000007E-2,11.45561,5.4673441108453371E-4,1.4488461893740143E-5,11.45561,6.3264775806129686E-4,4.5866962459444016E-5,11.45561,5.7964144978568839E-4,4.2081969254440976E-5,11.45561,5.7223830477846124E-4,4.0056681334492288E-5,null,7.2499999999999995E-2,7.2599999999999998E-2,7.0000000000000007E-2]
[36,"Activision Blizzard, Inc","ATVI",5.6000000000000008E-3,"NMF",0.15970000000000001,0.11,61.836800000000004,2.9512445370741582E-3,1.6526969407615288E-5,"--","--","--",61.836800000000004,3.128875057906795E-3,4.9968134674771515E-4,61.836800000000004,3.088913257777172E-3,3.397804583554889E-4,null,0.24410000000000001,0.15970000000000001,0.11]
[37,"AvalonBay Communities, Inc.","AVB",4.4299999999999999E-2,2.5399999999999999E-2,1.15E-2,1.4999999999999999E-2,20.683109999999999,9.8712927249152414E-4,4.3729826771374522E-5,20.683109999999999,1.1422458665435703E-3,2.9013045010206684E-5,20.683109999999999,1.0465429485184E-3,1.20352439079616E-5,20.683109999999999,1.0331765662366682E-3,1.5497648493550022E-5,null,2.5399999999999999E-2,1.15E-2,1.4999999999999999E-2]
[38,"Broadcom Inc.","AVGO",3.7000000000000005E-2,7.9000000000000001E-2,0.12619999999999998,0.17,142.04239999999999,6.7791647859026067E-3,2.5082909707839648E-4,142.04239999999999,7.8444365607458662E-3,6.1971048829892342E-4,142.04239999999999,7.187191486707269E-3,9.0702356562245715E-4,142.04239999999999,7.0953971183257891E-3,1.2062175101153843E-3,null,7.9000000000000001E-2,0.12619999999999998,0.17]
[39,"Avery Dennison Corporation","AVY",2.0099999999999996E-2,7.8399999999999997E-2,6.1500000000000006E-2,0.11,9.90611,4.7278243733756735E-4,9.5029269904851017E-6,9.90611,5.4707503857137196E-4,4.2890683023995562E-5,9.90611,5.012384292182176E-4,3.0826163396920383E-5,9.90611,4.9483664277580699E-4,5.4432030705338767E-5,null,7.8399999999999997E-2,6.1500000000000006E-2,0.11]
[40,"American Water Works Company, Inc.","AWK",1.6299999999999999E-2,8.3000000000000004E-2,8.0799999999999997E-2,8.5000000000000006E-2,25.014800000000001,1.1938650099294053E-3,1.9459999661849306E-5,25.014800000000001,1.3814678693104714E-3,1.1466183315276914E-4,25.014800000000001,1.2657217675967529E-3,1.0227031882181763E-4,25.014800000000001,1.249556046895124E-3,1.0621226398608555E-4,null,8.3000000000000004E-2,8.0799999999999997E-2,8.5000000000000006E-2]
[41,"American Express Company","AXP",1.8000000000000002E-2,9.35E-2,8.929999999999999E-2,0.06,76.92580000000001,3.6713873779053779E-3,6.6084972802296806E-5,76.92580000000001,4.2483058437806209E-3,3.9721659639348807E-4,76.92580000000001,3.8923621036264255E-3,3.4758793585383974E-4,76.92580000000001,3.8426490938262524E-3,2.3055894562957514E-4,null,9.35E-2,8.929999999999999E-2,0.06]
[42,"Bank of America Corporation","BAC",3.1E-2,2.3599999999999999E-2,7.0000000000000007E-2,0.05,201.5265,9.6181235478012325E-3,2.9816182998183822E-4,201.5265,1.1129506714608821E-2,2.6265635846476818E-4,201.5265,1.0197022474598519E-2,7.1379157322189635E-4,201.5265,1.006678672964046E-2,5.0333933648202302E-4,null,2.3599999999999999E-2,7.0000000000000007E-2,0.05]
[43,"Baxter International Inc.","BAX",1.2500000000000001E-2,0.1,9.7500000000000003E-2,0.09,39.962559999999996,1.9072669815950736E-3,2.3840837269938421E-5,39.962559999999996,2.2069731764951897E-3,2.2069731764951897E-4,39.962559999999996,2.0220622223999906E-3,1.971510666839991E-4,39.962559999999996,1.9962365678482018E-3,1.7966129110633816E-4,null,0.1,9.7500000000000003E-2,0.09]
[44,"Best Buy Co., Inc.","BBY",2.07E-2,7.3999999999999996E-2,6.7599999999999993E-2,0.08,27.474419999999999,1.3112536860620371E-3,2.7142951301484169E-5,27.474419999999999,1.5173028950037977E-3,1.1228041423028103E-4,27.474419999999999,1.390175873726577E-3,9.3975889063916597E-5,27.474419999999999,1.3724206328228222E-3,1.0979365062582578E-4,null,7.3999999999999996E-2,6.7599999999999993E-2,0.08]
[45,"Becton, Dickinson and Company","BDX",1.43E-2,6.4000000000000001E-2,7.9500000000000001E-2,0.09,65.391550000000009,3.1208997669399398E-3,4.462886666724114E-5,65.391550000000009,3.6113151114304E-3,2.3112416713154561E-4,65.391550000000009,3.3087415550750537E-3,2.6304495362846676E-4,65.391550000000009,3.2664825110872305E-3,2.9398342599785076E-4,null,6.4000000000000001E-2,7.9500000000000001E-2,0.09]
[46,"Franklin Resources, Inc.","BEN",5.67E-2,"NMF","NMF",6.5000000000000002E-2,9.6993500000000008,4.6291453795588121E-4,2.6247254302098464E-5,"--","--","--","--","--","--",9.6993500000000008,4.8450842874826988E-4,3.1493047868637546E-5,null,-5.6599999999999998E-2,"n/a",6.5000000000000002E-2]
[47,"BrownForman Corporation","BF.B",9.5999999999999992E-3,6.8500000000000005E-2,"NMF",0.12,36.04589,1.7203386324401654E-3,1.6515250871425586E-5,36.04589,1.9906710769504307E-3,1.3636096877110452E-4,"--","--","--",36.04589,1.8005884442496634E-3,2.160706133099596E-4,null,6.8500000000000005E-2,"n/a",0.12]
[48,"The Bank of New York Mellon Corporation","BK",3.73E-2,2.8000000000000001E-2,0.08,0.03,29.454909999999998,1.4057752378439858E-3,5.2435416371580669E-5,29.454909999999998,1.6266774772707236E-3,4.5546969363580264E-5,29.454909999999998,1.4903865211636019E-3,1.1923092169308815E-4,29.454909999999998,1.4713513960236202E-3,4.4140541880708606E-5,null,2.8000000000000001E-2,0.08,0.03]
[49,"Baker Hughes Company","BKR",5.3200000000000004E-2,2.47E-2,9.8100000000000007E-2,"NMF",8.8621499999999997,4.229580407497113E-4,2.2501367767884644E-5,8.8621499999999997,4.8942128172161259E-4,1.2088705658523831E-5,8.8621499999999997,4.4841518471894893E-4,4.3989529620928895E-5,"--","--","--",null,2.47E-2,9.8100000000000007E-2,0.34499999999999997]
[50,"BlackRock, Inc.","BLK",2.7000000000000003E-2,7.7299999999999994E-2,0.1,0.08,82.105809999999991,3.9186103295213975E-3,1.0580247889707774E-4,82.105809999999991,4.5343771846550994E-3,3.5050735637383914E-4,82.105809999999991,4.1544649952493379E-3,4.1544649952493382E-4,82.105809999999991,4.1014044234102265E-3,3.2811235387281813E-4,null,7.7299999999999994E-2,0.1,0.08]
[51,"Ball Corporation","BLL",7.4999999999999997E-3,0.1045,0.05,0.18,26.061610000000002,1.2438254266045016E-3,9.3286906995337607E-6,26.061610000000002,1.4392790203199897E-3,1.5040465762343892E-4,26.061610000000002,1.3186892190070363E-3,6.5934460950351818E-5,26.061610000000002,1.3018470012681467E-3,2.343324602282664E-4,null,0.1045,0.05,0.18]
[52,"Bristol Myers Squibb Company","BMY",3.0499999999999999E-2,"NMF",8.6300000000000002E-2,0.125,132.95959999999999,6.3456759268197124E-3,1.9354311576800121E-4,"--","--","--",132.95959999999999,6.7276116511408128E-3,5.8059288549345211E-4,132.95959999999999,6.6416870082014216E-3,8.302108760251777E-4,null,0.222,8.6300000000000002E-2,0.125]
[53,"Broadridge Financial Solutions, Inc.","BR",1.7899999999999999E-2,0.1,"NMF",0.09,14.75676,7.04286239503248E-4,1.2606723687108138E-5,14.75676,8.1495713717982918E-4,8.1495713717982926E-5,"--","--","--",14.75676,7.3713956100308973E-4,6.6342560490278074E-5,null,0.1,"n/a",0.09]
[54,"BorgWarner Inc.","BWA",1.8200000000000001E-2,1.7899999999999999E-2,6.4199999999999993E-2,3.5000000000000003E-2,7.7513000000000005,3.699412288511521E-4,6.7329303650909682E-6,7.7513000000000005,4.2807345632930334E-4,7.6625148682945295E-6,7.7513000000000005,3.92207378718707E-4,2.5179713713740988E-5,7.7513000000000005,3.8719813015887294E-4,1.3551934555560554E-5,null,1.7899999999999999E-2,6.4199999999999993E-2,3.5000000000000003E-2]
[55,"Boston Properties, Inc.","BXP",4.9599999999999998E-2,7.0000000000000007E-2,2.4700000000000003E-2,0.04,12.22841,5.8361733158253663E-4,2.8947419646493816E-5,12.22841,6.7532642706537175E-4,4.7272849894576025E-5,12.22841,6.1874429218294002E-4,1.5282984016918621E-5,12.22841,6.1084172807349265E-4,2.4433669122939705E-5,null,7.0000000000000007E-2,2.4700000000000003E-2,0.04]
[56,"Citigroup Inc.","C",4.8799999999999996E-2,"NMF",0.105,3.5000000000000003E-2,87.126050000000006,4.1582080427730725E-3,2.0292055248732592E-4,"--","--","--",87.126050000000006,4.4084836980396837E-3,4.6289078829416679E-4,87.126050000000006,4.3521788149250415E-3,1.5232625852237646E-4,null,-3.2599999999999997E-2,0.105,3.5000000000000003E-2]
[57,"Conagra Brands Inc.","CAG",2.5699999999999997E-2,7.0000000000000007E-2,7.0000000000000007E-2,0.05,16.49239,7.8712151810566634E-4,2.0229023015315621E-5,16.49239,9.1080907595252915E-4,6.3756635316677051E-5,16.49239,8.3449705864908018E-4,5.8414794105435617E-5,16.49239,8.2383891345334261E-4,4.1191945672667133E-5,null,7.0000000000000007E-2,7.0000000000000007E-2,0.05]
[58,"Cardinal Health, Inc.","CAH",4.2900000000000001E-2,4.6600000000000003E-2,5.45E-2,0.125,13.212999999999999,6.3060821498461827E-4,2.7053092422840123E-5,13.212999999999999,7.2970141505026057E-4,3.4004085941342145E-5,13.212999999999999,6.6856347903064962E-4,3.6436709607170402E-5,13.212999999999999,6.6002462732563409E-4,8.2503078415704261E-5,null,4.6600000000000003E-2,5.45E-2,0.125]
[59,"Carrier Global Corporation","CARR",1.1000000000000001E-2,"NMF",0.08,"NMF",25.21406,1.2033749617130906E-3,1.3237124578843998E-5,"--","--","--",25.21406,1.2758041076279076E-3,1.0206432861023262E-4,"--","--","--",null,-8.6599999999999996E-2,0.08,"n/a"]
[60,"Caterpillar Inc.","CAT",2.8500000000000001E-2,"NMF",0.12,0.04,78.182779999999994,3.7313784408033843E-3,1.0634428556289646E-4,"--","--","--",78.182779999999994,3.9559639292430105E-3,4.7471567150916122E-4,78.182779999999994,3.9054386008311542E-3,1.5621754403324616E-4,null,-3.2899999999999999E-2,0.12,0.04]
[61,"Chubb Limited","CB",2.7400000000000001E-2,1.7899999999999999E-2,0.1,9.5000000000000001E-2,48.151269999999997,2.2980841916250966E-3,6.2967506850527649E-5,48.151269999999997,2.6592030466561084E-3,4.7599734535144341E-5,48.151269999999997,2.4364020730299062E-3,2.4364020730299063E-4,48.151269999999997,2.4052844953459463E-3,2.285020270578649E-4,null,1.7899999999999999E-2,0.1,9.5000000000000001E-2]
[62,"Cboe Global Markets, Inc.","CBOE",1.89E-2,2.5999999999999999E-2,2.7999999999999997E-2,0.125,9.6869899999999998,4.6232464031437581E-4,8.7379357019417029E-6,9.6869899999999998,5.3497391285686248E-4,1.3909321734278423E-5,9.6869899999999998,4.9015119471241305E-4,1.3724233451947565E-5,9.6869899999999998,4.8389101374836483E-4,6.0486376718545603E-5,null,2.5999999999999999E-2,2.7999999999999997E-2,0.125]
[63,"Crown Castle International Corporation","CCI",3.1899999999999998E-2,0.18940000000000001,"NMF",0.14000000000000001,64.893540000000002,3.0971315691692221E-3,9.8798497056498173E-5,64.893540000000002,3.5838120007281229E-3,6.7877399293790651E-4,"--","--","--",64.893540000000002,3.2416055819527081E-3,4.538247814733792E-4,null,0.18940000000000001,0.21,0.14000000000000001]
[64,"CDW Corporation","CDW",1.3899999999999999E-2,9.0999999999999998E-2,0.13100000000000001,0.11,15.57335,7.4325909671011173E-4,1.0331301444270553E-5,15.57335,8.6005415364209304E-4,7.8264927981430463E-5,15.57335,7.8799463075470886E-4,1.0322729662886686E-4,15.57335,7.7793041171283312E-4,8.5572345288411646E-5,null,9.0999999999999998E-2,0.13100000000000001,0.11]
[65,"Celanese Corporation","CE",2.3399999999999997E-2,1.7000000000000001E-2,3.4300000000000004E-2,5.5E-2,12.54444,{"$f":"H69/H$384","v":5.9870028883536261E-4},{"$f":"D69*I69","v":1.4009586758747483E-5},{"$f":"IF(E69=\"n/a\",\"--\",IF(E69=\"NMF\",\"--\",$H69))","v":12.54444},{"$f":"IF(K69=\"--\",\"--\",K69/K$384)","v":6.9277950647189061E-4},{"$f":"IF(L69=\"--\",\"--\",E69*L69)","v":1.1777251610022142E-5},12.54444,{"$f":"IF(N69=\"--\",\"--\",N69/N$384)","v":6.3473506765240623E-4},{"$f":"IF(O69=\"--\",\"--\",F69*O69)","v":2.1771412820477535E-5},12.54444,{"$f":"IF(Q69=\"--\",\"--\",Q69/Q$384)","v":6.2662827034048118E-4},3.4464554868726467E-5,null,1.7000000000000001E-2,3.4300000000000004E-2,5.5E-2]
[66,"Cerner Corporation","CERN",1.06E-2,{"$f":"IF(AND(U70>=$D$399,U70<=$D$400),U70,\"NMF\")","v":0.105},{"$f":"IF(AND(V70>=$D$399,V70<=$D$400),V70,\"NMF\")","v":0.10920000000000001},{"$f":"IF(AND(W70>=$D$399,W70<=$D$400),W70,\"NMF\")","v":0.09},20.675799999999999,9.867803928993394E-4,1.0459872164732998E-5,20.675799999999999,1.1418421643302943E-3,1.1989342725468089E-4,{"$f":"IF(F70=\"n/a\",\"--\",IF(F70=\"NMF\",\"--\",$H70))","v":20.675799999999999},1.0461730704413763E-3,1.1424209929219831E-4,{"$f":"IF(G70=\"n/a\",\"--\",IF(G70=\"NMF\",\"--\",$H70))","v":20.675799999999999},1.0328114122197341E-3,{"$f":"IF(R70=\"--\",\"--\",G70*R70)","v":9.2953027099776066E-5},null,0.105,0.10920000000000001,0.09]
[67,"CF Industries Holdings, Inc.","CF",4.1100000000000005E-2,"NMF",0.06,"NMF",6.6130800000000001,3.1561814685162189E-4,1.2971905835601661E-5,"--","--","--",6.6130800000000001,3.3461468038356232E-4,2.0076880823013738E-5,"--","--","--",null,-5.21E-2,0.06,0.26500000000000001]
[68,"Citizens Financial Group, Inc.","CFG",6.5099999999999991E-2,"NMF",5.74E-2,1.4999999999999999E-2,10.22246,4.878806670212413E-4,3.1761031423082807E-5,"--","--","--",10.22246,5.1724539634085027E-4,2.9689885749964805E-5,10.22246,5.10639169897162E-4,7.6595875484574296E-6,null,-8.6300000000000002E-2,5.74E-2,1.4999999999999999E-2]
[69,"Church  Dwight Co., Inc.","CHD",1.0500000000000001E-2,9.4799999999999995E-2,8.8599999999999998E-2,0.08,22.62593,1.0798529728045809E-3,1.13384562144481E-5,22.62593,1.2495400846006313E-3,1.1845640002013985E-4,22.62593,1.1448475347842237E-3,1.0143349158188222E-4,22.62593,1.130225612362513E-3,9.0418048989001048E-5,null,9.4799999999999995E-2,8.8599999999999998E-2,0.08]
[70,"C.H. Robinson Worldwide, Inc.","CHRW",2.0199999999999999E-2,3.7900000000000003E-2,0.09,0.08,13.630030000000001,6.5051153322385515E-4,1.3140332971121874E-5,13.630030000000001,7.5273232257454812E-4,2.8528555025575377E-5,13.630030000000001,6.8966474503081264E-4,6.2069827052773141E-5,13.630030000000001,6.8085638925204073E-4,5.4468511140163257E-5,null,3.7900000000000003E-2,0.09,0.08]
[71,"Cigna Corporation","CI",2.9999999999999997E-4,0.1094,0.1109,0.115,58.935600000000001,2.8127808608981665E-3,8.4383425826944991E-7,58.935600000000001,3.2547786813620027E-3,3.560727877410031E-4,58.935600000000001,2.9820774823854355E-3,3.3071239279654479E-4,58.935600000000001,2.9439905718771395E-3,3.3855891576587105E-4,null,0.1094,0.1109,0.115]
[72,"Cincinnati Financial Corporation","CINF",3.2000000000000001E-2,"NMF","NMF",0.105,12.051959999999999,5.7519601776023766E-4,1.8406272568327605E-5,"--","--","--","--","--","--",12.051959999999999,6.0202757947047973E-4,6.3212895844400374E-5,null,-4.6300000000000001E-2,"n/a",0.105]
[73,"ColgatePalmolive Company","CL",2.3399999999999997E-2,5.91E-2,5.8899999999999994E-2,0.05,64.425039999999996,3.0747717758807715E-3,7.194965955561005E-5,64.425039999999996,3.5579386099046121E-3,2.1027417184536258E-4,64.425039999999996,3.2598371966312545E-3,1.9200441088158086E-4,64.425039999999996,3.2182027561067942E-3,1.6091013780533973E-4,null,5.91E-2,5.8899999999999994E-2,0.05]
[74,"The Clorox Company","CLX",2.0899999999999998E-2,4.5699999999999998E-2,7.1099999999999997E-2,0.04,26.783000000000001,1.2782547356340751E-3,2.6715523974752168E-5,26.783000000000001,1.4791185195860994E-3,6.7595716345084737E-5,26.783000000000001,1.3551907711252472E-3,9.6354063827005075E-5,26.783000000000001,1.3378823578038643E-3,5.3515294312154575E-5,null,4.5699999999999998E-2,7.1099999999999997E-2,0.04]
[75,"Comerica Incorporated","CMA",7.46E-2,"NMF",1.72E-2,5.0000000000000001E-3,5.0666199999999995,2.4181126119771185E-4,1.8039120085349303E-5,"--","--","--",5.0666199999999995,2.5636548052117384E-4,4.4094862649641903E-6,5.0666199999999995,2.5309119634455492E-4,1.2654559817227746E-6,null,-0.33600000000000002,1.72E-2,5.0000000000000001E-3]
[76,"Comcast Corporation","CMCSA",2.0299999999999999E-2,5.2400000000000002E-2,9.7599999999999992E-2,8.5000000000000006E-2,207.20910000000001,9.8893332838544835E-3,2.0075346566224601E-4,207.20910000000001,1.144333410136161E-2,5.9963070691134834E-4,207.20910000000001,1.0484555875487005E-2,1.0232926534475316E-3,207.20910000000001,1.0350647771587078E-2,8.7980506058490168E-4,null,5.2400000000000002E-2,9.7599999999999992E-2,8.5000000000000006E-2]
[77,"CME Group Inc.","CME",2.0899999999999998E-2,4.2099999999999999E-2,4.3200000000000002E-2,2.5000000000000001E-2,58.076980000000006,2.7718020653521064E-3,5.7930663165859022E-5,58.076980000000006,3.2073605152384537E-3,1.3502987769153888E-4,58.076980000000006,2.9386322410045762E-3,1.2694891281139769E-4,58.076980000000006,2.9011002104517001E-3,7.25275052612925E-5,null,4.2099999999999999E-2,4.3200000000000002E-2,2.5000000000000001E-2]
[78,"Cummins Inc.","CMI",2.58E-2,"NMF",6.5000000000000002E-2,0.04,29.964279999999999,1.4300856069098084E-3,3.689620865827306E-5,"--","--","--",29.964279999999999,1.5161600910806414E-3,9.8550405920241698E-5,29.964279999999999,1.4967957874881519E-3,5.9871831499526076E-5,null,-3.4200000000000001E-2,6.5000000000000002E-2,0.04]
[79,"CMS Energy Corporation","CMS",2.87E-2,7.0800000000000002E-2,7.0099999999999996E-2,7.4999999999999997E-2,17.05489,8.1396758795572672E-4,2.3360869774329355E-5,17.05489,9.4187371274703237E-4,6.668465886248989E-5,17.05489,8.6295894898093066E-4,6.0493422323563238E-5,17.05489,8.5193729026940778E-4,6.3895296770205575E-5,null,7.0800000000000002E-2,7.0099999999999996E-2,7.4999999999999997E-2]
[80,"CenterPoint Energy, Inc.","CNP",3.3399999999999999E-2,"NMF",0.05,0.04,9.4722800000000014,4.5207731647880887E-4,1.5099382370392216E-5,"--","--","--",9.4722800000000014,4.7928710142681021E-4,2.396435507134051E-5,9.4722800000000014,4.7316567599516073E-4,1.8926627039806428E-5,null,-6.6500000000000004E-2,0.05,0.04]
[81,"Capital One Financial Corporation","COF",5.8999999999999999E-3,0.08,0.08,"NMF",31.090109999999999,1.4838173594774412E-3,8.7545224209169032E-6,31.090109999999999,1.7169830667576067E-3,1.3735864534060853E-4,31.090109999999999,1.5731258688447432E-3,1.2585006950757946E-4,"--","--","--",null,0.08,0.08,-0.03]
[82,"Cabot Oil  Gas Corporation","COG",2.41E-2,"NMF","NMF",0.115,7.4334799999999994,3.5477284143826992E-4,8.5500254786623041E-6,"--","--","--","--","--","--",7.4334799999999994,3.7132217261277183E-4,4.2702049850468763E-5,null,0.26119999999999999,"n/a",0.115]
[83,"The Cooper Companies, Inc.","COO",2.0000000000000001E-4,0.1,0.1,0.11,16.381229999999999,7.8181625743983037E-4,1.5636325148796609E-7,16.381229999999999,9.0467015146172554E-4,9.0467015146172565E-5,16.381229999999999,8.28872483130345E-4,8.2887248313034503E-5,16.381229999999999,8.1828617466778912E-4,9.0011479213456802E-5,null,0.1,0.1,0.11]
[84,"ConocoPhillips","COP",5.0999999999999997E-2,"NMF",0.06,0.105,35.308870000000006,1.6851633606163585E-3,8.5943331391434287E-5,"--","--","--",35.308870000000006,1.7865905523227837E-3,1.0719543313936702E-4,35.308870000000006,1.7637723274834835E-3,1.8519609438576577E-4,null,-1.34E-2,0.06,0.105]
[85,"Costco Wholesale Corporation","COST",8.1000000000000013E-3,7.0400000000000004E-2,8.3699999999999997E-2,9.5000000000000001E-2,152.16210000000001,7.2621410935677739E-3,5.8823342857898975E-5,152.16210000000001,8.4033073251357955E-3,5.9159283568956003E-4,152.16210000000001,7.6992373384250079E-3,6.4442616522617316E-4,152.16210000000001,7.6009031518645184E-3,7.2208579942712923E-4,null,7.0400000000000004E-2,8.3699999999999997E-2,9.5000000000000001E-2]
[86,"Campbell Soup Company","CPB",3.1E-2,8.6400000000000005E-2,1.44E-2,0.03,14.59314,6.9647725470526245E-4,2.1590794895863137E-5,14.59314,8.0592105562904415E-4,6.9631579206349411E-5,14.59314,7.383970671597166E-4,1.0632917767099919E-5,14.59314,7.2896630515483277E-4,2.1868989154644984E-5,null,8.6400000000000005E-2,1.44E-2,0.03]
[87,"Cisco Systems, Inc.","CSCO",3.8100000000000002E-2,6.1800000000000001E-2,6.6699999999999995E-2,7.0000000000000007E-2,161.54160000000002,7.7097903596275814E-3,2.9374301270181086E-4,161.54160000000002,8.9212997888052058E-3,5.5133632694816172E-4,161.54160000000002,8.1738298724118377E-3,5.4519445248986951E-4,161.54160000000002,8.0694342191468E-3,5.6486039534027607E-4,null,6.1800000000000001E-2,6.6699999999999995E-2,7.0000000000000007E-2]
[88,"CSX Corporation","CSX",1.3600000000000001E-2,3.7499999999999999E-2,7.6100000000000001E-2,9.5000000000000001E-2,58.52655,2.7932583989032024E-3,3.7988314225083558E-5,58.52655,3.2321884774850398E-3,1.2120706790568899E-4,58.52655,2.9613799957361139E-3,2.2536101767551826E-4,58.52655,2.9235574322564969E-3,2.7773795606436723E-4,null,3.7499999999999999E-2,7.6100000000000001E-2,9.5000000000000001E-2]
[89,"Cintas Corporation","CTAS",9.1999999999999998E-3,0.1195,9.64E-2,0.13,32.752569999999999,1.5631605013137638E-3,1.4381076612086627E-5,32.752569999999999,1.8087941175760776E-3,2.1615089705034126E-4,32.752569999999999,1.657244542980011E-3,1.5975837394327305E-4,32.752569999999999,1.6360783174303145E-3,2.1269018126594089E-4,null,0.1195,9.64E-2,0.13]
[90,"Cognizant Technology Solutions Corporation","CTSH",1.3100000000000001E-2,2.8199999999999999E-2,0.11,0.04,36.362780000000001,1.7354626343508953E-3,2.273456050999673E-5,36.362780000000001,2.008171650734982E-3,5.6630440550726492E-5,36.362780000000001,1.8399172560376999E-3,2.02390898164147E-4,36.362780000000001,1.816417945812762E-3,7.2656717832510478E-5,null,2.8199999999999999E-2,0.11,0.04]
[91,"Corteva, Inc.","CTVA",2.0799999999999999E-2,5.3100000000000001E-2,9.1300000000000006E-2,"NMF",20.5534,9.8093868809996632E-4,2.0403524712479298E-5,20.5534,1.1350824993638104E-3,6.0272880716218333E-5,20.5534,1.0399797631051658E-3,9.4950152371501637E-5,"--","--","--",null,5.3100000000000001E-2,9.1300000000000006E-2,"n/a"]
[92,"Citrix Systems, Inc.","CTXS",1.0500000000000001E-2,9.3700000000000006E-2,6.9699999999999998E-2,0.09,16.446290000000001,7.8492133353662145E-4,8.2416740021345263E-6,16.446290000000001,9.0826315638590409E-4,8.5104257753359215E-5,16.446290000000001,8.321644486147721E-4,5.8001862068449614E-5,16.446290000000001,8.2153609537117265E-4,7.3938248583405538E-5,null,9.3700000000000006E-2,6.9699999999999998E-2,0.09]
[93,"CVS Health Corporation","CVS",3.4799999999999998E-2,6.3399999999999998E-2,5.5899999999999998E-2,0.06,75.021799999999999,3.5805164143595733E-3,1.2460197121971314E-4,75.021799999999999,4.1431554998575372E-3,2.6267605869096787E-4,75.021799999999999,3.7960217672853699E-3,2.1219761679125218E-4,75.021799999999999,3.7475392103457398E-3,2.2485235262074437E-4,null,6.3399999999999998E-2,5.5899999999999998E-2,0.06]
[94,"Chevron Corporation","CVX",7.17E-2,"NMF",0.05,0.105,134.34989999999999,6.4120298662197813E-3,4.597425414079583E-4,"--","--","--",134.34989999999999,6.7979593242579184E-3,3.3989796621289596E-4,134.34989999999999,6.7111362051567557E-3,7.0466930154145934E-4,null,-3.73E-2,0.05,0.105]
[95,"Concho Resources Inc.","CXO",1.8500000000000003E-2,"NMF",0.12130000000000001,0.06,8.5272500000000004,4.069744873403154E-4,7.5290280157958356E-6,"--","--","--",8.5272500000000004,4.3146960770181695E-4,5.2337263414230401E-5,8.5272500000000004,4.2595890436407434E-4,2.5557534261844461E-5,null,0.3251,0.12130000000000001,0.06]
[96,"Dominion Energy Inc.","D",3.7000000000000005E-2,2.7400000000000001E-2,3.5299999999999998E-2,0.06,64.077179999999998,3.0581696890220303E-3,1.1315227849381514E-4,64.077179999999998,3.5387276862506815E-3,9.6961138603268669E-5,64.077179999999998,3.2422358576608768E-3,1.1445092577542895E-4,64.077179999999998,3.2008262203570407E-3,1.9204957322142244E-4,null,2.7400000000000001E-2,3.5299999999999998E-2,0.06]
[97,"DuPont de Nemours, Inc.","DD",2.3199999999999998E-2,1.6199999999999999E-2,4.7E-2,"NMF",39.897800000000004,1.904176223402203E-3,4.4176888382931108E-5,39.897800000000004,2.2033967393773018E-3,3.5695027177912288E-5,39.897800000000004,2.0187854365904079E-3,9.4882915519749168E-5,"--","--","--",null,1.6199999999999999E-2,4.7E-2,"n/a"]
[98,"Deere  Company","DE",1.4199999999999999E-2,8.4599999999999995E-2,8.1799999999999998E-2,0.05,67.2346,3.2088618096726574E-3,4.5565837697351734E-5,67.2346,3.7130994293754827E-3,3.1412821172516583E-4,67.2346,3.4019978874770393E-3,2.7828342719562181E-4,67.2346,3.3585477793376282E-3,1.6792738896688142E-4,null,8.4599999999999995E-2,8.1799999999999998E-2,0.05]
[99,"Discover Financial Services","DFS",3.3099999999999997E-2,7.0000000000000001E-3,"NMF",4.4999999999999998E-2,16.310739999999999,7.7845202728208686E-4,2.5766762103037074E-5,16.310739999999999,9.0077726924369078E-4,6.3054408847058354E-6,"--","--","--",16.310739999999999,8.147650109668745E-4,3.666442549350935E-5,null,7.0000000000000001E-3,"n/a",4.4999999999999998E-2]
[100,"Dollar General Corporation","DG",7.0999999999999995E-3,0.1479,0.1109,0.125,50.85772,2.4272531618396674E-3,1.7233497449061638E-5,50.85772,2.808669511104968E-3,4.1540222069242478E-4,50.85772,2.5733455096319273E-3,2.8538401701818072E-4,50.85772,2.5404788987838833E-3,3.1755986234798542E-4,null,0.1479,0.1109,0.125]
[101,"Quest Diagnostics Incorporated","DGX",2.0099999999999996E-2,0.11700000000000001,0.17129999999999998,0.09,14.916879999999999,7.1192818208883318E-4,1.4309756459985544E-5,14.916879999999999,8.2379992765722627E-4,9.638459153589548E-5,14.916879999999999,7.5477796027266454E-4,1.2929346459470743E-4,14.916879999999999,7.4513798250671346E-4,6.7062418425604213E-5,null,0.11700000000000001,0.17129999999999998,0.09]
[102,"D.R. Horton, Inc.","DHI",1.01E-2,0.186,0.13780000000000001,0.105,25.879759999999997,1.235146390511642E-3,1.2474978544167584E-5,25.879759999999997,1.4292361684069576E-3,2.6583792732369412E-4,25.879759999999997,1.3094878061059747E-3,1.8044741968140332E-4,25.879759999999997,1.2927631082476994E-3,1.3574012636600842E-4,null,0.186,0.13780000000000001,0.105]
[103,"Danaher Corporation","DHR",3.4999999999999996E-3,0.13020000000000001,0.1164,0.14499999999999999,145.52779999999998,6.9455101936455408E-3,2.430928567775939E-5,145.52779999999998,8.0369213342277538E-3,1.0464071577164537E-3,145.52779999999998,7.3635489490408365E-3,8.5711709766835334E-4,145.52779999999998,7.2695021539786126E-3,1.0540778123268987E-3,null,0.13020000000000001,0.1164,0.14499999999999999]
[104,"Digital Realty Trust, Inc.","DLR",3.3300000000000003E-2,0.1666,6.8000000000000005E-2,8.5000000000000006E-2,29.076930000000001,1.3877356334316732E-3,4.6211596593274723E-5,29.076930000000001,1.6058031458652368E-3,2.6752680410114843E-4,29.076930000000001,1.4712611428389214E-3,1.0004575771304667E-4,29.076930000000001,1.4524702858566224E-3,1.2345997429781292E-4,null,0.1666,6.8000000000000005E-2,8.5000000000000006E-2]
[105,"Dover Corporation","DOV",1.8500000000000003E-2,1.24E-2,0.115,5.5E-2,15.397590000000001,7.3487071406682888E-4,1.3595108210236335E-5,15.397590000000001,8.5034762819675644E-4,1.0544310589639779E-5,15.397590000000001,7.7910136525297373E-4,8.9596657004091987E-5,15.397590000000001,7.6915073045204815E-4,4.2303290174862652E-5,null,1.24E-2,0.115,5.5E-2]
[106,"Dow Inc.","DOW",6.3099999999999989E-2,"NMF",0.05,"NMF",35.23845,1.6818024713028627E-3,1.0612173593921061E-4,"--","--","--",35.23845,1.7830273766478164E-3,8.9151368832390832E-5,"--","--","--",null,-0.1042,0.05,"n/a"]
[107,"Dominos Pizza Inc","DPZ",7.4999999999999997E-3,0.15260000000000001,0.1389,0.13500000000000001,16.271560000000001,7.7658210903013068E-4,5.8243658177259797E-6,16.271560000000001,8.9861351374216441E-4,1.3712842219705431E-4,16.271560000000001,8.2332329999666677E-4,1.1435960636953701E-4,16.271560000000001,8.1280786536037963E-4,1.0972906182365125E-4,null,0.15260000000000001,0.1389,0.13500000000000001]
[108,"Duke Realty Corporation","DRE",2.6200000000000001E-2,0.06,4.4500000000000005E-2,"NMF",13.20941,6.3043687740104196E-4,1.6517446187907301E-5,13.20941,7.2950315363498543E-4,4.3770189218099125E-5,13.20941,6.6838182892168727E-4,2.9742991387015088E-5,"--","--","--",null,0.06,4.4500000000000005E-2,-0.03]
[109,"DTE Energy Company","DTE",3.8800000000000001E-2,5.9499999999999997E-2,5.67E-2,0.06,21.557650000000002,1.0288678714722743E-3,3.9920073413124244E-5,21.557650000000002,1.1905432309209302E-3,7.0837322239795339E-5,21.557650000000002,1.0907937246442962E-3,6.1848004187331601E-5,21.557650000000002,1.0768621741668401E-3,6.4611730450010396E-5,null,5.9499999999999997E-2,5.67E-2,0.06]
[110,"Duke Energy Corporation","DUK",4.7699999999999992E-2,1.6E-2,4.2999999999999997E-2,0.05,59.7408,2.8512101150195328E-3,1.3600272248643169E-4,59.7408,3.2992466734454409E-3,5.2787946775127056E-5,59.7408,3.0228197296658017E-3,1.2998124837562946E-4,59.7408,2.9842124616767762E-3,1.4921062308383883E-4,null,1.6E-2,4.2999999999999997E-2,0.05]
[111,"Devon Energy Corporation","DVN",5.0700000000000002E-2,"NMF",4.1100000000000005E-2,2.5000000000000001E-2,3.3244400000000001,1.5866337502637285E-4,8.0442331138371033E-6,"--","--","--",3.3244400000000001,1.6821306079078583E-4,6.9135567985012982E-6,3.3244400000000001,1.6606465390648839E-4,4.1516163476622098E-6,null,-0.35899999999999999,4.1100000000000005E-2,2.5000000000000001E-2]
[112,"eBay Inc.","EBAY",1.3000000000000001E-2,0.15920000000000001,0.12619999999999998,0.185,35.729399999999998,1.7052337210679953E-3,2.216803837388394E-5,35.729399999999998,1.973192593574266E-3,3.1413226089702318E-4,35.729399999999998,1.8078689145294554E-3,2.2815305701361723E-4,35.729399999999998,1.7847789237545228E-3,3.3018410089458671E-4,null,0.15920000000000001,0.12619999999999998,0.185]
[113,"Ecolab Inc.","ECL",9.5999999999999992E-3,8.1100000000000005E-2,0.1002,8.5000000000000006E-2,55.706960000000002,2.6586896698569239E-3,2.5523420830626466E-5,55.706960000000002,3.0764737410238605E-3,2.4950202039703511E-4,55.706960000000002,2.8187117977613897E-3,2.8243492213569124E-4,55.706960000000002,2.7827113837466141E-3,2.3653046761846222E-4,null,8.1100000000000005E-2,0.1002,8.5000000000000006E-2]
[114,"Consolidated Edison Inc","ED",4.24E-2,2.5499999999999998E-2,0.02,0.03,24.488880000000002,1.1687647698306609E-3,4.955562624082002E-5,24.488880000000002,1.352423400362978E-3,3.4486796709255936E-5,24.488880000000002,1.2391107856175054E-3,2.4782215712350107E-5,24.488880000000002,1.2232849387438262E-3,3.6698548162314788E-5,null,2.5499999999999998E-2,0.02,0.03]
[115,"Equifax, Inc.","EFX",1.03E-2,6.4299999999999996E-2,6.6600000000000006E-2,7.4999999999999997E-2,18.487439999999999,8.8233796549120052E-4,9.0880810445593659E-6,18.487439999999999,1.020987749084749E-3,6.5649512266149361E-5,18.487439999999999,9.3544442630518376E-4,6.2300598791925247E-5,18.487439999999999,9.2349698752781516E-4,6.9262274064586132E-5,null,6.4299999999999996E-2,6.6600000000000006E-2,7.4999999999999997E-2]
[116,"Edison International","EIX",5.2699999999999997E-2,1.4E-2,2.8900000000000002E-2,0.14000000000000001,18.645610000000001,8.8988684170130555E-4,4.6897036557658798E-5,18.645610000000001,1.0297228488212586E-3,1.441611988349762E-5,18.645610000000001,9.4344765687191952E-4,2.7265637283598475E-5,18.645610000000001,9.3139800132514329E-4,1.3039572018552008E-4,null,1.4E-2,2.8900000000000002E-2,0.14000000000000001]
[117,"The Estee Lauder Companies Inc.","EL",1.0200000000000001E-2,0.1331,0.11960000000000001,0.115,74.743899999999996,3.5672532626949832E-3,3.6385983279488828E-5,74.743899999999996,4.127808188630528E-3,5.4941126990672325E-4,74.743899999999996,3.781960328488532E-3,4.5232245528722845E-4,74.743899999999996,3.7336573633818559E-3,4.2937059678891347E-4,null,0.1331,0.11960000000000001,0.115]
[118,"Eastman Chemical Company","EMN",3.4300000000000004E-2,3.3099999999999997E-2,4.3400000000000001E-2,0.05,10.419379999999999,4.972789391543504E-4,1.7056667612994222E-5,10.419379999999999,5.7542089835362022E-4,1.9046431735504826E-5,10.419379999999999,5.2720933490822447E-4,2.2880885135016942E-5,10.419379999999999,5.204758496529301E-4,2.6023792482646507E-5,null,3.3099999999999997E-2,4.3400000000000001E-2,0.05]
[119,"Emerson Electric Co.","EMR",3.15E-2,9.9000000000000008E-3,7.6700000000000004E-2,8.5000000000000006E-2,39.036790000000003,1.8630833618882466E-3,5.8687125899479768E-5,39.036790000000003,2.1558465830636394E-3,2.1342881172330032E-5,39.036790000000003,1.9752192637999605E-3,1.5149931753345697E-4,39.036790000000003,1.9499918846392979E-3,1.6574931019434032E-4,null,9.9000000000000008E-3,7.6700000000000004E-2,8.5000000000000006E-2]
[120,"EOG Resources, Inc.","EOG",4.1799999999999997E-2,"NMF",8.3800000000000013E-2,7.4999999999999997E-2,21.18207,1.0109428102913218E-3,4.2257409470177246E-5,"--","--","--",21.18207,1.0717897837183648E-3,8.9815983875598986E-5,21.18207,1.0581009504075907E-3,7.9357571280569297E-5,null,-3.0200000000000001E-2,8.3800000000000013E-2,7.4999999999999997E-2]
[121,"Equinix, Inc.","EQIX",1.5300000000000001E-2,0.157,0.13589999999999999,0.14499999999999999,62.619150000000005,2.9885832441802818E-3,4.5725323635958317E-5,62.619150000000005,3.4582064908987003E-3,5.4293841907109594E-4,62.619150000000005,3.1684611199532362E-3,4.3059386620164476E-4,62.619150000000005,3.127993729069703E-3,4.5355909071510689E-4,null,0.157,0.13589999999999999,0.14499999999999999]
[122,"Equity Residential","EQR",4.7E-2,6.0999999999999999E-2,3.6499999999999998E-2,0.01,19.04814,9.0909812791774075E-4,4.2727612012133815E-5,19.04814,1.0519529790415099E-3,6.4169131721532094E-5,19.04814,9.6381523858797243E-4,3.5179256208460992E-5,19.04814,9.5150544953806894E-4,9.5150544953806892E-6,null,6.0999999999999999E-2,3.6499999999999998E-2,0.01]
[123,"Eversource Energy","ES",2.9900000000000003E-2,6.4399999999999999E-2,6.59E-2,5.5E-2,26.505939999999999,1.2650316741004612E-3,3.7824447055603795E-5,26.505939999999999,1.4638175982167035E-3,9.4269853325155696E-5,26.505939999999999,1.3411718354179715E-3,8.8383223954044326E-5,26.505939999999999,1.3240424710826927E-3,7.2822335909548104E-5,null,6.4399999999999999E-2,6.59E-2,5.5E-2]
[124,"Essex Property Trust, Inc.","ESS",4.2000000000000003E-2,7.9000000000000001E-2,2.2099999999999998E-2,0.01,13.34596,6.3695391000197666E-4,2.6752064220083021E-5,13.34596,7.3704426679816663E-4,5.8226497077055164E-5,13.34596,6.7529111092135691E-4,1.4923933551361987E-5,13.34596,6.6666633431490356E-4,6.666663343149036E-6,null,7.9000000000000001E-2,2.2099999999999998E-2,0.01]
[125,"ETRADE Financial Corporation","ETFC",1.1699999999999999E-2,"NMF","NMF",5.5E-2,10.61684,5.0670298351451564E-4,5.928424907119832E-6,"--","--","--","--","--","--",10.61684,5.3033950385044163E-4,2.9168672711774289E-5,null,-9.7900000000000001E-2,"n/a",5.5E-2]
[126,"Eaton Corporation, PLC","ETN",2.9600000000000001E-2,"NMF",0.11,0.04,39.521879999999996,1.8862349352634742E-3,5.5832554083798839E-5,"--","--","--",39.521879999999996,1.9997642920329866E-3,2.1997407212362853E-4,39.521879999999996,1.9742234252787733E-3,7.8968937011150941E-5,null,-4.1000000000000003E-3,0.11,0.04]
[127,"Entergy Corporation","ETR",3.9900000000000005E-2,5.3999999999999999E-2,5.4299999999999994E-2,0.03,19.053979999999999,9.093768497807173E-4,3.6284136306250622E-5,19.053979999999999,1.052275499003963E-3,5.6822876946214002E-5,19.053979999999999,9.6411073625826216E-4,5.2351212978823631E-5,19.053979999999999,9.5179717313025698E-4,2.8553915193907707E-5,null,5.3999999999999999E-2,5.4299999999999994E-2,0.03]
[128,"Evergy Inc.","EVRG",4.36E-2,6.8000000000000005E-2,6.4100000000000004E-2,"NMF",11.141639999999999,5.3174977010529191E-4,2.3184289976590727E-5,11.141639999999999,6.1530844425797206E-4,4.1840974209542104E-5,11.141639999999999,5.6375490808348197E-4,3.6136689608151197E-5,"--","--","--",null,6.8000000000000005E-2,6.4100000000000004E-2,"n/a"]
[129,"Exelon Corporation","EXC",4.5499999999999999E-2,"NMF",0.04,0.05,33.600900000000003,{"$f":"H133/H$384","v":1.6036481927553671E-3},{"$f":"D133*I133","v":7.2965992770369198E-5},{"$f":"IF(E133=\"n/a\",\"--\",IF(E133=\"NMF\",\"--\",$H133))","v":"--"},{"$f":"IF(K133=\"--\",\"--\",K133/K$384)","v":"--"},{"$f":"IF(L133=\"--\",\"--\",E133*L133)","v":"--"},33.600900000000003,{"$f":"IF(N133=\"--\",\"--\",N133/N$384)","v":1.7001691215137334E-3},{"$f":"IF(O133=\"--\",\"--\",F133*O133)","v":6.8006764860549339E-5},33.600900000000003,{"$f":"IF(Q133=\"--\",\"--\",Q133/Q$384)","v":1.6784546658825325E-3},8.3922733294126633E-5,null,-3.4799999999999998E-2,0.04,0.05]
[130,"Expeditors International of Washington, Inc.","EXPD",1.1699999999999999E-2,{"$f":"IF(AND(U134>=$D$399,U134<=$D$400),U134,\"NMF\")","v":6.59E-2},{"$f":"IF(AND(V134>=$D$399,V134<=$D$400),V134,\"NMF\")","v":"NMF"},{"$f":"IF(AND(W134>=$D$399,W134<=$D$400),W134,\"NMF\")","v":5.5E-2},14.80325,7.0650503734738903E-4,8.2661089369644501E-6,14.80325,8.1752459489463185E-4,5.3874870803556236E-5,{"$f":"IF(F134=\"n/a\",\"--\",IF(F134=\"NMF\",\"--\",$H134))","v":"--"},"--","--",{"$f":"IF(G134=\"n/a\",\"--\",IF(G134=\"NMF\",\"--\",$H134))","v":14.80325},7.394618606265189E-4,{"$f":"IF(R134=\"--\",\"--\",G134*R134)","v":4.0670402334458537E-5},null,6.59E-2,"n/a",5.5E-2]
[131,"Extra Space Storage Inc","EXR",3.4500000000000003E-2,0.06,1.2E-2,0.03,13.52205,6.4535804233957147E-4,2.2264852460715219E-5,13.52205,7.4676901683042279E-4,4.4806141009825369E-5,13.52205,6.842010740654202E-4,8.2104128887850424E-6,13.52205,6.754624999567541E-4,2.0263874998702623E-5,null,0.06,1.2E-2,0.03]
[132,"Diamondback Energy, Inc.","FANG",5.0199999999999995E-2,0.13450000000000001,"NMF",5.0000000000000001E-3,4.7189399999999999,2.2521776508132254E-4,1.130593180708239E-5,4.7189399999999999,2.6060827938676129E-4,3.5051813577519394E-5,"--","--","--",4.7189399999999999,2.3572365207538243E-4,1.1786182603769121E-6,null,0.13450000000000001,0.21940000000000001,5.0000000000000001E-3]
[133,"Fastenal Company","FAST",2.2599999999999999E-2,9.0999999999999998E-2,0.09,0.08,25.3461,1.2096767484917608E-3,2.7338694515913792E-5,25.3461,1.3997642500571718E-3,1.2737854675520262E-4,25.3461,1.282485188515761E-3,1.1542366696641849E-4,25.3461,1.2661053664314126E-3,1.0128842931451301E-4,null,9.0999999999999998E-2,0.09,0.08]
[134,"Fortune Brands Home  Security, Inc.","FBHS",1.1699999999999999E-2,7.2999999999999995E-2,7.3200000000000001E-2,7.0000000000000007E-2,11.382010000000001,5.4322175198948585E-4,6.3556944982769833E-6,11.382010000000001,6.2858312291805176E-4,4.5886567973017773E-5,11.382010000000001,5.7591736955737874E-4,4.2157151451600125E-5,11.382010000000001,5.6856178827417259E-4,3.9799325179192082E-5,null,7.2999999999999995E-2,7.3200000000000001E-2,7.0000000000000007E-2]
[135,"FedEx Corporation","FDX",1.0800000000000001E-2,"NMF",0.12,0.03,63.394959999999998,3.0256098209809489E-3,3.2676586066594252E-5,"--","--","--",63.394959999999998,3.2077162650880854E-3,3.8492595181057024E-4,63.394959999999998,3.1667475099011189E-3,9.5002425297033562E-5,null,0.2611,0.12,0.03]
[136,"FirstEnergy Corporation","FE",5.7699999999999994E-2,"NMF","NMF",8.5000000000000006E-2,14.95139,7.1357521830310089E-4,4.1173290096088915E-5,"--","--","--","--","--","--",14.95139,7.468618491447978E-4,6.3483257177307813E-5,null,-2.4E-2,"n/a",8.5000000000000006E-2]
[137,"Fidelity National Information Services, Inc.","FIS",9.7999999999999997E-3,0.12540000000000001,0.17120000000000002,"NMF",88.750969999999995,4.235759537565535E-3,4.1510443468142241E-5,88.750969999999995,4.9013629301508533E-3,6.1463091144091711E-4,88.750969999999995,4.490702888862848E-3,7.6880833457331963E-4,"--","--","--",null,0.12540000000000001,0.17120000000000002,0.28499999999999998]
[138,"Fifth Third Bancorp","FITB",5.5199999999999999E-2,"NMF",8.2500000000000004E-2,0.02,13.930669999999999,6.6485998200558336E-4,3.6700271006708202E-5,"--","--","--",13.930669999999999,7.0487680318079922E-4,5.8152336262415937E-5,13.930669999999999,6.9587415992934166E-4,1.3917483198586834E-5,null,-2.98E-2,8.2500000000000004E-2,0.02]
[139,"FLIR Systems, Inc.","FLIR",1.9699999999999999E-2,0.06,"NMF",0.08,4.5257800000000001,2.1599894401067783E-4,4.2551791970103526E-6,4.5257800000000001,2.4994082117658131E-4,1.4996449270594878E-5,"--","--","--",4.5257800000000001,2.260747943584204E-4,1.8085983548673631E-5,null,0.06,"n/a",0.08]
[140,"Flowserve Corporation","FLS",0.03,2.4500000000000001E-2,5.04E-2,9.5000000000000001E-2,3.46367,1.6530831423565982E-4,4.9592494270697944E-6,3.46367,1.9128471204625264E-4,4.6864754451331897E-6,3.46367,1.7525794788572546E-4,8.8330005734405633E-6,3.46367,1.7301956413600086E-4,1.6436858592920082E-5,null,2.4500000000000001E-2,5.04E-2,9.5000000000000001E-2]
[141,"FMC Corporation","FMC",1.8000000000000002E-2,9.5399999999999999E-2,0.1048,0.11,13.540940000000001,6.4625959302306961E-4,1.1632672674415254E-5,13.540940000000001,7.4781223636650844E-4,7.1341287349364904E-5,13.540940000000001,6.8515688759140892E-4,7.1804441819579653E-5,13.540940000000001,6.7640610589107494E-4,7.440467164801825E-5,null,9.5399999999999999E-2,0.1048,0.11]
[142,"Fox Corporation","FOXA",1.78E-2,"NMF","NMF","NMF",15.64236,7.4655269187518317E-4,1.328863791537826E-5,"--","--","--","--","--","--","--","--","--",null,-2.3199999999999998E-2,"n/a","n/a"]
[143,"First Republic Bank","FRC",7.9000000000000008E-3,7.2099999999999997E-2,7.85E-2,0.09,17.371169999999999,8.2906247679515271E-4,6.549593566681707E-6,17.371169999999999,9.5934059865879326E-4,6.9168457163298997E-5,17.371169999999999,8.7896237417943316E-4,6.8998546373085507E-5,17.371169999999999,8.6773632070387006E-4,7.8096268863348298E-5,null,7.2099999999999997E-2,7.85E-2,0.09]
[144,"Federal Realty Investment Trust","FRT",5.9299999999999999E-2,6.7000000000000004E-2,1.38E-2,5.0000000000000001E-3,5.3981599999999998,2.5763445408320346E-4,1.5277723127133964E-5,5.3981599999999998,2.9811889734865019E-4,1.9973966122359563E-5,5.3981599999999998,2.7314104518005687E-4,3.7693464234847849E-6,5.3981599999999998,2.6965250452161849E-4,1.3482625226080924E-6,null,6.7000000000000004E-2,1.38E-2,5.0000000000000001E-3]
[145,"Fortive Corporation","FTV",3.9000000000000003E-3,5.1400000000000001E-2,5.3699999999999998E-2,0.105,24.1629,1.1532069354311537E-3,4.4975070481814995E-6,24.1629,1.3344208220478274E-3,6.8589230253258331E-5,24.1629,1.2226165509323912E-3,6.5654508785069406E-5,24.1629,1.20700136741138E-3,1.267351435781949E-4,null,5.1400000000000001E-2,5.3699999999999998E-2,0.105]
[146,"General Dynamics Corporation","GD",3.2199999999999999E-2,3.8800000000000001E-2,5.2000000000000005E-2,0.06,39.169089999999997,1.8693975575169804E-3,6.0194601352046765E-5,39.169089999999997,2.1631529856377062E-3,8.3930335842742997E-5,39.169089999999997,1.9819135004060114E-3,1.030595020211126E-4,39.169089999999997,1.9566006228664361E-3,1.1739603737198616E-4,null,3.8800000000000001E-2,5.2000000000000005E-2,0.06]
[147,"General Electric Company","GE",6.6E-3,"NMF",4.4999999999999998E-2,0.04,53.482589999999995,2.5525286167149166E-3,1.6846688870318448E-5,"--","--","--",53.482589999999995,2.7061610866547969E-3,1.2177724889946585E-4,53.482589999999995,2.6715981634117675E-3,1.068639265364707E-4,null,-8.3699999999999997E-2,4.4999999999999998E-2,0.04]
[148,"Gilead Sciences, Inc.","GILD",4.3099999999999999E-2,2.3999999999999998E-3,0.12809999999999999,3.5000000000000003E-2,79.114850000000004,3.7758627364925328E-3,1.6273968394282817E-4,79.114850000000004,4.3691983649806337E-3,1.0486076075953519E-5,79.114850000000004,4.0031256610147583E-3,5.1280039717599055E-4,79.114850000000004,3.951997985860399E-3,1.3831992950511397E-4,null,2.3999999999999998E-3,0.12809999999999999,3.5000000000000003E-2]
[149,"General Mills, Inc.","GIS",3.5299999999999998E-2,5.0500000000000003E-2,7.4999999999999997E-2,3.5000000000000003E-2,35.197660000000006,1.6798557136332025E-3,5.9298906691252047E-5,35.197660000000006,1.9438267091847392E-3,9.8163248813829337E-5,35.197660000000006,1.7809634468582412E-3,1.3357225851436808E-4,35.197660000000006,1.7582170910644354E-3,6.153759818725524E-5,null,5.0500000000000003E-2,7.4999999999999997E-2,3.5000000000000003E-2]
[150,"Globe Life Inc.","GL",9.7000000000000003E-3,5.0999999999999997E-2,"NMF",0.08,8.2403700000000004,3.932827530850526E-4,3.8148427049250102E-6,8.2403700000000004,4.5508284640412598E-4,2.3209225166610425E-5,"--","--","--",8.2403700000000004,4.1162848242453162E-4,3.2930278593962534E-5,null,5.0999999999999997E-2,"n/a",0.08]
[151,"Corning Incorporated","GLW",2.8799999999999999E-2,1.2999999999999999E-2,2.4E-2,0.13500000000000001,23.21781,1.1081012427118762E-3,3.1913315790102033E-5,23.21781,1.2822272618911747E-3,1.666895440458527E-5,23.21781,1.1747960212724292E-3,2.8195104510538302E-5,23.21781,1.1597915986201E-3,1.5657186581371352E-4,null,1.2999999999999999E-2,2.4E-2,0.13500000000000001]
[152,"Genuine Parts Company","GPC",3.3399999999999999E-2,"NMF",1.4999999999999999E-2,7.0000000000000007E-2,13.65719,6.5180778079208205E-4,2.1770379878455539E-5,"--","--","--",13.65719,6.9103901159332467E-4,1.0365585173899869E-5,13.65719,6.8221310376639498E-4,4.775491726364765E-5,null,-1.2999999999999999E-2,1.4999999999999999E-2,7.0000000000000007E-2]
[153,"Global Payments Inc.","GPN",4.5000000000000005E-3,0.17050000000000001,"NMF",0.115,52.301870000000001,2.4961771649933823E-3,1.1232797242470222E-5,52.301870000000001,2.8884241692859135E-3,4.9247632086324834E-4,"--","--","--",52.301870000000001,2.6126180470130754E-3,3.0045107540650371E-4,null,0.17050000000000001,0.2039,0.115]
[154,"Garmin Ltd.","GRMN",2.7400000000000001E-2,4.3200000000000002E-2,6.8000000000000005E-2,7.4999999999999997E-2,17.871700000000001,8.5295094495879849E-4,2.3370855891871081E-5,17.871700000000001,9.8698287893390934E-4,4.2637660369944883E-5,17.871700000000001,9.0428864967774633E-4,6.1491628178086748E-5,17.871700000000001,8.9273913056652811E-4,6.6955434792489608E-5,null,4.3200000000000002E-2,6.8000000000000005E-2,7.4999999999999997E-2]
[155,"The Goldman Sachs Group, Inc.","GS",2.69E-2,6.2899999999999998E-2,2.3900000000000001E-2,6.5000000000000002E-2,64.013180000000006,3.0551152028524238E-3,8.2182598956730208E-5,64.013180000000006,3.5351932209087295E-3,2.2236365359515909E-4,64.013180000000006,3.2389975270275644E-3,7.741204089595879E-5,64.013180000000006,3.1976292494837462E-3,2.078459012164435E-4,null,6.2899999999999998E-2,2.3900000000000001E-2,6.5000000000000002E-2]
[156,"W.W. Grainger, Inc.","GWW",1.8100000000000002E-2,5.6000000000000001E-2,9.6000000000000002E-2,7.0000000000000007E-2,18.16573,8.6698392259082198E-4,1.569240899889388E-5,18.16573,1.003220985879132E-3,5.6180375209231395E-5,18.16573,9.1916624899201116E-4,8.8239959903233078E-5,18.16573,9.0742671409582167E-4,6.3519869986707525E-5,null,5.6000000000000001E-2,9.6000000000000002E-2,7.0000000000000007E-2]
[157,"Halliburton Company","HAL",1.4199999999999999E-2,"NMF",6.5299999999999997E-2,1.4999999999999999E-2,11.094049999999999,5.2947847328011085E-4,7.5185943205775732E-6,"--","--","--",11.094049999999999,5.6134690566411705E-4,3.6655952939866842E-5,11.094049999999999,5.5417741745114287E-4,8.3126612617671425E-6,null,-0.10829999999999999,6.5299999999999997E-2,1.4999999999999999E-2]
[158,"Hasbro, Inc.","HAS",3.5400000000000001E-2,8.4000000000000005E-2,0.11349999999999999,0.09,10.53425,5.027612645653308E-4,1.779774876561271E-5,10.53425,5.8176471138221509E-4,4.8868235756106071E-5,10.53425,5.3302163240585951E-4,6.0497955278065046E-5,10.53425,5.262139128437949E-4,4.7359252155941538E-5,null,8.4000000000000005E-2,0.11349999999999999,0.09]
[159,"Huntington Bancshares Incorporated","HBAN",6.9000000000000006E-2,"NMF",4.9200000000000001E-2,2.5000000000000001E-2,8.8404199999999999,4.2192094724243699E-4,2.9112545359728156E-5,"--","--","--",8.8404199999999999,4.4731567027110695E-4,2.2007930977338462E-5,8.8404199999999999,4.4160258199516254E-4,1.1040064549879064E-5,null,-9.2999999999999992E-3,4.9200000000000001E-2,2.5000000000000001E-2]
[160,"Hanesbrands Inc.","HBI",3.7499999999999999E-2,7.0000000000000001E-3,3.3000000000000002E-2,3.5000000000000003E-2,5.5694900000000001,2.6581140901193388E-4,9.9679278379475198E-6,5.5694900000000001,3.0758077152109859E-4,2.1530654006476901E-6,5.5694900000000001,2.8181015748326749E-4,9.2997351969478276E-6,5.5694900000000001,2.7821089545476772E-4,9.7373813409168706E-6,null,7.0000000000000001E-3,3.3000000000000002E-2,3.5000000000000003E-2]
[161,"The Home Depot, Inc.","HD",2.3099999999999999E-2,5.9499999999999997E-2,0.10589999999999999,0.08,286.80779999999999,1.3688288413052706E-2,3.1619946234151753E-4,286.80779999999999,1.5839253576587612E-2,9.4243558780696287E-4,286.80779999999999,1.4512163822078768E-2,1.5368381487581414E-3,286.80779999999999,1.4326815356776282E-2,1.1461452285421027E-3,null,5.9499999999999997E-2,0.10589999999999999,0.08]
[162,"Hess Corporation","HES",2.5399999999999999E-2,"NMF","NMF","NMF",12.101469999999999,5.7755894917050699E-4,1.4669997308930877E-5,"--","--","--","--","--","--","--","--","--",null,-0.23400000000000001,"n/a","n/a"]
[163,"HollyFrontier Corporation","HFC",7.1900000000000006E-2,"NMF","NMF",1.4999999999999999E-2,3.24282,1.5476795063319609E-4,1.1127815650526801E-5,"--","--","--","--","--","--",3.24282,1.6198751698963997E-4,2.4298127548445993E-6,null,-0.23089999999999999,"n/a",1.4999999999999999E-2]
[164,"The Hartford Financial Services Group, Inc.","HIG",3.6799999999999999E-2,"NMF",7.0000000000000007E-2,8.5000000000000006E-2,12.637309999999999,6.0313263462554053E-4,2.2195280954219891E-5,"--","--","--",12.637309999999999,6.3943418899483988E-4,4.4760393229638797E-5,12.637309999999999,6.3126737479365089E-4,5.3657726857460327E-5,null,-2.76E-2,7.0000000000000007E-2,8.5000000000000006E-2]
[165,"Huntington Ingalls Industries, Inc.","HII",2.9600000000000001E-2,2.3E-2,"NMF",7.4999999999999997E-2,5.6469199999999997,2.6950686001369413E-4,7.9774030564053461E-6,5.6469199999999997,3.1185692232465128E-4,7.1727092134669797E-6,"--","--","--",5.6469199999999997,2.8207873068475517E-4,2.1155904801356637E-5,null,2.3E-2,"n/a",7.4999999999999997E-2]
[166,"Honeywell International Inc.","HON",2.2700000000000001E-2,2.4400000000000002E-2,7.6799999999999993E-2,7.4999999999999997E-2,111.4388,5.3185667712122827E-3,1.2073146570651882E-4,111.4388,6.1543215054494045E-3,1.5016544473296547E-4,111.4388,5.6386824965564799E-3,4.3305081573553764E-4,111.4388,5.5666655899202213E-3,4.1749991924401657E-4,null,2.4400000000000002E-2,7.6799999999999993E-2,7.4999999999999997E-2]
[167,"Hewlett Packard Enterprise Company","HPE",5.2900000000000003E-2,"NMF",0.05,0.04,11.664069999999999,5.5668344525510003E-4,2.9448554253994791E-5,"--","--","--",11.664069999999999,5.9018929984538178E-4,2.950946499226909E-5,11.664069999999999,5.8265143834482019E-4,2.3306057533792807E-5,null,-2.6200000000000001E-2,0.05,0.04]
[168,"HP Inc.","HPQ",3.8199999999999998E-2,9.3399999999999997E-2,2.23E-2,0.08,25.162459999999999,1.2009122822388451E-3,4.5874849181523881E-5,25.162459999999999,1.3896225435666072E-3,1.2979074556912111E-4,25.162459999999999,1.273193203554799E-3,2.8392208439272019E-5,25.162459999999999,1.2569320581318532E-3,1.0055456465054826E-4,null,9.3399999999999997E-2,2.23E-2,0.08]
[169,"Hormel Foods Corporation","HRL",2.1000000000000001E-2,0.03,7.4999999999999997E-2,8.5000000000000006E-2,25.707189999999997,1.2269102549133755E-3,2.5765115353180887E-5,25.707189999999997,1.4197058139685088E-3,4.2591174419055262E-5,25.707189999999997,1.3007559511467438E-3,9.7556696336005783E-5,25.707189999999997,1.2841427760038801E-3,1.0915213596032981E-4,null,0.03,7.4999999999999997E-2,8.5000000000000006E-2]
[170,"Hershey Company The","HSY",2.4199999999999999E-2,6.7799999999999999E-2,8.5000000000000006E-2,0.05,27.940300000000001,1.3334884363229193E-3,3.2270420159014644E-5,27.940300000000001,1.5430315936523723E-3,1.0461754204963084E-4,27.940300000000001,1.4137488967804481E-3,1.201686562263381E-4,27.940300000000001,1.3956925826736106E-3,6.9784629133680531E-5,null,6.7799999999999999E-2,8.5000000000000006E-2,0.05]
[171,"Humana Inc.","HUM",6.8999999999999999E-3,0.1245,0.1234,0.105,50.98798,2.4334699957217452E-3,1.6790942970480041E-5,50.98798,2.8158632525962604E-3,3.5057497494823443E-4,50.98798,2.5799365244490416E-3,3.1836416711701171E-4,50.98798,2.5469857335644356E-3,2.6743350202426572E-4,null,0.1245,0.1234,0.105]
[172,"International Business Machines Corporation","IBM",5.4900000000000004E-2,2.5700000000000001E-2,3.2799999999999996E-2,5.0000000000000001E-3,105.8275,5.0507599236573599E-3,2.7728671980878909E-4,105.8275,5.8444317339916337E-3,1.50201895563585E-4,105.8275,5.3547567983891686E-3,1.756360229871647E-4,105.8275,5.2863661733371335E-3,2.6431830866685669E-5,null,2.5700000000000001E-2,3.2799999999999996E-2,5.0000000000000001E-3]
[173,"Intercontinental Exchange Inc.","ICE",1.24E-2,9.1999999999999998E-2,8.5099999999999995E-2,9.5000000000000001E-2,52.768000000000001,2.5184238468408645E-3,3.1228455700826717E-5,52.768000000000001,2.9141666744397299E-3,2.6810333404845513E-4,52.768000000000001,2.6700036071663756E-3,2.2721730696985854E-4,52.768000000000001,2.6359024850313374E-3,2.5041073607797706E-4,null,9.1999999999999998E-2,8.5099999999999995E-2,9.5000000000000001E-2]
[174,"IDEX Corporation","IEX",1.1299999999999999E-2,0.13,0.1,6.5000000000000002E-2,13.321209999999999,6.3577268292857388E-4,7.1842313170928845E-6,13.321209999999999,7.3567742277920846E-4,9.5638064961297106E-5,13.321209999999999,6.7403878774675548E-4,6.7403878774675551E-5,13.321209999999999,6.6543000573499663E-4,4.3252950372774779E-5,null,0.13,0.1,6.5000000000000002E-2]
[175,"International Flavors  Fragrances Inc.","IFF",2.69E-2,3.8E-3,"NMF",6.5000000000000002E-2,12.41694,5.9261517966934896E-4,1.5941348333105489E-5,12.41694,6.8573818879846989E-4,2.6058051174341856E-6,"--","--","--",12.41694,6.2025930492883973E-4,4.0316854820374585E-5,null,3.8E-3,"n/a",6.5000000000000002E-2]
[176,"IHS Markit Ltd.","INFO",8.8999999999999999E-3,0.11119999999999999,0.12,0.12,30.446459999999998,1.4530982966170121E-3,1.2932574839891407E-5,30.446459999999998,1.6814368383615498E-3,1.8697577642580432E-4,30.446459999999998,1.5405578764676844E-3,1.848669451761221E-4,30.446459999999998,1.5208819658582326E-3,1.825058359029879E-4,null,0.11119999999999999,0.12,0.12]
[177,"Intel Corporation","INTC",2.7000000000000003E-2,8.6199999999999999E-2,7.4999999999999997E-2,7.0000000000000007E-2,207.63149999999999,9.909492892573887E-3,2.6755630809949498E-4,207.63149999999999,1.1466661572618496E-2,9.8842622755971428E-4,207.63149999999999,1.0505928857666868E-2,7.8794466432501509E-4,207.63149999999999,1.0371747779350821E-2,7.2602234455455752E-4,null,8.6199999999999999E-2,7.4999999999999997E-2,7.0000000000000007E-2]
[178,"Intuit Inc.","INTU",7.7000000000000002E-3,9.0899999999999995E-2,0.13200000000000001,0.125,79.510190000000009,3.7947308702783512E-3,2.9219427701143307E-5,79.510190000000009,4.3910314201101256E-3,3.9914475608801038E-4,79.510190000000009,4.0231294365237246E-3,5.3105308562113168E-4,79.510190000000009,3.9717462743767782E-3,4.9646828429709727E-4,null,9.0899999999999995E-2,0.13200000000000001,0.125]
[179,"International Paper Company","IP",5.2199999999999996E-2,"NMF","NMF",6.5000000000000002E-2,15.437040000000001,7.3675351843231318E-4,3.8458533662166748E-5,"--","--","--","--","--","--",15.437040000000001,7.7112136327941484E-4,5.0122888613161968E-5,null,"n/a","n/a",6.5000000000000002E-2]
[180,"Interpublic Group of Companies, Inc. The","IPG",6.3E-2,1.0999999999999999E-2,1.11E-2,0.1,6.3115200000000007,3.0122578983120556E-4,1.8977224759365949E-5,6.3115200000000007,3.4856013585998801E-4,3.8341614944598677E-6,6.3115200000000007,3.1935607123072176E-4,3.5448523906610118E-6,6.3115200000000007,3.1527727509712307E-4,3.1527727509712308E-5,null,1.0999999999999999E-2,1.11E-2,0.1]
[181,"Iron Mountain Incorporated","IRM",9.5199999999999993E-2,0.08,5.8499999999999996E-2,8.5000000000000006E-2,7.50901,3.5837761238187004E-4,3.4117548698754027E-5,7.50901,4.1469274370896521E-4,3.3175419496717216E-5,7.50901,3.7994776732581085E-4,2.2226944388559935E-5,7.50901,3.750950977699584E-4,3.1883083310446466E-5,null,0.08,5.8499999999999996E-2,8.5000000000000006E-2]
[182,"Illinois Tool Works Inc.","ITW",2.3900000000000001E-2,4.1000000000000003E-3,5.5500000000000001E-2,8.5000000000000006E-2,60.343609999999998,2.8799800338929816E-3,6.8831522810042266E-5,60.343609999999998,3.3325374711451641E-3,1.3663403631695175E-5,60.343609999999998,3.0533212623074777E-3,1.69459330058065E-4,60.343609999999998,3.0143244306163179E-3,2.5621757660238703E-4,null,4.1000000000000003E-3,5.5500000000000001E-2,8.5000000000000006E-2]
[183,"Invesco Ltd.","IVZ",5.9500000000000004E-2,"NMF",5.9699999999999996E-2,4.4999999999999998E-2,4.7845000000000004,2.2834670435131361E-4,1.3586628908903161E-5,"--","--","--",4.7845000000000004,2.4209051429820204E-4,1.4452803703602661E-5,4.7845000000000004,2.3899854911371354E-4,1.0754934710117109E-5,null,-0.1101,5.9699999999999996E-2,4.4999999999999998E-2]
[184,"Jacobs Engineering Group Inc.","J",8.5000000000000006E-3,0.1046,7.7699999999999991E-2,0.14000000000000001,11.621169999999999,5.5463598499453542E-4,4.7144058724535517E-6,11.621169999999999,6.4179097809275993E-4,6.7131336308502685E-5,11.621169999999999,5.880186063427393E-4,4.5689045712830842E-5,11.621169999999999,5.8050846880631493E-4,8.1271185632884093E-5,null,0.1046,7.7699999999999991E-2,0.14000000000000001]
[185,"J.B. Hunt Transport Services, Inc.","JBHT",8.3999999999999995E-3,0.1009,0.15,6.5000000000000002E-2,13.676870000000001,6.5274703528923623E-4,5.4830750964295841E-6,13.676870000000001,7.5531910939668947E-4,7.621169813812597E-5,13.676870000000001,6.9203479826306839E-4,1.0380521973946026E-4,13.676870000000001,6.831961723099331E-4,4.440775120014565E-5,null,0.1009,0.15,6.5000000000000002E-2]
[186,"Johnson Controls International plc","JCI",2.58E-2,0.12939999999999999,0.08,0.08,30.02234,1.4328565985817986E-3,3.6967700243410403E-5,30.02234,1.6580143783485992E-3,2.1454706055830871E-4,30.02234,1.5190978641520499E-3,1.21527829132164E-4,30.02234,1.4996960395022689E-3,1.1997568316018152E-4,null,0.12939999999999999,0.08,0.08]
[187,"Jack Henry  Associates, Inc.","JKHY",1.0800000000000001E-2,7.0000000000000007E-2,9.1499999999999998E-2,0.1,12.211919999999999,5.8283032413039885E-4,6.2945675006083078E-6,12.211919999999999,6.7441574997960927E-4,4.7209102498572653E-5,12.211919999999999,6.1790991605570052E-4,5.6538757319096594E-5,12.211919999999999,6.1001800854692026E-4,6.1001800854692032E-5,null,7.0000000000000007E-2,9.1499999999999998E-2,0.1]
[188,"Johnson  Johnson","JNJ",2.7999999999999997E-2,5.0900000000000001E-2,5.7500000000000002E-2,0.1,380.22050000000002,1.8146535291422017E-2,5.0810298815981642E-4,380.22050000000002,2.0998065305465649E-2,1.0688015240482016E-3,380.22050000000002,1.9238745196304634E-2,1.1062278487875164E-3,380.22050000000002,1.8993029123898154E-2,1.8993029123898155E-3,null,5.0900000000000001E-2,5.7500000000000002E-2,0.1]
[189,"Juniper Networks, Inc.","JNPR",3.8399999999999997E-2,1.7999999999999999E-2,8.0100000000000005E-2,5.5E-2,7.0917500000000002,3.3846331708296129E-4,1.2996991375985713E-5,7.0917500000000002,3.916491341998551E-4,7.0496844155973915E-6,7.0917500000000002,3.5883486357493453E-4,2.8742672572352257E-5,7.0917500000000002,3.5425184672947596E-4,1.9483851570121178E-5,null,1.7999999999999999E-2,8.0100000000000005E-2,5.5E-2]
[190,"JPMorgan Chase  Co.","JPM",3.8800000000000001E-2,"NMF",0.05,0.03,282.63479999999998,1.3489126369525059E-2,5.2337810313757228E-4,"--","--","--",282.63479999999998,1.4301014545003547E-2,7.1505072725017735E-4,282.63479999999998,1.41183628653035E-2,4.2355088595910498E-4,null,-1.37E-2,0.05,0.03]
[191,"Kellogg Company","K",3.7599999999999995E-2,1.7500000000000002E-2,0.06,0.03,20.967590000000001,1.0007064635154269E-3,3.7626563028180043E-5,20.967590000000001,1.1579565649885487E-3,2.0264239887299604E-5,20.967590000000001,1.0609373281834755E-3,6.3656239691008525E-5,20.967590000000001,1.0473871017684625E-3,3.1421613053053874E-5,null,1.7500000000000002E-2,0.06,0.03]
[192,"KeyCorp","KEY",6.4100000000000004E-2,"NMF",5.7000000000000002E-2,0.03,11.26243,5.3751463548696102E-4,3.4454688134714201E-5,"--","--","--",11.26243,5.698667511646984E-4,3.2482404816387807E-5,11.26243,5.6258844800810125E-4,1.6877653440243037E-5,null,-0.126,5.7000000000000002E-2,0.03]
[193,"The Kraft Heinz Company","KHC",5.5599999999999997E-2,"NMF",0.05,"NMF",35.18571,{"$f":"H197/H$384","v":1.679285383793721E-3},{"$f":"D197*I197","v":9.3368267338930877E-5},{"$f":"IF(E197=\"n/a\",\"--\",IF(E197=\"NMF\",\"--\",$H197))","v":"--"},{"$f":"IF(K197=\"--\",\"--\",K197/K$384)","v":"--"},{"$f":"IF(L197=\"--\",\"--\",E197*L197)","v":"--"},35.18571,{"$f":"IF(N197=\"--\",\"--\",N197/N$384)","v":1.7803587898103021E-3},{"$f":"IF(O197=\"--\",\"--\",F197*O197)","v":8.9017939490515106E-5},"--",{"$f":"IF(Q197=\"--\",\"--\",Q197/Q$384)","v":"--"},"--",null,-3.56E-2,0.05,-5.0000000000000001E-3]
[194,"Kimco Realty Corporation","KIM",3.7100000000000001E-2,{"$f":"IF(AND(U198>=$D$399,U198<=$D$400),U198,\"NMF\")","v":4.5999999999999999E-2},{"$f":"IF(AND(V198>=$D$399,V198<=$D$400),V198,\"NMF\")","v":1.2E-2},{"$f":"IF(AND(W198>=$D$399,W198<=$D$400),W198,\"NMF\")","v":0.05},4.6592799999999999,2.2237041125509213E-4,8.2499422575639188E-6,4.6592799999999999,2.5731349497581002E-4,1.183642076888726E-5,{"$f":"IF(F198=\"n/a\",\"--\",IF(F198=\"NMF\",\"--\",$H198))","v":4.6592799999999999},2.3575451801846102E-4,2.8290542162215322E-6,{"$f":"IF(G198=\"n/a\",\"--\",IF(G198=\"NMF\",\"--\",$H198))","v":4.6592799999999999},2.3274347578943318E-4,{"$f":"IF(R198=\"--\",\"--\",G198*R198)","v":1.163717378947166E-5},null,4.5999999999999999E-2,1.2E-2,0.05]
[195,"KLA Corporation","KLAC",1.9900000000000001E-2,9.2799999999999994E-2,7.5499999999999998E-2,0.16500000000000001,28.031310000000001,1.3378320111087931E-3,2.6622857021064986E-5,28.031310000000001,1.5480577138206706E-3,1.4365975584255822E-4,28.031310000000001,1.4183539041388513E-3,1.0708571976248327E-4,28.031310000000001,1.4002387751607752E-3,2.3103939790152794E-4,null,9.2799999999999994E-2,7.5499999999999998E-2,0.16500000000000001]
[196,"KimberlyClark Corporation","KMB",2.9600000000000001E-2,6.3600000000000004E-2,5.4900000000000004E-2,6.5000000000000002E-2,49.386949999999999,2.3570586833447814E-3,6.9768937027005535E-5,49.386949999999999,2.7274447362458537E-3,1.734654852252363E-4,49.386949999999999,2.4989261417325925E-3,1.3719104518111934E-4,49.386949999999999,2.4670100104820804E-3,1.6035565068133522E-4,null,6.3600000000000004E-2,5.4900000000000004E-2,6.5000000000000002E-2]
[197,"Kinder Morgan, Inc.","KMI",8.5900000000000004E-2,"NMF",0.03,0.185,27.65747,1.3199899937705768E-3,1.1338714046489256E-4,"--","--","--",27.65747,1.3994380053270129E-3,4.1983140159810388E-5,27.65747,1.3815644690471434E-3,2.5558942677372153E-4,null,-6.0000000000000001E-3,0.03,0.185]
[198,"CocaCola Company The","KO",3.49E-2,2.93E-2,4.8099999999999997E-2,6.5000000000000002E-2,207.06200000000001,9.8823127382990268E-3,3.4489271456663602E-4,207.06200000000001,1.1435210353677217E-2,3.3505166336274245E-4,207.06200000000001,1.0477112774922E-2,5.0394912447374821E-4,207.06200000000001,1.034329973384549E-2,6.7231448269995686E-4,null,2.93E-2,4.8099999999999997E-2,6.5000000000000002E-2]
[199,"The Kroger Co.","KR",2.1600000000000001E-2,7.9799999999999996E-2,6.2E-2,7.0000000000000007E-2,25.792000000000002,1.2309579263515688E-3,2.6588691209193886E-5,25.792000000000002,1.4243895328068057E-3,1.1366628471798308E-4,25.792000000000002,1.3050472452250448E-3,8.0912929203952783E-5,25.792000000000002,1.2883792619376945E-3,9.0186548335638621E-5,null,7.9799999999999996E-2,6.2E-2,7.0000000000000007E-2]
[200,"Kansas City Southern","KSU",8.8999999999999999E-3,9.4100000000000003E-2,0.15,0.115,17.037520000000001,8.1313858131875695E-4,7.2369333737369364E-6,17.037520000000001,9.4091443676281813E-4,8.854004849938119E-5,17.037520000000001,8.6208004580748312E-4,1.2931200687112246E-4,17.037520000000001,8.5106961239332765E-4,9.7873005425232681E-5,null,9.4100000000000003E-2,0.15,0.115]
[201,"Loews Corporation","L",7.4999999999999997E-3,0.14030000000000001,"NMF",0.125,9.4060900000000007,4.4891830961058573E-4,3.3668873220793927E-6,9.4060900000000007,5.1946092356694971E-4,7.2880367576443045E-5,"--","--","--",9.4060900000000007,4.6985930877479565E-4,5.8732413596849456E-5,null,0.14030000000000001,"n/a",0.125]
[202,"Leidos Holdings, Inc.","LDOS",1.5100000000000001E-2,0.1143,0.10710000000000001,0.105,12.78,6.0994270699337187E-4,9.2101348755999159E-6,12.78,7.0578854797111407E-4,8.0671631033098334E-5,12.78,6.4665414833964296E-4,6.9256659287175772E-5,12.78,6.3839512126100085E-4,6.7031487732405084E-5,null,0.1143,0.10710000000000001,0.105]
[203,"Leggett  Platt, Incorporated","LEG",3.8599999999999995E-2,5.1999999999999998E-2,0.1,0.08,5.4890100000000004,2.6197039265365323E-4,1.0112057156431014E-5,5.4890100000000004,3.0313618135359351E-4,1.5763081430386862E-5,5.4890100000000004,2.7773795671187667E-4,2.7773795671187669E-5,5.4890100000000004,2.7419070458159988E-4,2.1935256366527991E-5,null,5.1999999999999998E-2,0.1,0.08]
[204,"Lennar Corporation","LEN",6.6E-3,0.114,0.114,7.4999999999999997E-2,23.817820000000001,1.1367375278154047E-3,7.5024676835816714E-6,23.817820000000001,1.3153634267321879E-3,1.4995143064746943E-4,23.817820000000001,1.2051558769488979E-3,1.3738776997217436E-4,23.817820000000001,1.1897637000839352E-3,8.923227750629514E-5,null,0.114,0.114,7.4999999999999997E-2]
[205,"L3Harris Technologies Inc","LHX",1.9099999999999999E-2,0.13400000000000001,0.14369999999999999,"NMF",38.635680000000001,1.8439398470836994E-3,3.5219251079298658E-5,38.635680000000001,2.1336948737931622E-3,2.8591511308828372E-4,38.635680000000001,1.9549235325448341E-3,2.8092251162669264E-4,"--","--","--",null,0.13400000000000001,0.14369999999999999,"n/a"]
[206,"Linde plc","LIN",1.7899999999999999E-2,0.10829999999999999,0.11,"NMF",122.4877,5.8458903999524282E-3,1.0464143815914847E-4,122.4877,6.7645082885228035E-3,7.3259624764701961E-4,122.4877,6.1977448611566267E-3,6.8175193472722897E-4,"--","--","--",null,0.10829999999999999,0.11,"n/a"]
[207,"Eli Lilly and Company","LLY",1.9799999999999998E-2,0.13139999999999999,0.15689999999999998,0.1,143.28820000000002,6.8386222682478622E-3,1.3540472091130767E-4,143.28820000000002,7.9132371376678095E-3,1.0397993598895501E-3,143.28820000000002,7.2502276164413491E-3,1.1375607130196476E-3,143.28820000000002,7.1576281544812638E-3,7.1576281544812644E-4,null,0.13139999999999999,0.15689999999999998,0.1]
[208,"Lockheed Martin Corporation","LMT",2.6600000000000002E-2,9.11E-2,6.93E-2,8.5000000000000006E-2,107.1317,5.1130046246323797E-3,1.360059230152213E-4,107.1317,5.9164575105381065E-3,5.3898927921002156E-4,107.1317,5.4207479048261446E-3,3.7565782980445182E-4,107.1317,5.3515144454144882E-3,4.5487872786023154E-4,null,9.11E-2,6.93E-2,8.5000000000000006E-2]
[209,"Lincoln National Corporation","LNC",5.5500000000000001E-2,9.8799999999999999E-2,"NMF",9.5000000000000001E-2,5.8824399999999999,2.8074736911784743E-4,1.5581478986040534E-5,5.8824399999999999,3.2486375478303604E-4,3.2096538972563959E-5,"--","--","--",5.8824399999999999,2.9384358349847904E-4,2.7915140432355509E-5,null,9.8799999999999999E-2,"n/a",9.5000000000000001E-2]
[210,"Alliant Energy Corporation","LNT",3.0499999999999999E-2,5.2999999999999999E-2,5.5399999999999998E-2,5.5E-2,12.43976,5.9370429489419936E-4,1.810798099427308E-5,12.43976,6.869984465969598E-4,3.6410917669638871E-5,12.43976,6.2943837311029403E-4,3.4870885870310291E-5,12.43976,6.213992248558488E-4,3.4176957367071686E-5,null,5.2999999999999999E-2,5.5399999999999998E-2,5.5E-2]
[211,"Lowes Companies, Inc.","LOW",1.5100000000000001E-2,"NMF",0.1661,0.12,119.90910000000001,5.7228232431251122E-3,8.64146309711892E-5,"--","--","--",119.90910000000001,6.0672704959838101E-3,1.0077736293829108E-3,119.90910000000001,5.9897796897337629E-3,7.1877356276805148E-4,null,0.218,0.1661,0.12]
[212,"Lam Research Corporation","LRCX",1.6399999999999998E-2,0.16170000000000001,0.1326,0.11,46.072839999999999,2.1988883214767215E-3,3.6061768472218225E-5,46.072839999999999,2.5444196278955763E-3,4.1143265383071471E-4,46.072839999999999,2.3312357677455898E-3,3.091218628030652E-4,46.072839999999999,2.3014613676556094E-3,2.5316075044211703E-4,null,0.16170000000000001,0.1326,0.11]
[213,"CenturyLink, Inc.","LUMN",9.9499999999999991E-2,1.4999999999999999E-2,1.4999999999999999E-2,2.5000000000000001E-2,11.026,5.2623069540758355E-4,5.2359954193054558E-5,11.026,6.0892210719323196E-4,9.1338316078984789E-6,11.026,5.5790364942041502E-4,8.3685547413062243E-6,11.026,5.5077813826477271E-4,1.3769453456619318E-5,null,1.4999999999999999E-2,1.4999999999999999E-2,2.5000000000000001E-2]
[214,"Lamb Weston Holdings Inc.","LW",1.4499999999999999E-2,7.0000000000000007E-2,3.6000000000000004E-2,0.05,9.2778600000000004,4.4279836021169993E-4,6.4205762230696488E-6,9.2778600000000004,5.1237929089822227E-4,3.5866550362875565E-5,9.2778600000000004,4.6944966014979972E-4,1.690018776539279E-5,9.2778600000000004,4.6345387791413067E-4,2.3172693895706534E-5,null,7.0000000000000007E-2,3.6000000000000004E-2,0.05]
[215,"LyondellBasell Industries N.V.","LYB",0.06,"NMF",6.7500000000000004E-2,"NMF",23.364759999999997,1.1151146293153719E-3,6.6906877758922308E-5,"--","--","--",23.364759999999997,1.1822315320000121E-3,7.9800628410000822E-5,"--","--","--",null,-4.6399999999999997E-2,6.7500000000000004E-2,-1.4999999999999999E-2]
[216,"Mastercard Incorporated","MA",4.8999999999999998E-3,0.1125,0.18100000000000002,0.13,325.82820000000004,1.5550589540123458E-2,7.6197888746604945E-5,325.82820000000004,1.799419500516759E-2,2.0243469380813537E-3,325.82820000000004,1.6486553769643107E-2,2.9840662323054028E-3,325.82820000000004,1.6275988517156E-2,2.1158785072302802E-3,null,0.1125,0.18100000000000002,0.13]
[217,"MidAmerica Apartment Communities, Inc.","MAA",3.5299999999999998E-2,7.0000000000000007E-2,"NMF",0.01,12.957780000000001,6.1842749685638303E-4,2.1830490639030319E-5,12.957780000000001,7.1560662997880624E-4,5.009246409851644E-5,"--","--","--",12.957780000000001,6.4727570691497436E-4,6.4727570691497437E-6,null,7.0000000000000007E-2,"n/a",0.01]
[218,"Masco Corporation","MAS",1.0500000000000001E-2,0.1434,0.1492,7.4999999999999997E-2,14.134510000000001,6.7458852045578128E-4,7.0831794647857038E-6,14.134510000000001,7.805927456324877E-4,1.1193699972369874E-4,14.134510000000001,7.1519088624790047E-4,1.0670648022818674E-4,14.134510000000001,7.0605651216078475E-4,5.2954238412058855E-5,null,0.1434,0.1492,7.4999999999999997E-2]
[219,"McDonalds Corporation","MCD",2.3300000000000001E-2,3.8800000000000001E-2,6.9099999999999995E-2,0.08,159.95920000000001,7.634268189084051E-3,1.778784488056584E-4,159.95920000000001,8.8339101332254328E-3,3.4275571316914682E-4,159.95920000000001,8.0937621475031789E-3,5.592789643924696E-4,159.95920000000001,7.9903891143045924E-3,6.3923112914436738E-4,null,3.8800000000000001E-2,6.9099999999999995E-2,0.08]
[220,"Microchip Technology Incorporated","MCHP",1.52E-2,7.0000000000000007E-2,0.1079,0.09,24.65174,1.1765374826053822E-3,1.788336973560181E-5,24.65174,1.3614175101378273E-3,9.5299225709647922E-5,24.65174,1.2473513251009634E-3,1.3458920797839393E-4,24.65174,1.2314202305629628E-3,1.1082782075066665E-4,null,7.0000000000000007E-2,0.1079,0.09]
[221,"McKesson Corporation","MCK",1.1399999999999999E-2,8.0600000000000005E-2,6.2699999999999992E-2,0.09,23.828580000000002,1.1372510633026699E-3,1.2964662121650436E-5,23.828580000000002,1.3159576587178038E-3,1.0606618729265499E-4,23.828580000000002,1.2057003212866237E-3,7.5597410144671292E-5,23.828580000000002,1.1903011908120079E-3,1.0712710717308071E-4,null,8.0600000000000005E-2,6.2699999999999992E-2,0.09]
[222,"Moodys Corporation","MCO",8.199999999999999E-3,8.6199999999999999E-2,0.1,8.5000000000000006E-2,51.364879999999999,2.4514580556799456E-3,2.0101956056575551E-5,51.364879999999999,2.8366779398991014E-3,2.4452163841930254E-4,51.364879999999999,2.5990072559442848E-3,2.5990072559442848E-4,51.364879999999999,2.5658128948479468E-3,2.1809409606207551E-4,null,8.6199999999999999E-2,0.1,8.5000000000000006E-2]
[223,"Mondelez International, Inc.","MDLZ",2.3E-2,6.3500000000000001E-2,6.6600000000000006E-2,0.08,78.285979999999995,3.7363037997518752E-3,8.5934987394293126E-5,78.285979999999995,4.3234231729808821E-3,2.7453737148428603E-4,78.285979999999995,3.9611857373892268E-3,2.6381497011012252E-4,78.285979999999995,3.9105937163643415E-3,3.1284749730914731E-4,null,6.3500000000000001E-2,6.6600000000000006E-2,0.08]
[224,"Medtronic PLC","MDT",2.2499999999999999E-2,9.4100000000000003E-2,7.7699999999999991E-2,6.5000000000000002E-2,138.33500000000001,6.6022241292588496E-3,1.4855004290832412E-4,138.33500000000001,7.6396916106090821E-3,7.1889498055831464E-4,138.33500000000001,6.9996010649893987E-3,5.4386900274967624E-4,138.33500000000001,6.9102025899562252E-3,4.4916316834715467E-4,null,9.4100000000000003E-2,7.7699999999999991E-2,6.5000000000000002E-2]
[225,"MetLife, Inc.","MET",5.0999999999999997E-2,2.8899999999999999E-2,4.1399999999999999E-2,6.5000000000000002E-2,32.756039999999999,1.5633261117357722E-3,7.9729631698524376E-5,32.756039999999999,1.8089857518688364E-3,5.2279688229009371E-5,32.756039999999999,1.6574201212190358E-3,6.8617193018468081E-5,32.756039999999999,1.6362516531948509E-3,1.0635635745766531E-4,null,2.8899999999999999E-2,4.1399999999999999E-2,6.5000000000000002E-2]
[226,"MGM Resorts International","MGM",5.0000000000000001E-4,"NMF",0.04,"NMF",10.54635,5.0333875335677213E-4,2.5166937667838608E-7,"--","--","--",10.54635,5.3363387929122018E-4,2.1345355171648809E-5,"--","--","--",null,-0.1157,0.04,0.3]
[227,"McCormick  Company, Incorporated","MKC",1.3500000000000002E-2,4.8000000000000001E-2,5.5399999999999998E-2,6.5000000000000002E-2,24.71153,1.1793910408566446E-3,1.5921779051564703E-5,24.71153,1.3647194739315042E-3,6.5506534748712209E-5,24.71153,1.2503766342973034E-3,6.9270865540070598E-5,24.71153,1.2344069006959984E-3,8.02364485452399E-5,null,4.8000000000000001E-2,5.5399999999999998E-2,6.5000000000000002E-2]
[228,"MarketAxess Holdings Inc.","MKTX",5.3E-3,0.17530000000000001,"NMF",0.155,17.05161,8.1381104553953439E-4,4.3131985413595326E-6,17.05161,9.4169257139825732E-4,1.6507870776611452E-4,"--","--","--",17.05161,8.5177344551215137E-4,1.3202488405438347E-4,null,0.17530000000000001,"n/a",0.155]
[229,"Martin Marietta Materials, Inc.","MLM",1.0500000000000001E-2,4.9700000000000001E-2,2.8300000000000002E-2,8.5000000000000006E-2,13.706,6.5413730375987126E-4,6.8684416894786491E-6,13.706,7.5692784338748746E-4,3.7619313816358126E-5,13.706,6.9350874469038706E-4,1.9626297474737956E-5,13.706,6.8465129358398101E-4,5.819535995463839E-5,null,4.9700000000000001E-2,2.8300000000000002E-2,8.5000000000000006E-2]
[230,"Marsh  McLennan Companies, Inc.","MMC",1.6200000000000003E-2,4.87E-2,3.0499999999999999E-2,0.09,58.00065,2.768159113331386E-3,4.4844177635968461E-5,58.00065,3.2031451130579655E-3,1.5599316700592292E-4,58.00065,2.9347700257351889E-3,8.9510485784923262E-5,58.00065,2.8972873231585972E-3,2.6075585908427376E-4,null,4.87E-2,3.0499999999999999E-2,0.09]
[231,"3M Company","MMM",3.6900000000000002E-2,2.6800000000000001E-2,9.5000000000000001E-2,4.4999999999999998E-2,91.880800000000008,4.3851348883189832E-3,1.6181147737897049E-4,91.880800000000008,5.0742109873571474E-3,1.3598885446117155E-4,91.880800000000008,4.6490688945825566E-3,4.4166154498534286E-4,91.880800000000008,4.5896912721093723E-3,2.0653610724492174E-4,null,2.6800000000000001E-2,9.5000000000000001E-2,4.4999999999999998E-2]
[232,"Altria Group, Inc.","MO",9.0700000000000003E-2,6.0999999999999999E-2,0.04,0.06,70.48866000000001,3.3641662044393912E-3,3.0512987474265278E-4,70.48866000000001,3.8928082151666321E-3,2.3746130112516455E-4,70.48866000000001,3.5666497965495042E-3,1.4266599186198018E-4,70.48866000000001,3.5210967643368911E-3,2.1126580586021347E-4,null,6.0999999999999999E-2,0.04,0.06]
[233,"The Mosaic Company","MOS",1.3100000000000001E-2,7.0000000000000007E-2,7.0000000000000007E-2,0.185,6.92218,3.3037036052389505E-4,4.3278517228630255E-6,6.92218,3.8228445782431035E-4,2.6759912047701728E-5,6.92218,3.5025480536414005E-4,2.4517836375489807E-5,6.92218,3.4578137249534233E-4,6.3969553911638328E-5,null,7.0000000000000007E-2,7.0000000000000007E-2,0.185]
[234,"Marathon Petroleum Corporation","MPC",8.0799999999999997E-2,"NMF",5.7599999999999998E-2,0.03,18.674499999999998,8.9126565584880454E-4,7.201426499258341E-5,"--","--","--",18.674499999999998,9.4490945955936318E-4,5.442678487061932E-5,18.674499999999998,9.328411339584162E-4,2.7985234018752483E-5,null,-7.3899999999999993E-2,5.7599999999999998E-2,0.03]
[235,"Merck  Co., Inc.","MRK",2.9500000000000002E-2,6.25E-2,6.7400000000000002E-2,0.09,208.98520000000002,9.9741000476957151E-3,2.9423595140702359E-4,208.98520000000002,1.1541421037202886E-2,7.2133881482518039E-4,208.98520000000002,1.057442461045305E-2,7.1271621874453557E-4,208.98520000000002,1.0439368708587991E-2,9.3954318377291923E-4,null,6.25E-2,6.7400000000000002E-2,0.09]
[236,"Morgan Stanley","MS",3.0200000000000001E-2,2.5100000000000001E-2,9.6000000000000002E-2,0.05,73.162789999999987,3.4917926591383091E-3,1.0545213830597693E-4,73.162789999999987,4.0404897746178043E-3,1.014162933429069E-4,73.162789999999987,3.7019578761817011E-3,3.5538795611344333E-4,73.162789999999987,3.6546766974838133E-3,1.8273383487419067E-4,null,2.5100000000000001E-2,9.6000000000000002E-2,0.05]
[237,"MSCI Inc","MSCI",9.0000000000000011E-3,0.13100000000000001,"NMF",0.17,28.891860000000001,1.3789029185034055E-3,1.2410126266530651E-5,28.891860000000001,1.5955824661646881E-3,2.0902130306757415E-4,"--","--","--",28.891860000000001,1.4432255452391128E-3,2.4534834269064918E-4,null,0.13100000000000001,"n/a",0.17]
[238,"Microsoft Corporation","MSFT",1.0200000000000001E-2,0.152,0.1371,0.15,1518.6669999999999,7.248042730841181E-2,7.393003585458005E-4,1518.6669999999999,8.3869935585418456E-2,1.2748230208983606E-2,1518.6669999999999,7.6842904185956226E-2,1.0535162163894598E-2,1518.6669999999999,7.5861471331774677E-2,1.1379220699766201E-2,null,0.152,0.1371,0.15]
[239,"Motorola Solutions, Inc.","MSI",1.7100000000000001E-2,0.1032,0.09,0.08,25.858779999999999,1.2341450917641677E-3,2.1103881069167268E-5,25.858779999999999,1.4280775264870489E-3,1.4737760073346343E-4,25.858779999999999,1.3084262408452421E-3,1.1775836167607179E-4,25.858779999999999,1.2917151012332977E-3,1.0333720809866382E-4,null,0.1032,0.09,0.08]
[240,"MT Bank Corporation","MTB",4.8399999999999999E-2,"NMF",2.81E-2,0.04,11.656790000000001,5.5633599745330737E-4,2.6926662276740077E-5,"--","--","--",11.656790000000001,5.8982093973584254E-4,1.6573968406577177E-5,11.656790000000001,5.8228778290798304E-4,2.3291511316319323E-5,null,-8.8900000000000007E-2,2.81E-2,0.04]
[241,"Maxim Integrated Products, Inc.","MXIM",2.9700000000000001E-2,6.0199999999999997E-2,0.1,4.4999999999999998E-2,17.284569999999999,8.2492937519690335E-4,2.4500402443348031E-5,17.284569999999999,9.5455802524296385E-4,5.7464393119626422E-5,17.284569999999999,8.7458050804123182E-4,8.7458050804123185E-5,17.284569999999999,8.6341041949094339E-4,3.8853468877092448E-5,null,6.0199999999999997E-2,0.1,4.4999999999999998E-2]
[242,"Noble Energy Inc.","NBL",9.3999999999999986E-3,0.05,0.18629999999999999,"NMF",4.1224999999999996,1.9675186303444252E-4,1.8494675125237594E-6,4.1224999999999996,2.2766927144060389E-4,1.1383463572030195E-5,4.1224999999999996,2.0859403180987308E-4,3.8861068126179353E-5,"--","--","--",null,0.05,0.18629999999999999,"n/a"]
[243,"Nasdaq, Inc.","NDAQ",1.6399999999999998E-2,8.8800000000000004E-2,8.5800000000000001E-2,6.5000000000000002E-2,19.66553,9.3856389692170304E-4,1.5392447909515929E-5,19.66553,1.0860489721269471E-3,9.6441148724872905E-5,19.66553,9.9505450342705004E-4,8.537567639404089E-5,19.66553,9.8234572840468306E-4,6.3852472346304402E-5,null,8.8800000000000004E-2,8.5800000000000001E-2,6.5000000000000002E-2]
[244,"NextEra Energy, Inc.","NEE",2.1499999999999998E-2,8.14E-2,7.9399999999999998E-2,0.1,133.82570000000001,6.3870117154368458E-3,1.3732075188189216E-4,133.82570000000001,7.3906609142580541E-3,6.0159979842060564E-4,133.82570000000001,6.7714353724144423E-3,5.3765196856970674E-4,133.82570000000001,6.6849510155976783E-3,6.6849510155976783E-4,null,8.14E-2,7.9399999999999998E-2,0.1]
[245,"Newmont Corporation","NEM",1.66E-2,"NMF","NMF",0.19500000000000001,48.597540000000002,2.3193830282330729E-3,3.8501758268669008E-5,"--","--","--","--","--","--",48.597540000000002,2.4275768733400893E-3,4.7337749030131743E-4,null,0.35570000000000002,"n/a",0.19500000000000001]
[246,"NiSource, Inc","NI",3.8900000000000004E-2,1.8100000000000002E-2,5.4600000000000003E-2,0.125,8.2748399999999993,3.9492788024546424E-4,1.5362694541548561E-5,8.2748399999999993,4.5698648734689303E-4,8.2714554209787652E-6,8.2748399999999993,4.1869793527752827E-4,2.2860907266153045E-5,8.2748399999999993,4.1335035095582001E-4,5.1668793869477501E-5,null,1.8100000000000002E-2,5.4600000000000003E-2,0.125]
[247,"NIKE, Inc.","NKE",7.7000000000000002E-3,"NMF",0.1666,0.16,197.65600000000001,9.4333987240596169E-3,7.2637170175259046E-5,"--","--","--",197.65600000000001,1.0001179369657314E-2,1.6661964829849086E-3,197.65600000000001,9.8734449208109851E-3,1.5797511873297577E-3,null,0.25140000000000001,0.1666,0.16]
[248,"NortonLifeLock Inc.","NLOK",2.46E-2,0.05,0.06,6.5000000000000002E-2,12.015030000000001,5.7343348378768183E-4,1.4106463701176974E-5,12.015030000000001,6.6354229871121878E-4,3.3177114935560937E-5,12.015030000000001,6.0794749545581078E-4,3.6476849727348645E-5,12.015030000000001,6.0018282737124909E-4,3.9011883779131193E-5,null,0.05,0.06,6.5000000000000002E-2]
[249,"Nielsen Holdings Plc","NLSN",1.77E-2,"NMF","NMF","NMF",4.8340200000000006,2.3071011302504694E-4,4.0835690005433314E-6,"--","--","--","--","--","--","--","--","--",null,-2.7799999999999998E-2,"n/a","n/a"]
[250,"Northrop Grumman Corporation","NOC",1.77E-2,8.6199999999999999E-2,"NMF",0.11,54.69023,2.6101648616815428E-3,4.6199918051763309E-5,54.69023,3.0203237887250598E-3,2.6035191058810012E-4,"--","--","--",54.69023,2.7319230056840399E-3,3.0051153062524437E-4,null,8.6199999999999999E-2,"n/a",0.11]
[251,"NRG Energy, Inc.","NRG",4.2099999999999999E-2,"NMF","NMF","NMF",6.9628199999999998,3.3230995924159542E-4,1.3990249284071167E-5,"--","--","--","--","--","--","--","--","--",null,-0.128,0.41659999999999997,-1.4999999999999999E-2]
[252,"Norfolk Southern Corporation","NSC",1.7600000000000001E-2,5.2400000000000002E-2,7.1099999999999997E-2,0.115,54.44791,2.5985998134218685E-3,4.5735356716224886E-5,54.44791,3.0069414193240923E-3,1.5756373037258245E-4,54.44791,2.7550052323883829E-3,1.9588087202281401E-4,54.44791,2.7198184747150283E-3,3.1277912459222825E-4,null,5.2400000000000002E-2,7.1099999999999997E-2,0.115]
[253,"NetApp, Inc.","NTAP",4.8600000000000004E-2,3.9E-2,0.11900000000000001,0.06,9.1441800000000004,4.364183022249336E-4,2.1209929488131777E-5,9.1441800000000004,5.0499667641521926E-4,1.9694870380193552E-5,9.1441800000000004,4.6268559703946768E-4,5.5059586047696655E-5,9.1441800000000004,4.5677620500253669E-4,2.7406572300152199E-5,null,3.9E-2,0.11900000000000001,0.06]
[254,"Northern Trust Corporation","NTRS",3.6900000000000002E-2,"NMF",0.107,4.4999999999999998E-2,15.812989999999999,7.5469623836143336E-4,2.7848291195536893E-5,"--","--","--",15.812989999999999,8.0012015501981933E-4,8.5612856587120672E-5,15.812989999999999,7.8990106952652535E-4,3.5545548128693638E-5,null,-5.57E-2,0.107,4.4999999999999998E-2]
[255,"Nucor Corporation","NUE",3.6000000000000004E-2,"NMF",0.12,0.03,13.48565,6.4362080333060757E-4,2.3170348919901876E-5,"--","--","--",13.48565,6.8235927351772345E-4,8.1883112822126806E-5,13.48565,6.736442227725678E-4,2.0209326683177033E-5,null,-5.8599999999999999E-2,0.12,0.03]
[256,"NVIDIA Corporation","NVDA",1.2999999999999999E-3,0.1744,"NMF",0.115,299.21420000000001,1.4280400557031E-2,1.8564520724140298E-5,299.21420000000001,1.6524409683125081E-2,2.8818570487370142E-3,"--","--","--",299.21420000000001,1.4946548160564427E-2,1.7188530384649092E-3,null,0.1744,0.20069999999999999,0.115]
[257,"Newell Brands Inc.","NWL",5.45E-2,"NMF",1.7299999999999999E-2,4.4999999999999998E-2,7.1647400000000001,{"$f":"H261/H$384","v":3.4194686310670512E-4},{"$f":"D261*I261","v":1.8636104039315428E-5},{"$f":"IF(E261=\"n/a\",\"--\",IF(E261=\"NMF\",\"--\",$H261))","v":"--"},{"$f":"IF(K261=\"--\",\"--\",K261/K$384)","v":"--"},{"$f":"IF(L261=\"--\",\"--\",E261*L261)","v":"--"},7.1647400000000001,{"$f":"IF(N261=\"--\",\"--\",N261/N$384)","v":3.6252807846439544E-4},{"$f":"IF(O261=\"--\",\"--\",F261*O261)","v":6.2717357574340413E-6},7.1647400000000001,{"$f":"IF(Q261=\"--\",\"--\",Q261/Q$384)","v":3.5789789210512857E-4},1.6105405144730785E-5,null,-1.35E-2,1.7299999999999999E-2,4.4999999999999998E-2]
[258,"News Corporation","NWSA",1.3999999999999999E-2,{"$f":"IF(AND(U262>=$D$399,U262<=$D$400),U262,\"NMF\")","v":"NMF"},{"$f":"IF(AND(V262>=$D$399,V262<=$D$400),V262,\"NMF\")","v":"NMF"},{"$f":"IF(AND(W262>=$D$399,W262<=$D$400),W262,\"NMF\")","v":"NMF"},8.3798700000000004,3.9994057840786755E-4,5.5991680977101451E-6,"--","--","--",{"$f":"IF(F262=\"n/a\",\"--\",IF(F262=\"NMF\",\"--\",$H262))","v":"--"},"--","--",{"$f":"IF(G262=\"n/a\",\"--\",IF(G262=\"NMF\",\"--\",$H262))","v":"--"},"--",{"$f":"IF(R262=\"--\",\"--\",G262*R262)","v":"--"},null,0.39019999999999999,"n/a","n/a"]
[259,"Realty Income Corporation","O",4.8799999999999996E-2,5.45E-2,3.3399999999999999E-2,6.5000000000000002E-2,19.693529999999999,9.3990023462090595E-4,4.5867131449500204E-5,19.693529999999999,1.0875953007140511E-3,5.9273943888915785E-5,19.693529999999999,9.9647127307912428E-4,3.3282140520842748E-5,19.693529999999999,9.8374440316174937E-4,6.3943386205513717E-5,null,5.45E-2,3.3399999999999999E-2,6.5000000000000002E-2]
[260,"Old Dominion Freight Line, Inc.","ODFL",3.4000000000000002E-3,0.1007,9.4800000000000009E-2,7.4999999999999997E-2,21.376090000000001,1.0202026760198707E-3,3.4686890984675609E-6,21.376090000000001,1.1805163945539791E-3,1.1887800093158568E-4,21.376090000000001,1.081606985428917E-3,1.0253634221866134E-4,21.376090000000001,1.0677927674206627E-3,8.0084457556549697E-5,null,0.1007,9.4800000000000009E-2,7.4999999999999997E-2]
[261,"ONEOK, Inc.","OKE",0.15570000000000001,"NMF",0.06,0.1,10.900589999999999,5.2024533430554605E-4,8.1002198551373525E-5,"--","--","--",10.900589999999999,5.5155803934660633E-4,3.3093482360796376E-5,10.900589999999999,5.4451357393321231E-4,5.4451357393321234E-5,null,-1.3599999999999999E-2,0.06,0.1]
[262,"Omnicom Group Inc.","OMC",5.33E-2,1.4E-2,7.0000000000000007E-2,5.5E-2,10.48775,5.0054198945772579E-4,2.6678888038096784E-5,10.48775,5.7919670140720286E-4,8.1087538197008398E-6,10.48775,5.3066878280509319E-4,3.7146814796356524E-5,10.48775,5.2389111369366686E-4,2.8814011253151679E-5,null,1.4E-2,7.0000000000000007E-2,5.5E-2]
[263,"Oracle Corporation","ORCL",1.6299999999999999E-2,9.1800000000000007E-2,0.11,0.105,177.7054,8.4812294775696347E-3,1.3824404048438504E-4,177.7054,9.8139621465278565E-3,9.0092172505125726E-4,177.7054,8.9917006332046624E-3,9.8908706965251296E-4,177.7054,8.8768591847992687E-3,9.3207021440392323E-4,null,9.1800000000000007E-2,0.11,0.105]
[264,"Otis Worldwide Corporation","OTIS",1.32E-2,4.7E-2,"NMF","NMF",26.16357,1.2486916048834566E-3,1.6482729184461628E-5,26.16357,1.4449098654178874E-3,6.7910763674640701E-5,"--","--","--","--","--","--",null,4.7E-2,"n/a","n/a"]
[265,"Occidental Petroleum Corporation","OXY",3.8E-3,"NMF",5.45E-2,0.14499999999999999,9.5584799999999994,4.56191327538498E-4,1.7335270446462923E-6,"--","--","--",9.5584799999999994,4.8364872799855325E-4,2.6358855675921151E-5,9.5584799999999994,4.7747159614012921E-4,6.9233381440318736E-5,null,-0.15609999999999999,5.45E-2,0.14499999999999999]
[266,"Paychex, Inc.","PAYX",3.3099999999999997E-2,3.2800000000000003E-2,0.08,7.4999999999999997E-2,27.29392,1.3026390805368179E-3,4.311735356576867E-5,27.29392,1.5073345982190727E-3,4.9440574821585588E-5,27.29392,1.381042769362312E-3,1.1048342154898496E-4,27.29392,1.3634041759067338E-3,1.0225531319300503E-4,null,3.2800000000000003E-2,0.08,7.4999999999999997E-2]
[267,"Peoples United Financial, Inc.","PBCT",7.2800000000000004E-2,0.13730000000000001,"NMF",2.5000000000000001E-2,4.1992899999999995,2.0041676917450675E-4,1.4590340795904091E-5,4.1992899999999995,2.3191007759073702E-4,3.1841253653208195E-5,"--","--","--",4.1992899999999995,2.0976574716432769E-4,5.2441436791081924E-6,null,0.13730000000000001,"n/a",2.5000000000000001E-2]
[268,"PACCAR Inc.","PCAR",2.8199999999999999E-2,"NMF",0.1,3.5000000000000003E-2,28.220740000000003,1.3468728129073654E-3,3.7981813323987702E-5,"--","--","--",28.220740000000003,1.4279388568242957E-3,1.4279388568242958E-4,28.220740000000003,1.4097013094190281E-3,4.9339545829665987E-5,null,-4.3999999999999997E-2,0.1,3.5000000000000003E-2]
[269,"Healthpeak Properties, Inc.","PEAK",5.79E-2,2.5000000000000001E-2,2.81E-2,"NMF",12.923579999999999,6.1679525580949929E-4,3.5712445311370006E-5,12.923579999999999,7.137179000617003E-4,1.7842947501542509E-5,12.923579999999999,6.5391914071981556E-4,1.8375127854226819E-5,"--","--","--",null,2.5000000000000001E-2,2.81E-2,-0.15]
[270,"Public Service Enterprise Group Incorporated","PEG",3.85E-2,1.47E-2,3.4599999999999999E-2,0.05,26.167680000000001,1.2488877601671609E-3,4.8082178766435694E-5,26.167680000000001,1.4451368443640659E-3,2.1243511612151769E-5,26.167680000000001,1.3240562460425907E-3,4.5812346113073634E-5,26.167680000000001,1.3071454809639334E-3,6.535727404819667E-5,null,1.47E-2,3.4599999999999999E-2,0.05]
[271,"PepsiCo, Inc.","PEP",3.1200000000000002E-2,5.5100000000000003E-2,5.6100000000000004E-2,0.06,181.435,8.6592296591034758E-3,2.7016796536402844E-4,181.435,1.0019933114330132E-2,5.520983145995903E-4,181.435,9.1804143508609649E-3,5.1502124508330017E-4,181.435,9.0631626624405083E-3,5.4378975974643052E-4,null,5.5100000000000003E-2,5.6100000000000004E-2,0.06]
[272,"Pfizer Inc.","PFE",4.2199999999999994E-2,5.3699999999999998E-2,4.2900000000000001E-2,8.5000000000000006E-2,199.94399999999999,9.5425966046230621E-3,4.0269757671509315E-4,199.94399999999999,1.104211153642695E-2,5.9296138950612714E-4,199.94399999999999,1.0116949689798245E-2,4.3401714169234468E-4,199.94399999999999,9.9877366295312645E-3,8.4895761351015751E-4,null,5.3699999999999998E-2,4.2900000000000001E-2,8.5000000000000006E-2]
[273,"Principal Financial Group, Inc.","PFG",5.9299999999999999E-2,6.0900000000000003E-2,6.5500000000000003E-2,4.4999999999999998E-2,10.35446,4.9418054474605544E-4,2.9304906303441087E-5,10.35446,5.7183562507237724E-4,3.4824789566907777E-5,10.35446,5.2392445327205785E-4,3.4317051689319793E-5,10.35446,5.1723292232333203E-4,2.327548150454994E-5,null,6.0900000000000003E-2,6.5500000000000003E-2,4.4999999999999998E-2]
[274,"Procter  Gamble Company The","PG",2.3199999999999998E-2,7.1499999999999994E-2,6.5299999999999997E-2,0.08,338.01420000000002,1.6132182797355166E-2,3.7426664089863982E-4,338.01420000000002,1.8667179296683704E-2,1.3347033197128847E-3,338.01420000000002,1.7103152161792312E-2,1.1168358361650379E-3,338.01420000000002,1.6884711752499233E-2,1.3507769401999387E-3,null,7.1499999999999994E-2,6.5299999999999997E-2,0.08]
[275,"The Progressive Corporation","PGR",4.4000000000000003E-3,9.4000000000000004E-3,6.2199999999999998E-2,9.5000000000000001E-2,53.382629999999999,2.5477578911287622E-3,1.1210134720966555E-5,53.382629999999999,2.9481102437072951E-3,2.7712236290848577E-5,53.382629999999999,2.7011032189968916E-3,1.6800862022160667E-4,53.382629999999999,2.6666048945290406E-3,2.5332746498025885E-4,null,9.4000000000000004E-3,6.2199999999999998E-2,9.5000000000000001E-2]
[276,"ParkerHannifin Corporation","PH",1.8000000000000002E-2,7.4899999999999994E-2,0.11779999999999999,0.09,25.062580000000001,1.1961453747604024E-3,2.1530616745687245E-5,25.062580000000001,1.3841065685923227E-3,1.0366958198756497E-4,25.062580000000001,1.2681393838101854E-3,1.4938681941283982E-4,25.062580000000001,1.2519427854627179E-3,1.1267485069164461E-4,null,7.4899999999999994E-2,0.11779999999999999,0.09]
[277,"PulteGroup, Inc.","PHM",1.1399999999999999E-2,0.02,9.3800000000000008E-2,0.09,11.756920000000001,5.6111483651835007E-4,6.3967091363091901E-6,11.756920000000001,6.4928791043916678E-4,1.2985758208783335E-5,11.756920000000001,5.9488740920949268E-4,5.5800438983850418E-5,11.756920000000001,5.8728954374459206E-4,5.2856058937013286E-5,null,0.02,9.3800000000000008E-2,0.09]
[278,"Packaging Corporation of America","PKG",3.1200000000000002E-2,"NMF",0.05,0.04,9.8734199999999994,4.7122226307374783E-4,1.4702134607900934E-5,"--","--","--",9.8734199999999994,4.9958435064942081E-4,2.4979217532471043E-5,9.8734199999999994,4.9320368999693199E-4,1.9728147599877278E-5,null,-0.1043,0.05,0.04]
[279,"PerkinElmer, Inc.","PKI",2.3999999999999998E-3,0.16950000000000001,0.17350000000000002,0.12,13.110290000000001,6.2570624194586337E-4,1.501694980670072E-6,13.110290000000001,7.2402915043663673E-4,1.2272294099900994E-4,13.110290000000001,6.6336646435334416E-4,1.1509408156530522E-4,13.110290000000001,6.5489398860069548E-4,7.8587278632083455E-5,null,0.16950000000000001,0.17350000000000002,0.12]
[280,"Prologis, Inc.","PLD",2.5600000000000001E-2,"NMF",7.6999999999999999E-2,0.06,60.210260000000005,2.8736157256005275E-3,7.3564562575373509E-5,"--","--","--",60.210260000000005,3.0465738968394737E-3,2.3458619005663946E-4,60.210260000000005,3.0076632420857896E-3,1.8045979452514736E-4,null,-6.0499999999999998E-2,7.6999999999999999E-2,0.06]
[281,"Philip Morris International Inc.","PM",6.3600000000000004E-2,5.2600000000000001E-2,7.0800000000000002E-2,4.4999999999999998E-2,117.5749,5.6114204053579813E-3,3.5688633778076766E-4,117.5749,6.4931938927111849E-3,3.4154199875660834E-4,117.5749,5.9491625059169551E-3,4.2120070541892043E-4,117.5749,5.8731801676643229E-3,2.6429310754489451E-4,null,5.2600000000000001E-2,7.0800000000000002E-2,4.4999999999999998E-2]
[282,"The PNC Financial Services Group, Inc","PNC",4.4900000000000002E-2,"NMF",7.0000000000000007E-2,0.03,43.554000000000002,2.0786732911102753E-3,9.333243077085137E-5,"--","--","--",43.554000000000002,2.2037851938016286E-3,1.5426496356611401E-4,43.554000000000002,2.1756385846167163E-3,6.5269157538501492E-5,null,-7.1099999999999997E-2,7.0000000000000007E-2,0.03]
[283,"Pentair plc","PNR",1.6899999999999998E-2,3.9E-2,5.96E-2,0.04,7.4542900000000003,3.5576602670685622E-4,6.0124458513458696E-6,7.4542900000000003,4.1167077584159593E-4,1.6055160257822242E-5,7.4542900000000003,3.7717899463432844E-4,2.2479868080205974E-5,7.4542900000000003,3.7236168767329156E-4,1.4894467506931662E-5,null,3.9E-2,5.96E-2,0.04]
[284,"Pinnacle West Capital Corporation","PNW",4.6100000000000002E-2,3.7499999999999999E-2,4.7E-2,0.04,7.9860800000000003,3.8114642045896925E-4,1.7570849983158483E-5,7.9860800000000003,4.4103942153217175E-4,1.6538978307456441E-5,7.9860800000000003,4.0408699225135026E-4,1.8992088635813462E-5,7.9860800000000003,3.9892601799687436E-4,1.5957040719874975E-5,null,3.7499999999999999E-2,4.7E-2,0.04]
[285,"PPG Industries, Inc.","PPG",1.83E-2,4.6600000000000003E-2,5.6600000000000004E-2,0.03,27.9208,1.3325577725681172E-3,2.4385807237996545E-5,27.9208,1.5419546862434962E-3,7.1855088378946924E-5,27.9208,1.4127622179156106E-3,7.996234153402356E-5,27.9208,1.3947185056106537E-3,4.1841555168319609E-5,null,4.6600000000000003E-2,5.6600000000000004E-2,0.03]
[286,"PPL Corporation","PPL",6.4500000000000002E-2,"NMF","NMF",2.5000000000000001E-2,19.919169999999998,9.5066920742262607E-4,6.1318163878759383E-5,"--","--","--","--","--","--",19.919169999999998,9.9501572359690844E-4,2.4875393089922712E-5,null,-0.16200000000000001,"n/a",2.5000000000000001E-2]
[287,"Perrigo Company plc","PRGO",2.1600000000000001E-2,0.1,"NMF",3.5000000000000003E-2,6.1930100000000001,2.9556974051932877E-4,6.3843063952175016E-6,6.1930100000000001,3.4201530011506961E-4,3.4201530011506959E-5,"--","--","--",6.1930100000000001,3.0935738418783965E-4,1.0827508446574389E-5,null,0.1,"n/a",3.5000000000000003E-2]
[288,"Prudential Financial, Inc.","PRU",7.0999999999999994E-2,3.7699999999999997E-2,0.09,0.05,24.450040000000001,1.1669110785364806E-3,8.2850686576090111E-5,24.450040000000001,1.3502784217085805E-3,5.0905496498413483E-5,24.450040000000001,1.2371455237144137E-3,1.1134309713429722E-4,24.450040000000001,1.2213447770450957E-3,6.1067238852254791E-5,null,3.7699999999999997E-2,0.09,0.05]
[289,"Public Storage","PSA",3.7599999999999995E-2,0.17,3.3599999999999998E-2,0.04,37.135550000000002,1.7723441230585064E-3,6.6640139026999832E-5,37.135550000000002,2.0508486629584278E-3,3.4864427270293278E-4,37.135550000000002,1.8790185804674672E-3,6.3135024303706899E-5,37.135550000000002,1.8550198705276967E-3,7.4200794821107871E-5,null,0.17,3.3599999999999998E-2,0.04]
[290,"Phillips 66","PSX",7.0300000000000001E-2,"NMF",5.2000000000000005E-2,3.5000000000000003E-2,22.986519999999999,1.0970626160529955E-3,7.7123501908525592E-5,"--","--","--",22.986519999999999,1.1630929979571337E-3,6.0480835893770959E-5,22.986519999999999,1.1482380456000329E-3,4.0188331596001155E-5,null,-0.1275,5.2000000000000005E-2,3.5000000000000003E-2]
[291,"Quanta Services, Inc.","PWR",3.9000000000000003E-3,0.1002,"NMF",0.125,7.06325,3.3710311621055821E-4,1.3147021532211772E-6,7.06325,3.9007519260226696E-4,3.9085534298747148E-5,"--","--","--",7.06325,3.5282819563746198E-4,4.4103524454682747E-5,null,0.1002,"n/a",0.125]
[292,"Pioneer Natural Resources Company","PXD",2.53E-2,0.1118,7.2800000000000004E-2,0.12,14.27558,6.8132127614244434E-4,1.7237428286403841E-5,14.27558,7.883834804104442E-4,8.814127310988766E-5,14.27558,7.2232887534854782E-4,5.2585542125374281E-5,14.27558,7.1310333530290445E-4,8.5572400236348526E-5,null,0.1118,7.2800000000000004E-2,0.12]
[293,"QUALCOMM Incorporated","QCOM",2.35E-2,"NMF",0.1978,0.125,124.723,5.9525731020605883E-3,1.3988546789842383E-4,"--","--","--",124.723,6.3108486184166894E-3,1.2482858567228212E-3,124.723,6.2302468473423951E-3,7.7878085591779939E-4,null,0.2681,0.1978,0.125]
[294,"Everest Re Group, Ltd.","RE",3.15E-2,4.7300000000000002E-2,0.10400000000000001,0.105,7.8784799999999997,3.7601106558631772E-4,1.1844348565969008E-5,7.8784799999999997,4.350971016760143E-4,2.0580092909275477E-5,7.8784799999999997,3.9864254887409314E-4,4.1458825082905693E-5,7.8784799999999997,3.9355111071614791E-4,4.1322866625195531E-5,null,4.7300000000000002E-2,0.10400000000000001,0.105]
[295,"Regency Centers Corporation","REG",6.5199999999999994E-2,9.0999999999999998E-2,1.83E-2,0.14499999999999999,6.1196899999999994,2.9207044480127287E-4,1.904299300104299E-5,6.1196899999999994,3.3796612825769535E-4,3.0754917671450274E-5,6.1196899999999994,3.0964968114652813E-4,5.6665891649814649E-6,6.1196899999999994,3.0569485443112158E-4,4.4325753892512626E-5,null,9.0999999999999998E-2,1.83E-2,0.14499999999999999]
[296,"Regions Financial Corporation","RF",5.7699999999999994E-2,"NMF",5.7999999999999996E-2,0.05,10.32085,4.925764622435479E-4,2.842166187145271E-5,"--","--","--",10.32085,5.2222382370040719E-4,3.0288981774623616E-5,10.32085,5.1555401308815338E-4,2.5777700654407669E-5,null,-0.216,5.7999999999999996E-2,0.05]
[297,"Robert Half International Inc.","RHI",2.75E-2,2.7E-2,4.3299999999999998E-2,0.06,5.9128699999999998,2.8219968183880272E-4,7.760491250567074E-6,5.9128699999999998,3.2654428260109244E-4,8.8166956302294954E-6,5.9128699999999998,2.9918481330931337E-4,1.2954702416293268E-5,5.9128699999999998,2.9536364324339077E-4,1.7721818594603447E-5,null,2.7E-2,4.3299999999999998E-2,0.06]
[298,"Raymond James Financial, Inc.","RJF",2.1400000000000002E-2,"NMF","NMF",6.5000000000000002E-2,9.4671299999999992,4.5183152579484823E-4,9.6691946520097529E-6,"--","--","--","--","--","--",9.4671299999999992,4.7290841974520021E-4,3.0739047283438014E-5,null,-4.6800000000000001E-2,"n/a",6.5000000000000002E-2]
[299,"ResMed Inc.","RMD",9.300000000000001E-3,"NMF",0.13849999999999998,0.14499999999999999,24.40448,1.1647366661944917E-3,1.0832050995608775E-5,"--","--","--",24.40448,1.2348402370948239E-3,1.7102537283763308E-4,24.40448,1.2190689334046691E-3,1.7676499534367702E-4,null,0.21099999999999999,0.13849999999999998,0.14499999999999999]
[300,"Rockwell Automation, Inc.","ROK",1.9199999999999998E-2,1.72E-2,5.57E-2,7.0000000000000007E-2,24.682479999999998,1.1780045904937215E-3,2.261768813747945E-5,24.682479999999998,1.3631151580223836E-3,2.3445580717984998E-5,24.682479999999998,1.2489067357832763E-3,6.9564105183128483E-5,24.682479999999998,1.2329557756355421E-3,8.6306904294487961E-5,null,1.72E-2,5.57E-2,7.0000000000000007E-2]
[301,"Rollins, Inc.","ROL",6.0999999999999995E-3,8.2000000000000003E-2,"NMF",0.12,17.1418,8.1811548472136007E-4,4.9905044568002962E-6,17.1418,9.4667340622936176E-4,7.7627219310807667E-5,"--","--","--",17.1418,8.5627867681000195E-4,1.0275344121720024E-4,null,8.2000000000000003E-2,"n/a",0.12]
[302,"Roper Technologies, Inc.","ROP",5.3E-3,0.01,0.105,0.08,40.46557,1.9312738110977916E-3,1.0235751198818296E-5,40.46557,2.2347524173023064E-3,2.2347524173023066E-5,40.46557,2.0475139832103447E-3,2.1498896823708618E-4,40.46557,2.0213632603322002E-3,1.6170906082657601E-4,null,0.01,0.105,0.08]
[303,"Republic Services, Inc.","RSG",1.8500000000000003E-2,7.1099999999999997E-2,7.8799999999999995E-2,0.09,29.318950000000001,1.3992863637874273E-3,2.5886797730067407E-5,29.318950000000001,1.6191689474599135E-3,1.1512291216439984E-4,29.318950000000001,1.4835070925244582E-3,1.1690035889092729E-4,29.318950000000001,1.4645598310246654E-3,1.3181038479221987E-4,null,7.1099999999999997E-2,7.8799999999999995E-2,0.09]
[304,"Raytheon Technologies Corporation","RTX",3.2899999999999999E-2,"NMF",0.12,"NMF",89.10812,4.2528050021823334E-3,1.3991728457179875E-4,"--","--","--",89.10812,4.5087742917642179E-3,5.4105291501170614E-4,"--","--","--",null,-0.13250000000000001,0.12,"n/a"]
[305,"SBA Communications Corporation","SBAC",7.0999999999999995E-3,"NMF","NMF","NMF",34.149540000000002,1.6298327754443219E-3,1.1571812705654684E-5,"--","--","--","--","--","--","--","--","--",null,0.44700000000000001,"n/a",0.32]
[306,"Starbucks Corporation","SBUX",2.1700000000000001E-2,2.7099999999999999E-2,0.14330000000000001,0.13500000000000001,97.007019999999997,4.6297906397621408E-3,1.0046645688283846E-4,97.007019999999997,5.357311720563758E-3,1.4518314762727784E-4,97.007019999999997,4.9084500705060029E-3,7.0338089510351028E-4,97.007019999999997,4.8457596475796815E-3,6.5417755242325702E-4,null,2.7099999999999999E-2,0.14330000000000001,0.13500000000000001]
[307,"The Charles Schwab Corporation","SCHW",2.1299999999999999E-2,"NMF","NMF",6.5000000000000002E-2,44.813510000000001,2.1387851016646743E-3,4.555612266545756E-5,"--","--","--","--","--","--",44.813510000000001,2.2385544718764535E-3,1.4550604067196948E-4,null,-0.05,"n/a",6.5000000000000002E-2]
[308,"Sealed Air Corporation","SEE",1.7299999999999999E-2,6.4500000000000002E-2,6.4699999999999994E-2,"NMF",5.7633100000000006,2.7506172947120268E-4,4.7585679198518067E-6,5.7633100000000006,3.1828467890511751E-4,2.052936178938008E-5,5.7633100000000006,2.9161723941059062E-4,1.8867635389865211E-5,"--","--","--",null,6.4500000000000002E-2,6.4699999999999994E-2,0.26]
[309,"The SherwinWilliams Company","SHW",8.199999999999999E-3,9.35E-2,9.2200000000000004E-2,0.09,61.669980000000002,2.943282827967692E-3,2.4134919189335073E-5,61.669980000000002,3.4057876085764982E-3,3.1844114140190259E-4,61.669980000000002,3.1204341467154003E-3,2.8770402832715991E-4,61.669980000000002,3.0805801533852505E-3,2.7725221380467256E-4,null,9.35E-2,9.2200000000000004E-2,0.09]
[310,"The J. M. Smucker Company","SJM",3.32E-2,6.7999999999999996E-3,2.1600000000000001E-2,0.03,12.354479999999999,5.8963419207319818E-4,1.957585517683018E-5,12.354479999999999,6.8228877152880815E-4,4.6395636463958948E-6,12.354479999999999,6.2512329754140471E-4,1.3502663226894342E-5,12.354479999999999,6.1713926116718386E-4,1.8514177835015515E-5,null,6.7999999999999996E-3,2.1600000000000001E-2,0.03]
[311,"Schlumberger Limited","SLB",3.0099999999999998E-2,"NMF",6.7299999999999999E-2,"NMF",23.056380000000001,1.1003967786125069E-3,3.3121943036236459E-5,"--","--","--",23.056380000000001,1.1666278382390593E-3,7.8514053513488685E-5,"--","--","--",null,-5.6500000000000002E-2,6.7299999999999999E-2,"n/a"]
[312,"SL Green Realty Corporation","SLG",2.69E-2,"NMF",1.34E-2,"NMF",3.5176699999999999,1.6788553694126559E-4,4.5161209437200442E-6,"--","--","--",3.5176699999999999,1.7799028935758308E-4,2.3850698773916135E-6,"--","--","--",null,-0.1084,1.34E-2,-1.4999999999999999E-2]
[313,"SnapOn Incorporated","SNA",3.3599999999999998E-2,0.1,9.9399999999999988E-2,0.05,7.6844700000000001,3.667516771212329E-4,1.2322856351273425E-5,7.6844700000000001,4.2438270134801152E-4,4.2438270134801154E-5,7.6844700000000001,3.8882585315270238E-4,3.864928980337861E-5,7.6844700000000001,3.838597932297749E-4,1.9192989661488748E-5,null,0.1,9.9399999999999988E-2,0.05]
[314,"Southern Company The","SO",4.9500000000000002E-2,4.5499999999999999E-2,0.04,0.03,55.478559999999995,2.6477889723391392E-3,1.310655541307874E-4,55.478559999999995,3.0638601178347674E-3,1.394056353614819E-4,55.478559999999995,2.8071550053137542E-3,1.1228620021255017E-4,55.478559999999995,2.7713021939425437E-3,8.3139065818276303E-5,null,4.5499999999999999E-2,0.04,0.03]
[315,"Simon Property Group, Inc.","SPG",8.2699999999999996E-2,8.5999999999999993E-2,0.05,"NMF",19.298490000000001,9.2104641873900768E-4,7.6170538829715937E-5,19.298490000000001,1.0657788133908502E-3,9.1656977951613114E-5,19.298490000000001,9.7648267724500138E-4,4.8824133862250073E-5,"--","--","--",null,8.5999999999999993E-2,0.05,-0.01]
[316,"SP Global Inc.","SPGI",8.3000000000000001E-3,9.8900000000000002E-2,0.1,9.5000000000000001E-2,82.677460000000011,3.9458930954410195E-3,3.2750912692160459E-5,82.677460000000011,4.5659471395414607E-3,4.5157217210065048E-4,82.677460000000011,4.1833898656639208E-3,4.1833898656639209E-4,82.677460000000011,4.129959867155834E-3,3.9234618737980423E-4,null,9.8900000000000002E-2,0.1,9.5000000000000001E-2]
[317,"Sempra Energy","SRE",3.7900000000000003E-2,6.2700000000000006E-2,7.3599999999999999E-2,0.1,33.548499999999997,1.6011473322040011E-3,6.0683483890531649E-5,33.548499999999997,1.8527501644451424E-3,1.1616743531071044E-4,33.548499999999997,1.6975177383077083E-3,1.2493730553944733E-4,33.548499999999997,1.6758371459800225E-3,1.6758371459800226E-4,null,6.2700000000000006E-2,7.3599999999999999E-2,0.1]
[318,"STERIS plc","STE",9.7000000000000003E-3,0.1,"NMF",0.1,14.091889999999999,6.7255442357220868E-4,6.5237779086504248E-6,14.091889999999999,7.7823901261883112E-4,7.7823901261883121E-5,"--","--","--",14.091889999999999,7.0392752936985017E-4,7.0392752936985017E-5,null,0.1,"n/a",0.1]
[319,"State Street Corporation","STT",3.6000000000000004E-2,1.7399999999999999E-2,9.0800000000000006E-2,3.5000000000000003E-2,20.35716,9.7157286988240924E-4,3.4976623315766737E-5,20.35716,1.1242449450090488E-3,1.9561862043157449E-5,20.35716,1.0300502318007704E-3,9.3528561047509967E-5,20.35716,1.0168944934843189E-3,3.5591307271951168E-5,null,1.7399999999999999E-2,9.0800000000000006E-2,3.5000000000000003E-2]
[320,"Seagate Technology PLC","STX",5.57E-2,7.85E-2,1.21E-2,2.5000000000000001E-2,12.224959999999999,5.8345267568745622E-4,3.2498314035791308E-5,12.224959999999999,6.7513589729303208E-4,5.2998167937503018E-5,12.224959999999999,6.1856972592223803E-4,7.4846936836590803E-6,12.224959999999999,6.1066939136235408E-4,1.5266734784058853E-5,null,7.85E-2,1.21E-2,2.5000000000000001E-2]
[321,"Constellation Brands Inc","STZ",1.66E-2,7.8200000000000006E-2,5.5999999999999994E-2,7.0000000000000007E-2,35.66939,{"$f":"H325/H$384","v":1.702369663020525E-3},{"$f":"D325*I325","v":2.8259336406140715E-5},{"$f":"IF(E325=\"n/a\",\"--\",IF(E325=\"NMF\",\"--\",$H325))","v":35.66939},{"$f":"IF(K325=\"--\",\"--\",K325/K$384)","v":1.9698784800559763E-3},{"$f":"IF(L325=\"--\",\"--\",E325*L325)","v":1.5404449714037736E-4},35.66939,{"$f":"IF(N325=\"--\",\"--\",N325/N$384)","v":1.8048324735715632E-3},{"$f":"IF(O325=\"--\",\"--\",F325*O325)","v":1.0107061852000753E-4},35.66939,{"$f":"IF(Q325=\"--\",\"--\",Q325/Q$384)","v":1.7817812640341104E-3},1.2472468848238774E-4,null,7.8200000000000006E-2,5.5999999999999994E-2,7.0000000000000007E-2]
[322,"Stanley Black  Decker, Inc.","SWK",1.8200000000000001E-2,{"$f":"IF(AND(U326>=$D$399,U326<=$D$400),U326,\"NMF\")","v":3.6600000000000001E-2},{"$f":"IF(AND(V326>=$D$399,V326<=$D$400),V326,\"NMF\")","v":5.8200000000000002E-2},{"$f":"IF(AND(W326>=$D$399,W326<=$D$400),W326,\"NMF\")","v":0.06},25.025209999999998,1.1943618411954303E-3,2.1737385509756834E-5,25.025209999999998,1.3820427721887483E-3,5.0582765462108186E-5,{"$f":"IF(F326=\"n/a\",\"--\",IF(F326=\"NMF\",\"--\",$H326))","v":25.025209999999998},1.2662485023138275E-3,7.3695662834664764E-5,{"$f":"IF(G326=\"n/a\",\"--\",IF(G326=\"NMF\",\"--\",$H326))","v":25.025209999999998},1.2500760541887333E-3,{"$f":"IF(R326=\"--\",\"--\",G326*R326)","v":7.5004563251323988E-5},null,3.6600000000000001E-2,5.8200000000000002E-2,0.06]
[323,"Skyworks Solutions, Inc.","SWKS",1.49E-2,0.1265,0.12659999999999999,9.5000000000000001E-2,22.378029999999999,1.068021611531994E-3,1.5913522011826711E-5,22.378029999999999,1.2358495540026628E-3,1.5633496858133685E-4,22.378029999999999,1.1323040634717513E-3,1.4334969443552371E-4,22.378029999999999,1.1178423454954864E-3,1.061950228220712E-4,null,0.1265,0.12659999999999999,9.5000000000000001E-2]
[324,"Synchrony Financial","SYF",3.5099999999999999E-2,"NMF",5.5E-2,4.4999999999999998E-2,14.651219999999999,6.9924920090418065E-4,2.4543646951736739E-5,"--","--","--",14.651219999999999,7.4133585220944784E-4,4.0773471871519632E-5,14.651219999999999,7.3186755622234746E-4,3.2934040030005637E-5,null,-0.14899999999999999,5.5E-2,4.4999999999999998E-2]
[325,"Stryker Corporation","SYK",1.1399999999999999E-2,7.8600000000000003E-2,9.4E-2,0.105,76.021439999999998,3.6282255792749762E-3,4.1361771603734722E-5,76.021439999999998,4.1983616394579946E-3,3.299912248613984E-4,76.021439999999998,3.8466024678210694E-3,3.6158063197518054E-4,76.021439999999998,3.7974738972798043E-3,3.9873475921437944E-4,null,7.8600000000000003E-2,9.4E-2,0.105]
[326,"Sysco Corporation","SYY",2.9700000000000001E-2,"NMF",0.11,8.5000000000000006E-2,30.759830000000001,1.468054301788414E-3,4.36012127631159E-5,"--","--","--",30.759830000000001,1.5564140588202036E-3,1.7120554647022238E-4,30.759830000000001,1.5365356340232999E-3,1.306055288919805E-4,null,0.2208,0.11,8.5000000000000006E-2]
[327,"ATT Inc.","T",7.5700000000000003E-2,2.8999999999999998E-3,5.5300000000000002E-2,5.5E-2,198.58279999999999,9.4776315019032362E-3,7.1745670469407501E-4,198.58279999999999,1.0966937876685302E-2,3.1804119842387373E-5,198.58279999999999,1.0048074445140975E-2,5.5565851681629592E-4,198.58279999999999,9.9197410552698817E-3,5.4558575803984348E-4,null,2.8999999999999998E-3,5.5300000000000002E-2,5.5E-2]
[328,"TE Connectivity Ltd.","TEL",2.0400000000000001E-2,0.11,0.1041,0.05,31.006049999999998,1.4798054827990482E-3,3.0188031849100586E-5,31.006049999999998,1.712340767435036E-3,1.8835748441785397E-4,31.006049999999998,1.5688725239535514E-3,1.6331962974356468E-4,31.006049999999998,1.5488349804049025E-3,7.7441749020245126E-5,null,0.11,0.1041,0.05]
[329,"Teradyne, Inc.","TER",5.3E-3,0.1666,0.16739999999999999,0.13,12.50343,5.9674303136949419E-4,3.1627380662583192E-6,12.50343,6.9051468735199274E-4,1.1503974691284199E-4,12.50343,6.3266000610127872E-4,1.0590728502135405E-4,12.50343,6.2457971134807788E-4,8.119536247525013E-5,null,0.1666,0.16739999999999999,0.13]
[330,"Truist Financial Corporation","TFC",5.0799999999999998E-2,"NMF",8.2400000000000001E-2,3.5000000000000003E-2,47.745750000000001,2.2787302036329253E-3,1.157594943445526E-4,"--","--","--",47.745750000000001,2.4158832005545783E-3,1.9906877572569725E-4,47.745750000000001,2.3850276886500338E-3,8.3475969102751195E-5,null,-9.0999999999999998E-2,8.2400000000000001E-2,3.5000000000000003E-2]
[331,"Teleflex Incorporated","TFX",4.0999999999999995E-3,0.13,0.13,0.15,15.367239999999999,7.3342221945358558E-4,3.0070310997597005E-6,15.367239999999999,8.4867151846037734E-4,1.1032729739984905E-4,15.367239999999999,7.7756568814795737E-4,1.0108353945923447E-4,15.367239999999999,7.6763466692072785E-4,1.1514520003810917E-4,null,0.13,0.13,0.15]
[332,"Target Corporation","TGT",1.8000000000000002E-2,7.0699999999999999E-2,7.22E-2,9.5000000000000001E-2,75.543210000000002,3.6054014086360532E-3,6.4897225355448968E-5,75.543210000000002,4.1719508994504653E-3,2.949569285911479E-4,75.543210000000002,3.8224045481528015E-3,2.7597760837663228E-4,75.543210000000002,3.7735850319558103E-3,3.5849057803580199E-4,null,7.0699999999999999E-2,7.22E-2,9.5000000000000001E-2]
[333,"Tiffany  Co.","TIF",1.9900000000000001E-2,"NMF",0.08,9.5000000000000001E-2,14.133389999999999,6.7453506694781305E-4,1.3423247832261481E-5,"--","--","--",14.133389999999999,7.1513421546181742E-4,5.7210737236945397E-5,14.133389999999999,7.0600056517050201E-4,6.7070053691197694E-5,null,-8.3000000000000001E-3,0.08,9.5000000000000001E-2]
[334,"Thermo Fisher Scientific Inc.","TMO",2.0999999999999999E-3,0.1336,0.155,0.13500000000000001,166.44800000000001,7.943954905605068E-3,1.6682305301770641E-5,166.44800000000001,9.1922607380826287E-3,1.2280860346078391E-3,166.44800000000001,8.4220883945881776E-3,1.3054237011611675E-3,166.44800000000001,8.3145219987207416E-3,1.1224604698273001E-3,null,0.1336,0.155,0.13500000000000001]
[335,"T. Rowe Price Group, Inc.","TROW",3.0099999999999998E-2,7.9699999999999993E-2,7.8200000000000006E-2,0.08,27.8948,1.3313168875617144E-3,4.0072638315607597E-5,27.8948,1.5405188096983282E-3,1.2277934913295676E-4,27.8948,1.4114466460958272E-3,1.103751277246937E-4,27.8948,1.3934197361933777E-3,1.1147357889547021E-4,null,7.9699999999999993E-2,7.8200000000000006E-2,0.08]
[336,"The Travelers Companies, Inc.","TRV",3.1600000000000003E-2,3.0499999999999999E-2,6.6600000000000006E-2,9.5000000000000001E-2,27.216470000000001,1.2989426750081297E-3,4.1046588530256904E-5,27.216470000000001,1.5030573428951009E-3,4.5843248958300577E-5,27.216470000000001,1.3771238833068422E-3,9.1716450628235696E-5,27.216470000000001,1.3595353416233484E-3,1.2915585745421811E-4,null,3.0499999999999999E-2,6.6600000000000006E-2,9.5000000000000001E-2]
[337,"Tractor Supply Company","TSCO",1.1399999999999999E-2,0.16650000000000001,0.1268,0.1,16.257069999999999,7.75890554270793E-4,8.8451523186870391E-6,16.257069999999999,8.9781328869833793E-4,1.4948591256827326E-4,16.257069999999999,8.2259012170171825E-4,1.0430442743177787E-4,16.257069999999999,8.1208405117359772E-4,8.1208405117359783E-5,null,0.16650000000000001,0.1268,0.1]
[338,"Tyson Foods, Inc.","TSN",3.0499999999999999E-2,8.6699999999999999E-2,"NMF",5.5E-2,20.83785,9.9451444733347685E-4,3.0332690643671044E-5,20.83785,1.1507915410281595E-3,9.9773626607141427E-5,"--","--","--",20.83785,1.0409062423762556E-3,5.7249843330694063E-5,null,8.6699999999999999E-2,"n/a",5.5E-2]
[339,"Texas Instruments Incorporated","TXN",3.0200000000000001E-2,0.1,9.3299999999999994E-2,4.4999999999999998E-2,123.7513,5.9061974112636041E-3,1.7836716182016086E-4,123.7513,6.8342918886179762E-3,6.8342918886179767E-4,123.7513,6.2616816515980956E-3,5.8421489809410223E-4,123.7513,6.1817078380052033E-3,2.7817685271023412E-4,null,0.1,9.3299999999999994E-2,4.4999999999999998E-2]
[340,"Textron Inc.","TXT",2.3E-3,"NMF",5.9800000000000006E-2,8.5000000000000006E-2,7.9327700000000005,3.7860212893237955E-4,8.7078489654447293E-7,"--","--","--",7.9327700000000005,4.0138956403163302E-4,2.4003095929091656E-5,7.9327700000000005,3.962630411647598E-4,3.3682358499004585E-5,null,-4.7800000000000002E-2,5.9800000000000006E-2,8.5000000000000006E-2]
[341,"United Dominion Realty Trust, Inc.","UDR",4.6600000000000003E-2,"NMF",4.0199999999999993E-2,0.06,9.4254699999999989,4.4984324620381971E-4,2.0962695273097999E-5,"--","--","--",9.4254699999999989,4.7691856616203864E-4,1.9172126359713951E-5,9.4254699999999989,4.7082739151736502E-4,2.8249643491041899E-5,null,-0.34210000000000002,4.0199999999999993E-2,0.06]
[342,"UnitedHealth Group Incorporated","UNH",1.7100000000000001E-2,0.12720000000000001,0.12659999999999999,0.12,277.53300000000002,1.3245636095460993E-2,2.26500377232383E-4,277.53300000000002,1.5327043277313554E-2,1.9495999048742842E-3,277.53300000000002,1.4042868994612375E-2,1.7778272147179267E-3,277.53300000000002,1.3863514334032032E-2,1.6636217200838438E-3,null,0.12720000000000001,0.12659999999999999,0.12]
[343,"Unum Group","UNM",6.9900000000000004E-2,0.09,0.09,4.4999999999999998E-2,3.3168099999999998,1.5829922300334003E-4,1.1065115687933469E-5,3.3168099999999998,1.831742186068913E-4,1.6485679674620217E-5,3.3168099999999998,1.6782699106059556E-4,1.51044291954536E-5,3.3168099999999998,1.656835150351878E-4,7.4557581765834513E-6,null,0.09,0.09,4.4999999999999998E-2]
[344,"Union Pacific Corporation","UNP",0.02,6.54E-2,0.1,0.105,131.8871,6.294489420305598E-3,1.2588978840611195E-4,131.8871,7.2835997500094772E-3,4.7634742365061981E-4,131.8871,6.6733443135747524E-3,6.6733443135747524E-4,131.8871,6.5881127697387911E-3,6.9175184082257302E-4,null,6.54E-2,0.1,0.105]
[345,"United Parcel Service, Inc.","UPS",2.5000000000000001E-2,7.3099999999999998E-2,7.9000000000000001E-2,5.5E-2,139.35300000000001,6.6508095498941594E-3,1.6627023874735399E-4,139.35300000000001,7.6959116999545125E-3,5.6257114526667487E-4,139.35300000000001,7.0511107616255302E-3,5.5703775016841689E-4,139.35300000000001,6.9610544079095667E-3,3.8285799243502615E-4,null,7.3099999999999998E-2,7.9000000000000001E-2,5.5E-2]
[346,"U.S. Bancorp","USB",4.87E-2,2.46E-2,0.06,1.4999999999999999E-2,51.968900000000005,2.4802857234325387E-3,1.2078991473116463E-4,51.968900000000005,2.8700355610841968E-3,7.0602874802671247E-5,51.968900000000005,2.6295700132744973E-3,1.5777420079646982E-4,51.968900000000005,2.5959853065180621E-3,3.8939779597770929E-5,null,2.46E-2,0.06,1.4999999999999999E-2]
[347,"Visa Inc.","V",6.3E-3,8.7800000000000003E-2,0.13119999999999998,0.14499999999999999,379.60390000000001,1.8117107226231707E-2,1.1413777552525976E-4,379.60390000000001,2.0964012940936777E-2,1.8406403362142491E-3,379.60390000000001,1.9207545904609314E-2,2.5200300226847416E-3,379.60390000000001,1.8962228307640754E-2,2.7495231046079094E-3,null,8.7800000000000003E-2,0.13119999999999998,0.14499999999999999]
[348,"V.F. Corporation","VFC",2.7799999999999998E-2,0.05,0.10099999999999999,7.0000000000000007E-2,26.912509999999997,1.2844357747563528E-3,3.570731453822661E-5,26.912509999999997,1.4862708415616657E-3,7.4313542078083286E-5,26.912509999999997,1.3617438367552522E-3,1.3753612751228047E-4,26.912509999999997,1.344351728081995E-3,9.4104620965739663E-5,null,0.05,0.10099999999999999,7.0000000000000007E-2]
[349,"ViacomCBS Inc.","VIAC",3.3300000000000003E-2,1.4500000000000001E-2,9.7200000000000009E-2,0.08,17.753119999999999,8.4729155480267365E-4,2.8214808774929035E-5,17.753119999999999,9.8043417736752309E-4,1.4216295571829086E-5,17.753119999999999,8.9828863020121144E-4,8.7313654855557756E-5,17.753119999999999,8.8681574297035202E-4,7.0945259437628166E-5,null,1.4500000000000001E-2,9.7200000000000009E-2,0.08]
[350,"Valero Energy Corporation","VLO",8.8100000000000012E-2,"NMF",0.12359999999999999,0.05,18.149090000000001,8.6618975618672431E-4,7.6311317520050422E-5,"--","--","--",18.149090000000001,9.1832428302734991E-4,1.1350488138218043E-4,18.149090000000001,9.0659550166876518E-4,4.532977508343826E-5,null,-2.8000000000000001E-2,0.12359999999999999,0.05]
[351,"Vulcan Materials Company","VMC",1.0800000000000001E-2,8.6800000000000002E-2,0.1133,0.125,16.743819999999999,7.9912135338104531E-4,8.6305106165152893E-6,16.743819999999999,9.246945544045148E-4,8.0263487322311885E-5,16.743819999999999,8.4721914413554624E-4,9.5989929030557391E-5,16.743819999999999,8.3639851324509944E-4,1.0454981415563743E-4,null,8.6800000000000002E-2,0.1133,0.125]
[352,"Vornado Realty Trust","VNO",6.5799999999999997E-2,0.17330000000000001,3.2000000000000001E-2,"NMF",6.1627099999999997,2.9412363222340549E-4,1.9353335000300082E-5,6.1627099999999997,3.40341951679739E-4,5.898126022609877E-5,6.1627099999999997,3.1182644651910806E-4,9.9784462886114572E-6,"--","--","--",null,0.17330000000000001,3.2000000000000001E-2,-0.2]
[353,"Verisk Analytics, Inc.","VRSK",6.1999999999999998E-3,9.6699999999999994E-2,0.1043,0.105,28.779040000000002,1.3735184321025454E-3,8.5158142790357809E-6,28.779040000000002,1.5893518664790776E-3,1.5369032548852681E-4,28.779040000000002,1.456188231708335E-3,1.5188043256717936E-4,28.779040000000002,1.4375898850215332E-3,1.5094693792726098E-4,null,9.6699999999999994E-2,0.1043,0.105]
[354,"Ventas, Inc.","VTR",4.5499999999999999E-2,"NMF",0.03,1.4999999999999999E-2,14.75586,7.0424328579148793E-4,3.2043069503512698E-5,"--","--","--",14.75586,7.4663052279491432E-4,2.239891568384743E-5,14.75586,7.3709460360018404E-4,1.105641905400276E-5,null,-5.0000000000000001E-3,0.03,1.4999999999999999E-2]
[355,"Verizon Communications Inc.","VZ",4.2599999999999999E-2,1.6400000000000001E-2,3.4099999999999998E-2,0.04,243.77279999999999,1.1634385095724087E-2,4.9562480507784614E-4,243.77279999999999,1.3462601764229483E-2,2.2078666893336353E-4,243.77279999999999,1.233463946575666E-2,4.206112057823021E-4,243.77279999999999,1.2177102207835189E-2,4.8708408831340757E-4,null,1.6400000000000001E-2,3.4099999999999998E-2,0.04]
[356,"Westinghouse Air Brake Technologies Corporation","WAB",8.0000000000000002E-3,7.2999999999999995E-2,2.9300000000000003E-2,0.105,11.482700000000001,5.4802731780851266E-4,4.3842185424681018E-6,11.482700000000001,6.3414383096932025E-4,4.6292499660760375E-5,11.482700000000001,5.8101217442407035E-4,1.7023656710625265E-5,11.482700000000001,5.7359152260592298E-4,6.0227109873621911E-5,null,7.2999999999999995E-2,2.9300000000000003E-2,0.105]
[357,"Walgreens Boots Alliance, Inc.","WBA",5.33E-2,"NMF",0.05,0.06,31.664189999999998,1.5112161004188149E-3,8.0547818152322827E-5,"--","--","--",31.664189999999998,1.6021736946255586E-3,8.010868473127793E-5,31.664189999999998,1.5817108305697472E-3,9.4902649834184829E-5,null,-5.1799999999999999E-2,0.05,0.06]
[358,"WEC Energy Group, Inc.","WEC",2.86E-2,5.9499999999999997E-2,5.9400000000000001E-2,0.06,29.354380000000003,1.4009773082403832E-3,4.0067951015674957E-5,29.354380000000003,1.6211256053828102E-3,9.6456973520277209E-5,29.354380000000003,1.4852998121234939E-3,8.822680884013554E-5,29.354380000000003,1.4663296541190531E-3,8.7979779247143191E-5,null,5.9499999999999997E-2,5.9400000000000001E-2,0.06]
[359,"Welltower Inc.","WELL",4.7E-2,0.13,0.03,3.5000000000000003E-2,21.31711,1.0173877761091923E-3,4.7817225477132042E-5,21.31711,1.1772591638372861E-3,1.5304369129884719E-4,21.31711,1.0786226613546546E-3,3.2358679840639639E-5,21.31711,1.0648465589502421E-3,3.7269629563258478E-5,null,0.13,0.03,3.5000000000000003E-2]
[360,"Wells Fargo  Company","WFC",1.7500000000000002E-2,3.73E-2,9.6999999999999989E-2,"NMF",94.049539999999993,4.4886409248107518E-3,7.855121618418816E-5,94.049539999999993,5.1939818680712992E-3,1.9373552367905945E-4,94.049539999999993,4.7588047879839734E-3,4.6160406443444536E-4,"--","--","--",null,3.73E-2,9.6999999999999989E-2,"n/a"]
[361,"Whirlpool Corporation","WHR",2.7300000000000001E-2,2E-3,0.16649999999999998,0.02,10.89588,5.2002054321400161E-4,1.4196560829742245E-5,10.89588,6.0173609734487496E-4,1.2034721946897499E-6,10.89588,5.5131971845156103E-4,9.1794733122184903E-5,10.89588,5.4427829685800577E-4,1.0885565937160116E-5,null,2E-3,0.16649999999999998,0.02]
[362,"Willis Towers Watson Public Limited Company","WLTW",1.3300000000000001E-2,4.8500000000000001E-2,"NMF",0.115,26.266359999999999,1.2535973960299234E-3,1.6672845367197982E-5,26.266359999999999,1.4505865481131888E-3,7.0353447583489662E-5,"--","--","--",26.266359999999999,1.3120748104291941E-3,1.5088860319935733E-4,null,4.8500000000000001E-2,"n/a",0.115]
[363,"Waste Management, Inc.","WM",1.95E-2,"NMF",6.2899999999999998E-2,5.5E-2,47.168379999999999,2.2511744430118953E-3,4.3897901638731955E-5,"--","--","--",47.168379999999999,2.3866689043396437E-3,1.5012147408296358E-4,47.168379999999999,2.3561865156326266E-3,1.2959025835979445E-4,null,-1.26E-2,6.2899999999999998E-2,5.5E-2]
[364,"Williams Companies, Inc. The","WMB",8.0399999999999985E-2,3.6999999999999998E-2,0.05,0.12,24.150830000000003,1.1526308784301047E-3,9.2671522625780402E-5,24.150830000000003,1.3337542439747435E-3,4.9348907027065512E-5,24.150830000000003,1.222005822014515E-3,6.1100291100725754E-5,24.150830000000003,1.2063984386857449E-3,1.4476781264228939E-4,null,3.6999999999999998E-2,0.05,0.12]
[365,"Walmart Inc.","WMT",1.6E-2,6.4100000000000004E-2,5.6299999999999996E-2,7.0000000000000007E-2,385.3956,1.8393523906677211E-2,2.9429638250683539E-4,385.3956,2.1283865486577173E-2,1.3642957776895969E-3,385.3956,1.9500599647249272E-2,1.097883760140134E-3,385.3956,1.925153918587294E-2,1.347607743011106E-3,null,6.4100000000000004E-2,5.6299999999999996E-2,7.0000000000000007E-2]
[366,"W.R. Berkley Corporation","WRB",8.1000000000000013E-3,6.2100000000000002E-2,0.09,0.1,10.597569999999999,5.0578329681938558E-4,4.0968447042370242E-6,10.597569999999999,5.8526162302990914E-4,3.6344746790157358E-5,10.597569999999999,5.3622555577619328E-4,4.8260300019857396E-5,10.597569999999999,5.2937691590156056E-4,5.2937691590156059E-5,null,6.2100000000000002E-2,0.09,0.1]
[367,"WestRock Company","WRK",2.4399999999999998E-2,"NMF","NMF",0.05,8.5193899999999996,4.0659935825761048E-4,9.9210243414856943E-6,"--","--","--","--","--","--",8.5193899999999996,4.2556627637869781E-4,2.1278313818934891E-5,null,-1.8800000000000001E-2,"n/a",0.05]
[368,"West Pharmaceutical Services, Inc.","WST",2.3999999999999998E-3,0.15,0.17370000000000002,0.16,19.800540000000002,9.450074309491816E-4,2.2680178342780358E-6,19.800540000000002,1.0935050372178376E-3,1.6402575558267563E-4,19.800540000000002,1.0018858630958557E-3,1.7402757441975017E-4,19.800540000000002,9.890898383672379E-4,1.5825437413875807E-4,null,0.15,0.17370000000000002,0.16]
[369,"The Western Union Company","WU",4.2099999999999999E-2,8.6699999999999999E-2,"NMF",0.06,8.79129,4.195761518437997E-4,1.7664155992623965E-5,8.79129,4.8550796587581969E-4,4.2093540641433564E-5,"--","--","--",8.79129,4.3914840732321004E-4,2.6348904439392601E-5,null,8.6699999999999999E-2,0.25769999999999998,0.06]
[370,"Xcel Energy Inc.","XEL",2.6699999999999998E-2,5.8500000000000003E-2,5.8099999999999999E-2,0.06,34.76332,1.6591262523377797E-3,4.4298670937418716E-5,34.76332,1.9198398392374953E-3,1.1231063059539348E-4,34.76332,1.7589863136195992E-3,1.0219710482129871E-4,34.76332,1.7365206484221422E-3,1.0419123890532854E-4,null,5.8500000000000003E-2,5.8099999999999999E-2,0.06]
[371,"Xilinx, Inc.","XLNX",1.5600000000000001E-2,7.4700000000000003E-2,0.09,7.4999999999999997E-2,23.66394,1.1293933976313562E-3,1.7618537003049158E-5,23.66394,1.3068652466256311E-3,9.7622833922934648E-5,23.66394,1.1973697157324267E-3,1.0776327441591839E-4,23.66394,1.1820769832404576E-3,8.8655773743034322E-5,null,7.4700000000000003E-2,0.09,7.4999999999999997E-2]
[372,"Exxon Mobil Corporation","XOM",0.1012,0.12839999999999999,8.7100000000000011E-2,4.4999999999999998E-2,145.40090000000001,6.9394537202873688E-3,7.0227271649308176E-4,145.40090000000001,8.0299131521669141E-3,1.0310408487382316E-3,145.40090000000001,7.3571279465819723E-3,6.4080584414728987E-4,145.40090000000001,7.2631631601689098E-3,3.2684234220760095E-4,null,0.12839999999999999,8.7100000000000011E-2,4.4999999999999998E-2]
[373,"DENTSPLY SIRONA Inc.","XRAY",9.3999999999999986E-3,4.2700000000000002E-2,7.9500000000000001E-2,7.4999999999999997E-2,9.3322299999999991,4.4539324166547375E-4,4.1866964716554524E-6,9.3322299999999991,5.153819296582527E-4,2.200680839640739E-5,9.3322299999999991,4.7220072322063115E-4,3.7539957496040179E-5,9.3322299999999991,4.6616980457633411E-4,3.4962735343225054E-5,null,4.2700000000000002E-2,7.9500000000000001E-2,7.4999999999999997E-2]
[374,"Xerox Corporation","XRX",5.62E-2,"NMF","NMF",5.5E-2,3.7937800000000004,1.8106325844579926E-4,1.0175755124653919E-5,"--","--","--","--","--","--",3.7937800000000004,1.8950943999511424E-4,1.0423019199731284E-5,null,-7.0000000000000007E-2,"n/a",5.5E-2]
[375,"Xylem Inc.","XYL",1.26E-2,"NMF",0.1,8.5000000000000006E-2,14.837399999999999,7.0813489207695269E-4,8.922499640169604E-6,"--","--","--",14.837399999999999,7.5075635841741922E-4,7.5075635841741924E-5,14.837399999999999,7.4116774430344075E-4,6.2999258265792471E-5,null,-1.9199999999999998E-2,0.1,8.5000000000000006E-2]
[376,"Yum Brands, Inc.","YUM",2.0899999999999998E-2,6.6299999999999998E-2,0.12330000000000001,9.5000000000000001E-2,27.05659,1.2913121867456803E-3,2.6988424702984718E-5,27.05659,1.4942278066627361E-3,9.9067303581739397E-5,27.05659,1.3690341285934977E-3,1.6880190805557827E-4,27.05659,1.3515489087604995E-3,1.2839714633224746E-4,null,6.6299999999999998E-2,0.12330000000000001,9.5000000000000001E-2]
[377,"Zimmer Biomet Holdings, Inc.","ZBH",7.1999999999999998E-3,3.6600000000000001E-2,6.8600000000000008E-2,0.06,27.6708,1.3206261859680902E-3,9.5085085389702499E-6,27.6708,1.5281481810014948E-3,5.5930223424654715E-5,27.6708,1.4001124888792327E-3,9.6047716737115375E-5,27.6708,1.3822303381368468E-3,8.2933820288210797E-5,null,3.6600000000000001E-2,6.8600000000000008E-2,0.06]
[378,"Zions Bancorporation, N.A.","ZION",4.8099999999999997E-2,"NMF",4.3700000000000003E-2,3.5000000000000003E-2,4.6323800000000004,2.2108657253692927E-4,1.0634264139026297E-5,"--","--","--",4.6323800000000004,2.3439340717414675E-4,1.0242991893510213E-5,4.6323800000000004,2.3139974896925161E-4,8.0989912139238072E-6,null,-0.32400000000000001,4.3700000000000003E-2,3.5000000000000003E-2]
[379,"Zoetis Inc.","ZTS",5.0000000000000001E-3,8.9700000000000002E-2,9.6600000000000005E-2,0.12,75.68159,3.6120057804508998E-3,1.8060028902254501E-5,75.68159,4.1795930762320178E-3,3.7490949893801198E-4,75.68159,3.8294064261690172E-3,3.6992066076792706E-4,75.68159,3.7804974824159118E-3,4.5365969788990941E-4,null,8.9700000000000002E-2,9.6600000000000005E-2,0.12]
[null,null,null,null,null,null,null,{"$f":"SUM(H5:H383)","v":20952.787619999985},{"$f":"SUM(I5:I383)","v":1.0000000000000007},null,{"$f":"SUM(K5:K383)","v":18107.406299999995},{"$f":"SUM(L5:L383)","v":1.0000000000000002},null,{"$f":"SUM(N5:N383)","v":19763.269179999977},{"$f":"SUM(O5:O383)","v":1.0000000000000007},null,{"$f":"SUM(Q5:Q383)","v":20018.949979999983},{"$f":"SUM(R5:R383)","v":1.0000000000000007}]
[null,"Weighted Average",null,null,null,null,null,null,null,{"$f":"ROUND(SUM(J5:J383),4)","v":2.3300000000000001E-2},null,null,{"$f":"ROUND(SUM(M5:M383),4)","v":8.7499999999999994E-2},null,null,{"$f":"ROUND(SUM(P5:P383),4)","v":9.3299999999999994E-2},null,null,{"$f":"ROUND(SUM(S5:S383),4)","v":9.6500000000000002E-2}]
[null,"   Average",null,null,null,null,null,null,null,null,null,null,null,null,null,{"$f":"ROUND(AVERAGE(M385,P385,S385),4)","v":9.2399999999999996E-2}]
[]
[]
[]
["n/a","Not Available"]
["NMF","Eliminated growth rates that were greater than 20%, as well as all negative values"]
[]
["(a)","dividend paying components of S&P 500 index from zacks.com (retrieved Oct. 1, 2020)."]
["(b)","www.valueline.com (retrieved Oct. 1, 2020)"]
["(c)","http://finance.yahoo.com (retrieved Oct. 2, 2020)"]
["(d)","www.zacks.com (retrieved Oct. 1, 2020)"]
[]
[]
[null,"Low-end Screen",null,0]
[null,"High-end Screen",null,0.2]

{"sheet":"Bond Yields","index":35,"n_rows":82,"n_cols":19,"rows_kept":82,"cut":false,"hidden":false,"merged":[[45,1,46,7],[4,2,4,8],[43,1,44,7],[5,2,5,8]]}
["6-MONTH AVERAGE BOND YIELDS"]
[]
[]
[]
[null,null,"(a)",null,null,null,null,null,null,null,"(b)",null,"(b)",null,"(a)"]
[null,null,"Public Utility Bonds",null,null,null,null,null,null,null,"30-Yr.",null,"10-Yr.",null,"AAA"]
[null,null,"Baa",null,"A",null,"Aa",null,"AVG.",null,"Govt",null,"Govt",null,"Corp.",null,null,null,"Baa-30 Yr."]
[]
[null,"Apr.",3.8199999999999998E-2,null,3.1899999999999998E-2,null,2.93E-2,null,3.3133333333333327E-2,null,1.2699999999999999E-2,null,6.6E-3,null,2.4299999999999999E-2,null,null,null,{"$f":"C9-K9","v":2.5499999999999998E-2}]
[null,"May",3.6299999999999999E-2,null,3.1399999999999997E-2,null,2.8899999999999999E-2,null,3.2199999999999999E-2,null,1.38E-2,null,6.7000000000000002E-3,null,2.4899999999999999E-2,null,null,null,2.2499999999999999E-2]
[null,"Jun.",3.44E-2,null,3.0700000000000002E-2,null,2.8000000000000001E-2,null,3.1033333333333333E-2,null,1.49E-2,null,7.3000000000000001E-3,null,2.4400000000000002E-2,null,null,null,1.95E-2]
[null,"Jul.",3.09E-2,null,2.7400000000000001E-2,null,2.46E-2,null,2.7699999999999999E-2,null,1.3100000000000001E-2,null,6.1999999999999998E-3,null,2.1399999999999999E-2,null,null,null,1.78E-2]
[null,"Aug.",3.0599999999999999E-2,null,2.7300000000000001E-2,null,2.4899999999999999E-2,null,2.76E-2,null,1.3599999999999999E-2,null,6.4999999999999997E-3,null,2.2499999999999999E-2,null,null,null,1.7000000000000001E-2]
[null,"Sep. 2020",3.1699999999999999E-2,null,2.8400000000000002E-2,null,2.6200000000000001E-2,null,2.8799999999999999E-2,null,1.4200000000000001E-2,null,6.7999999999999996E-3,null,2.3099999999999999E-2,null,null,null,1.7499999999999998E-2]
[]
["Average",null,{"$f":"ROUND(AVERAGE(C9:C14),4)","v":3.3700000000000001E-2},null,{"$f":"ROUND(AVERAGE(E9:E14),4)","v":2.9499999999999998E-2},null,{"$f":"ROUND(AVERAGE(G9:G14),4)","v":2.7E-2},null,{"$f":"ROUND(AVERAGE(I9:I14),4)","v":3.0099999999999998E-2},null,{"$f":"ROUND(AVERAGE(K9:K14),4)","v":1.37E-2},null,{"$f":"ROUND(AVERAGE(M9:M14),4)","v":6.7000000000000002E-3},null,{"$f":"ROUND(AVERAGE(O9:O14),4)","v":2.3400000000000001E-2}]
[null,"Aa Spread",{"$f":"C16-G16","v":6.7000000000000011E-3},null,{"$f":"E16-G16","v":2.4999999999999988E-3},null,null,null,{"$f":"I16-G16","v":3.0999999999999986E-3},null,{"$f":"K16-M16","v":7.0000000000000001E-3}]
[]
[]
["(a)","Moody's Investors Service."]
["(b)","https://fred.stlouisfed.org/."]
[]
[]
["BOND YIELD FORECAST"]
[]
[null,null,null,null,"Baa Yield",null,null,null,null,null,null,null,null,null,"Average Utility"]
[" ",null,null,null,"2021-25",null,null,null,null,null,null,null,null,null,{"$f":"E27","v":"2021-25"}]
["Projected Aa Utility Yield"]
[null,"IHS Global Insight  (a)",null,null,{"$f":"O67","v":3.6490000000000002E-2},null,null,null,null,null,null,null,null,null,{"$f":"E29","v":3.6490000000000002E-2}]
[null,"EIA  (b)",null,null,{"$f":"O68","v":4.5960000000000001E-2},null,null,null,null,null,null,null,null,null,{"$f":"E30","v":4.5960000000000001E-2}]
[null,"Average",null,null,{"$f":"AVERAGE(E29:E30)","v":4.1224999999999998E-2},null,null,null,null,null,null,null,null,null,{"$f":"AVERAGE(O29:O30)","v":4.1224999999999998E-2}]
[]
["Current A - AA Yield Spread  (c)",null,null,null,{"$f":"E17","v":2.4999999999999988E-3}]
[]
["Implied Single-A Utility Yield",null,null,null,{"$f":"E31+E33","v":4.3725E-2}]
[]
["Current Baa - Aa Yield Spread  (c)",null,null,null,{"$f":"C17","v":6.7000000000000011E-3},null,null,null,null,null,null,null,"Avg. - Aa Spread",null,{"$f":"I17","v":3.0999999999999986E-3}]
[]
["Implied Baa Utility Yield",null,null,null,{"$f":"ROUND(E31+E37,4)","v":4.7899999999999998E-2},null,null,null,null,null,null,null,"Implied Avg Yield",null,{"$f":"ROUND(O31+O37,4)","v":4.4299999999999999E-2}]
[]
[]
[]
["(a)",{"$f":"B73&\".\"","v":"IHS Markit, Long-Term Macro Forecast - Baseline (Jun. 29, 2020)."}]
["(b)",{"$f":"B74&\".\"","v":"Energy Information Administration, Annual Energy Outlook 2020 (Jan. 29, 2020)."}]
[]
["(c)",{"$f":"\"Based on monthly average bond yields from Moody's Investors Service for the six-month period \"&B9&\" - \"&B14&\".\"","v":"Based on monthly average bond yields from Moody's Investors Service for the six-month period Apr. - Sep. 2020."}]
[]
[]
[null,null,null,null,null,null,null,null,null,null,null,null,null,null,"Average"]
["10-Yr. Treasury",null,2021,null,2022,null,2023,null,2024,null,2025,null,null,null,"2021-25"]
[null,"Value Line (a)",8.0000000000000002E-3,null,1.0999999999999999E-2,null,1.2999999999999999E-2,null,1.4999999999999999E-2,null,null,null,null,null,{"$f":"AVERAGE(C51:K51)","v":1.175E-2}]
[null,"IHS Markit (b)",6.8978355000000003E-3,null,9.0472307500000012E-3,null,1.21907575E-2,null,1.4966632499999999E-2,null,1.8076117499999999E-2,null,null,null,{"$f":"AVERAGE(C52:K52)","v":1.2235714749999998E-2}]
[null,"EIA (c)",3.1300000000000001E-2,null,3.2300000000000002E-2,null,3.2800000000000003E-2,null,3.2800000000000003E-2,null,3.27E-2,null,null,null,3.2380000000000006E-2]
[null,"Blue Chip (d)",1.2E-2,null,1.4999999999999999E-2,null,2.1000000000000001E-2,null,2.5000000000000001E-2,null,2.7E-2,null,null,null,0.02]
[null,null,null,null,null,null,null,null,null,null,null,null,null,null,{"$f":"AVERAGE(O51:O54)","v":1.9091428687500002E-2}]
["30-Yr. Treasury"]
[null,"Value Line (a)",1.4999999999999999E-2,null,0.02,null,2.1000000000000001E-2,null,2.5000000000000001E-2,null,null,null,null,null,{"$f":"AVERAGE(C57:K57)","v":2.0250000000000004E-2}]
[null,"IHS Markit (b)",1.5151337499999999E-2,null,1.8148345E-2,null,2.1303724999999999E-2,null,2.3668554999999997E-2,null,2.6110980000000002E-2,null,null,null,{"$f":"AVERAGE(C58:K58)","v":2.0876588499999998E-2}]
[null,"Blue Chip (d)",1.7999999999999999E-2,null,2.1999999999999999E-2,null,2.7E-2,null,3.1E-2,null,3.3000000000000002E-2,null,null,null,{"$f":"AVERAGE(C59:K59)","v":2.6200000000000001E-2}]
[null,null,null,null,null,null,null,null,null,null,null,null,null,null,{"$f":"AVERAGE(O57:O59)","v":2.2442196166666668E-2}]
["Aaa Corporate"]
[null,"Value Line (a)",1.9E-2,null,2.1999999999999999E-2,null,2.3E-2,null,3.3000000000000002E-2,null,null,null,null,null,{"$f":"AVERAGE(C62:K62)","v":2.4250000000000001E-2}]
[null,"IHS Global Insight (b)",2.96749675E-2,null,3.1300034999999997E-2,null,3.1549987500000001E-2,null,3.1099999999999999E-2,null,3.2125017499999999E-2,null,null,null,3.1150001500000003E-2]
[null,"Blue Chip (d)",2.8000000000000001E-2,null,3.2000000000000001E-2,null,3.5999999999999997E-2,null,0.04,null,4.2000000000000003E-2,null,null,null,3.5600000000000007E-2]
[null,null,null,null,null,null,null,null,null,null,null,null,null,null,{"$f":"AVERAGE(O62:O64)","v":3.0333333833333337E-2}]
["Aa Utility"]
[null,"IHS Markit (b)",3.4749959999999996E-2,null,3.6500035E-2,null,3.6924990000000005E-2,null,3.6524997500000003E-2,null,3.7750017499999997E-2,null,null,null,{"$f":"AVERAGE(C67:K67)","v":3.6490000000000002E-2}]
[null,"EIA (c)",4.4299999999999999E-2,null,4.58E-2,null,4.6600000000000003E-2,null,4.6600000000000003E-2,null,4.65E-2,null,null,null,4.5960000000000001E-2]
[null,null,null,null,null,null,null,null,null,null,null,null,null,null,{"$f":"AVERAGE(O67:O68)","v":4.1224999999999998E-2}]
[]
[]
["(a)","Value Line Investment Survey, Forecast for the U.S. Economy (Aug. 28, 2020)"]
["(b)","IHS Markit, Long-Term Macro Forecast - Baseline (Jun. 29, 2020)"]
["(c)","Energy Information Administration, Annual Energy Outlook 2020 (Jan. 29, 2020)"]
["(d)","Wolters Kluwer, Blue Chip Financial Forecasts (Jun. 1, 2020)"]
[]
[]
["BLUE CHIP (Jun. 2020)",null,null,null,null,null,"BP"]
[null,null,"1Q2020",null,2025,null,"Chg."]
[null,"Aaa",0.03,null,4.2000000000000003E-2,null,{"$f":"(E80-C80)*10000","v":120.00000000000004}]
[null,"Baa",3.7600000000000001E-2,null,5.2999999999999999E-2,null,{"$f":"(E81-C81)*10000","v":153.99999999999997}]
[null,null,null,null,null,null,{"$f":"AVERAGE(G80:G81)","v":137}]

{"sheet":"Size Premium","index":36,"n_rows":18,"n_cols":2,"rows_kept":18,"cut":false,"hidden":false,"merged":[]}
[]
[]
["Market","Size"]
["Cap","Premium"]
[31090.379000000001,-2.8E-3]
[13142.606,5.0000000000000001E-3]
[6618.6040000000003,7.3000000000000001E-3]
[4312.5460000000003,7.9000000000000008E-3]
[2688.8890000000001,1.0999999999999999E-2]
[1669.856,1.34E-2]
[993.85500000000002,1.47E-2]
[515.62099999999998,1.5900000000000001E-2]
[230.024,2.2200000000000001E-2]
[1.9730000000000001,4.99E-2]
[]
[]
[]
["Duff & Phelps, 2020 CRSP Deciles Size Study -- Supplementary Data Exhibits, Cost of Capital Navigator."]

{"sheet":"Ordinal Ratings","index":37,"n_rows":30,"n_cols":11,"rows_kept":30,"cut":false,"hidden":false,"merged":[[4,0,4,2],[4,4,4,6],[4,8,4,10]]}
["KEY TO RATING CODES"]
[]
[]
[]
["S&P",null,null,null,"VL Fin Strength",null,null,null,"Moody's"]
["Corporate",null,"Corporate",null,"Strength",null,"Strength",null,"Long-term",null,"Long-term"]
["Rating","Code","Rating",null,"Rank","Code","Rank",null,"Rating","Code","Rating"]
["AAA",1,"AAA",null,"A++",1,"A++",null,"AAA",1,"AAA"]
["AA+",2,"AA+",null,"A+",2,"A+",null,"Aa1",2,"Aa1"]
["AA",3,"AA",null,"A",3,"A",null,"Aa2",3,"Aa2"]
["AA-",4,"AA-",null,"B++",4,"B++",null,"Aa3",4,"Aa3"]
["A+",5,"A+",null,"B+",5,"B+",null,"A1",5,"A1"]
["A",6,"A",null,"B",6,"B",null,"A2",6,"A2"]
["A-",7,"A-",null,"C++",7,"C++",null,"A3",7,"A3"]
["BBB+",8,"BBB+",null,"C+",8,"C+",null,"Baa1",8,"Baa1"]
["BBB",9,"BBB",null,"C",9,"C",null,"Baa2",9,"Baa2"]
["BBB-",10,"BBB-",null,"--"," ","--",null,"Baa3",10,"Baa3"]
["BB+",11,"BB+",null,"n/a"," ","n/a",null,"Ba1",11,"Ba1"]
["BB",12,"BB",null,null,null,null,null,"Ba2",12,"Ba2"]
["BB-",13,"BB-",null,null,null,null,null,"Ba3",13,"Ba3"]
["B+",14,"B+",null,null,null,null,null,"B1",14,"B1"]
["B",15,"B",null,null,null,null,null,"B2",15,"B2"]
["B-",16,"B-",null,null,null,null,null,"B3",16,"B3"]
["CCC+",17,"CCC+",null,null,null,null,null,"Caa1",17,"Caa1"]
["CCC",18,"CCC",null,null,null,null,null,"Caa2",18,"Caa2"]
["CCC-",19,"CCC-",null,null,null,null,null,"Caa3",19,"Caa3"]
["CC",20,"CC",null,null,null,null,null,"NR"," ","--"]
["C",21,"C"]
["D",22,"D"]
["NR"," ","--"]

{"sheet":"Electric Utility Data","index":38,"n_rows":57,"n_cols":35,"rows_kept":57,"cut":false,"hidden":false,"merged":[[5,16,5,17],[5,19,5,21],[5,5,5,6],[5,7,5,9],[5,10,5,11],[5,12,5,13],[5,14,5,15]]}
["ELECTRIC UTILITY INDUSTRY"]
[]
[]
[null,{"$f":"A4+1","v":1},2,3,4,5,6,7,8,9,10,11,12,13,14,15,16,17,18,19,20,21,22,23,24,25,26,27,28,29,30,{"$f":"AE4+1","v":31},{"$f":"AF4+1","v":32},{"$f":"AG4+1","v":33},{"$f":"AH4+1","v":34}]
[" "," ",null,null,"(a)","(b)","(b)","(b)","(b)","(b)","(b)","(b)","(b)","(b)","(b)","(b)","(b)","(b)","(b)","(b)","(b)","(b)","(b)","(a)","(b)","(b)","(c)","(d)","(b)","(b)","(e)","(f)","(g)","(h)","(i)"]
[null,null,null,null,"Est'd","Projected Price",null,2024,null,null,"Common Shares",null,"Debt Ratio",null,"Equity Ratio",null,"Total Capital",null,"ROE","Projected Growth Rates",null,null,"Safety",null,"Financial","Allowed","S&P","Moody's","Market","Gas",null,null,"Intentionally","Intentionally","Intentionally"]
[null,"SYM","Company",null,"Div'd","High","Low","EPS","DPS","BVPS",2019,2024,2019,2024,2019,2024,2019,2024,2024,"EPS","DPS","BVPS","Rank","Beta","Strength","ROE","Rating","Rating","Cap","Utility","IBES","Zacks","Blank","Blank","Blank"]
[1,"AQN","Algonquin Pwr & Util",null,0.62,"n/a","n/a","n/a","n/a","n/a","n/a","n/a","n/a","n/a","n/a","n/a","n/a","n/a","n/a","n/a","n/a","n/a","n/a",0.9,"n/a","n/a","BBB","NR",9094.3405220000004,"Y",5.7000000000000002E-2,7.8700000000000006E-2]
[{"$f":"A8+1","v":2},"ALE","ALLETE",null,2.5499999999999998,90,65,4.25,2.9,51.75,51.7,54.25,0.38600000000000001,0.41,0.61399999999999999,0.59,3632.8,4775,0.08,4.4999999999999998E-2,4.4999999999999998E-2,3.5000000000000003E-2,2,0.85,"A",9.2499999999999999E-2,"BBB","Baa1",2800,"Y",7.0000000000000007E-2,"n/a"]
[3,"LNT","Alliant Energy",null,1.52,55,40,3,2,28.25,245.02,265,0.51500000000000001,0.52,0.48499999999999999,0.48,10226,12000,0.105,5.5E-2,7.0000000000000007E-2,6.5000000000000002E-2,2,0.85,"A",0.1,"A-","Baa2",13500,"Y",5.2999999999999999E-2,5.5399999999999998E-2]
[4,"AEE","Ameren Corp.",null,2.08,85,60,4.5,2.4500000000000002,44.5,246.2,270,0.52100000000000002,0.5,0.47099999999999997,0.49,17116,24500,0.1,0.06,0.05,0.06,2,0.8,"A",8.6999999999999994E-2,"BBB+","Baa1",20000,"Y",0.06,6.8900000000000003E-2]
[5,"AEP","American Elec Pwr",null,2.96,105,85,5.5,3.55,53,494.17,555,0.56100000000000005,0.52,0.439,0.48,44759,61200,0.105,0.06,5.5E-2,5.5E-2,1,0.75,"A+",{"$f":"AVERAGE(0.093,0.109)","v":0.10100000000000001},"A-","Baa2",39000,"N",5.6300000000000003E-2,5.5899999999999998E-2]
[6,"AGR","Avangrid, Inc.",null,1.76,50,35,2.5,1.8,51.75,309.01,309,0.30599999999999999,0.42499999999999999,0.69399999999999995,0.57499999999999996,21953,27800,0.05,0.04,5.0000000000000001E-3,0.01,2,0.8,"B++",{"$f":"AVERAGE(9%,9.1%,8.25%)","v":8.7833333333333333E-2},"BBB+","Baa1",15000,"Y",4.5999999999999999E-2,5.3100000000000001E-2]
[7,"AVA","Avista Corp.",null,1.64,60,45,2.5,1.9,31.75,67.180000000000007,73,0.49399999999999999,0.51,0.50600000000000001,0.49,3834.6,4750,7.4999999999999997E-2,0.01,0.04,2.5000000000000001E-2,2,0.9,"B++",{"$f":"AVERAGE(0.094,0.095,0.094)","v":9.4333333333333338E-2},"BBB","Baa2",2400,"Y",5.8000000000000003E-2,5.1400000000000001E-2]
[8,"BKH","Black Hills Corp.",null,2.23,90,65,4.25,2.75,46.75,61.48,64,0.57099999999999995,0.52,0.42899999999999999,0.48,5502.2,6200,0.09,3.5000000000000003E-2,0.06,4.4999999999999998E-2,2,0.95,"A",9.3700000000000006E-2,"BBB+","Baa2",3800,"Y",4.6899999999999997E-2,5.7599999999999998E-2]
[9,"CNP","CenterPoint Energy",null,0.63,25,18,1.6,0.8,15.25,502.24,640,0.63,0.54500000000000004,0.29099999999999998,0.42,22603,23000,0.105,0.04,-5.5E-2,0.04,3,1.1000000000000001,"B+",9.4E-2,"BBB+","Baa2",11000,"Y",-6.6500000000000004E-2,0.05]
[10,"CMS","CMS Energy Corp.",null,1.71,75,55,3.5,2.15,25.5,283.86,300,0.70399999999999996,0.68,0.29399999999999998,0.32,17082,24100,0.13500000000000001,7.4999999999999997E-2,7.0000000000000007E-2,7.4999999999999997E-2,2,0.8,"B++",0.1,"BBB+","Baa1",17000,"Y",7.0800000000000002E-2,7.0099999999999996E-2]
[11,"ED","Consolidated Edison",null,3.11,100,85,5,3.5,62.5,333,365,0.50700000000000001,0.5,0.49299999999999999,0.5,36549,45500,0.08,0.03,3.5000000000000003E-2,0.03,1,0.75,"A+",{"$f":"AVERAGE(8.8%,9%)","v":8.8999999999999996E-2},"A-","Baa2",25000,"Y",2.5499999999999998E-2,0.02]
[12,"D","Dominion Energy",null,2.82,90,65,4.25,3,39,838,887,0.51400000000000001,0.49,0.45,0.5,65818,69400,0.11,0.03,-5.0000000000000001E-3,5.5E-2,2,0.8,"B++",0.109,"BBB+","Baa2",67000,"Y",2.7400000000000001E-2,3.5299999999999998E-2]
[13,"DTE","DTE Energy Co.",null,4.34,160,120,8.5,5.2,79.25,192.21,205,0.57699999999999996,0.58499999999999996,0.42299999999999999,0.41499999999999998,27607,39000,0.11,0.06,6.5000000000000002E-2,5.5E-2,2,0.9,"A",9.9000000000000005E-2,"BBB+","Baa2",23000,"Y",5.9499999999999997E-2,5.67E-2]
[14,"DUK","Duke Energy Corp.",null,3.88,110,80,6,4.1500000000000004,71,733,785,0.54,0.53500000000000003,0.441,0.45,101807,123600,8.5000000000000006E-2,0.05,2.5000000000000001E-2,2.5000000000000001E-2,2,0.85,"A",{"$f":"AVERAGE(9.9%,9.5%,10.5%,10.5%)","v":0.10099999999999999},"A-","Baa1",62000,"Y",1.6E-2,4.2700000000000002E-2]
[15,"EIX","Edison International",null,2.6,95,65,5.25,3,46.5,361.99,378,0.53500000000000003,0.57999999999999996,0.39900000000000002,0.375,33360,47200,0.11,"n/a",0.04,0.05,3,0.9,"B+",0.10299999999999999,"BBB","Baa3",20000,"N",1.4E-2,2.8899999999999999E-2]
[16,"EMA","Emera Inc.",null,2.4500000000000002,85,60,4,2.76,44.95,242.48,262,{"$f":"13679/(13679+8566)","v":0.61492470218026518},{"$f":"12800/(12800+11075)","v":0.53612565445026183},{"$f":"8566/(13679+8566)","v":0.38507529781973476},{"$f":"11075/(12800+11075)","v":0.46387434554973822},{"$f":"13679+8566","v":22245},{"$f":"12800+11075","v":23875},0.1,0.06,3.5000000000000003E-2,0.03,2,0.75,"B+","n/a","BBB","Baa3",13100,"Y",5.74E-2,"n/a"]
[17,"ETR","Entergy Corp.",null,3.8,140,105,7,4.55,64,199.15,210,0.62,0.59499999999999997,0.371,0.39500000000000002,27557,33800,0.11,0.03,0.04,0.05,2,0.95,"B++",9.9500000000000005E-2,"BBB+","Baa2",20000,"Y",5.3999999999999999E-2,5.4300000000000001E-2]
[18,"EVRG","Evergy Inc.",null,2.14,80,60,3.5,2.5499999999999998,42.25,226.64,227,0.50600000000000001,0.53500000000000003,0.49399999999999999,0.46500000000000002,17337,20500,8.5000000000000006E-2,4.4999999999999998E-2,5.5E-2,0.02,2,1,"B++",9.2999999999999999E-2,"A-","Baa2",12000,"N",6.8000000000000005E-2,6.4100000000000004E-2]
[19,"ES","Eversource Energy",null,2.34,90,75,4.5,2.85,49,329.88,361,0.52800000000000002,0.53,0.46600000000000003,0.46500000000000002,27097,38200,0.09,5.5E-2,0.06,0.05,1,0.9,"A",{"$f":"AVERAGE(10%,9.25%,9.67%)","v":9.64E-2},"A-","Baa1",30000,"Y",6.4399999999999999E-2,6.59E-2]
[20,"EXC","Exelon Corp.",null,1.57,60,40,3.5,1.9,40.25,973,990,0.496,0.5,0.504,0.5,63943,80300,0.09,0.05,5.5E-2,0.04,3,0.95,"B+",{"$f":"AVERAGE(9.25%,9.75%,9.75%)","v":9.5833333333333326E-2},"BBB+","Baa2",37000,"Y",-3.4799999999999998E-2,0.04]
[21,"FE","FirstEnergy Corp.",null,1.59,60,40,3.25,1.9,20.5,540.65,580,0.73799999999999999,0.66,0.26200000000000001,0.34,26593,35000,0.155,8.5000000000000006E-2,0.03,0.1,3,0.85,"B+",{"$f":"AVERAGE(9.75%,11.7%)","v":0.10725},"BBB","Baa3",16000,"N",-2.4E-2,"n/a"]
[22,"FTS","Fortis Inc.",null,2.02,80,55,3,2.5,43.75,463.3,478,0.54200000000000004,0.53,0.41799999999999998,0.435,40445,48100,7.0000000000000007E-2,2.5000000000000001E-2,0.06,0.04,2,0.8,"B++",{"$f":"AVERAGE(0.083,0.1032)","v":9.3100000000000002E-2},"A-","Baa3",24000,"Y",5.3999999999999999E-2,6.1100000000000002E-2]
[23,"HE","Hawaiian Elec.",null,1.32,40,30,2,1.4,24.5,108.97,114,0.44600000000000001,0.48,0.54600000000000004,0.51500000000000001,4176.8999999999996,5425,8.5000000000000006E-2,1.4999999999999999E-2,0.02,3.5000000000000003E-2,2,0.8,"A",9.5000000000000015E-2,"BBB-","Baa2",4000,"N",3.3000000000000002E-2,1.67E-2]
[24,"IDA","IDACORP, Inc.",null,2.83,115,85,5.5,3.55,58,50.42,50.4,0.41299999999999998,0.46500000000000002,0.58699999999999997,0.53500000000000003,4201.3,5450,9.5000000000000001E-2,3.5000000000000003E-2,6.5000000000000002E-2,3.5000000000000003E-2,2,0.8,"A",0.1,"BBB","Baa1",4600,"N",2.5999999999999999E-2,2.63E-2]
[25,"MGEE","MGE Energy",null,1.5,80,65,3,1.8,32,34.67,36.159999999999997,0.38,0.36499999999999999,0.62,0.63500000000000001,1379.4,1825,9.5000000000000001E-2,0.04,5.5E-2,0.05,1,0.7,"A+",9.8000000000000004E-2,"NR","NR",2400,"Y",4.3999999999999997E-2,4.3799999999999999E-2]
[26,"NEE","NextEra Energy, Inc.",null,5.88,320,265,12.25,8.1999999999999993,98.75,489,505,0.504,0.495,0.496,0.505,74548,98400,0.125,0.1,0.105,0.06,1,0.85,"A+",{"$f":"AVERAGE(9.6%,11.6%)","v":0.106},"A-","Baa1",136000,"N",8.14E-2,7.9399999999999998E-2]
[27,"NWE","NorthWestern Corp.",null,2.4500000000000002,85,65,3.75,2.8,45.75,50.45,53,0.52500000000000002,0.5,0.47499999999999998,0.5,4289.8,4825,8.5000000000000006E-2,1.4999999999999999E-2,0.04,0.03,2,0.9,"B++",{"$f":"AVERAGE(0.0965,0.104)","v":0.10025000000000001},"BBB","Baa2",2700,"Y",3.7999999999999999E-2,3.39E-2]
[28,"OGE","OGE Energy Corp.",null,1.64,55,40,2.5,1.95,20.5,200.1,200,0.436,0.49,0.56399999999999995,0.51,7334.7,8050,0.12,0.03,0.06,5.0000000000000001E-3,2,1.05,"A",{"$f":"AVERAGE(0.095,0.095)","v":9.5000000000000001E-2},"BBB+","Baa1",6400,"N",2.4E-2,3.6900000000000002E-2]
[29,"OTTR","Otter Tail Corp.",null,1.54,60,45,2.75,1.8,23.25,40.159999999999997,42,0.46899999999999997,0.47,0.53100000000000003,0.53,1471.1,1850,0.115,0.05,0.05,4.4999999999999998E-2,2,0.85,"A",{"$f":"AVERAGE(0.0941,0.0977,0.0875)","v":9.3100000000000002E-2},"BBB","Baa2",1600,"N",0.09,"n/a"]
[30,"PNW","Pinnacle West Capital",null,3.27,115,95,5.75,4,57.25,112.44,118,0.47099999999999997,0.53500000000000003,0.52900000000000003,0.46500000000000002,10263,14525,0.1,0.04,5.5E-2,3.5000000000000003E-2,1,0.85,"A+",0.1,"A-","A3",8900,"N",3.7499999999999999E-2,4.7E-2]
[31,"PNM","PNM Resources",null,1.26,55,35,2.75,1.5,29.25,79.650000000000006,92,0.59799999999999998,0.505,0.39900000000000002,0.49,4207.7,5475,9.5000000000000001E-2,0.06,5.5E-2,5.5E-2,3,0.95,"B+",{"$f":"AVERAGE(0.09575,0.10125)","v":9.8500000000000004E-2},"BBB","Baa3",3100,"N",4.9500000000000002E-2,4.87E-2]
[32,"POR","Portland General Elec.",null,1.63,60,45,3,1.95,33.75,89.39,90,0.51300000000000001,0.52500000000000002,0.48699999999999999,0.47499999999999998,5323,6400,0.09,0.04,5.5E-2,0.03,2,0.85,"B++",9.5000000000000001E-2,"BBB+","A3",3800,"N",4.2999999999999997E-2,0.05]
[33,"PPL","PPL Corp.",null,1.67,45,35,2.75,1.8,21.25,767.23,780,0.61499999999999999,0.57499999999999996,0.38500000000000001,0.42499999999999999,33712,39100,0.125,2.5000000000000001E-2,0.02,4.4999999999999998E-2,2,1.1000000000000001,"B++",9.7250000000000003E-2,"A-","Baa2",20000,"Y",-0.16200000000000001,"n/a"]
[34,"PEG","Pub Sv Enterprise Grp.",null,2,65,55,4.25,2.2999999999999998,38.5,504,505,0.47699999999999998,0.5,0.52300000000000002,0.5,28832,38700,0.11,0.05,0.04,0.05,1,0.9,"A++",9.6000000000000002E-2,"BBB+","Baa1",28000,"Y",1.47E-2,3.4599999999999999E-2]
[35,"SRE","Sempra Energy",null,4.34,190,140,9.5,5.6,88.75,291.70999999999998,340,0.51,0.48499999999999999,0.434,0.51500000000000001,40734,58500,0.105,0.1,7.4999999999999997E-2,8.5000000000000006E-2,2,0.95,"A",{"$f":"AVERAGE(0.102,0.105)","v":0.10349999999999999},"BBB+","Baa2",35000,"Y",6.2700000000000006E-2,7.3599999999999999E-2]
[36,"SO","Southern Company",null,2.6,70,50,3.75,2.86,30.5,1053.3,1090,0.60099999999999998,0.6,0.39500000000000002,0.39500000000000002,69594,84000,0.125,0.03,0.03,3.5000000000000003E-2,2,0.9,"A",0.125,"A-","Baa2",57000,"Y",4.5499999999999999E-2,0.04]
[37,"WEC","WEC Energy Group",null,2.66,105,85,4.75,3.2,38,315.43,315.5,0.52500000000000002,0.52,0.47399999999999998,0.48,21355,25000,0.125,0.06,6.5000000000000002E-2,3.5000000000000003E-2,1,0.8,"A+",{"$f":"AVERAGE(AVERAGE(0.1,0.103),0.0905,0.097,0.099)","v":9.7000000000000003E-2},"A-","Baa1",30000,"Y",5.9499999999999997E-2,5.9400000000000001E-2]
[38,"XEL","Xcel Energy Inc.",null,1.77,65,55,3.5,2.15,32.35,524.54,548,0.56799999999999995,0.57499999999999996,0.432,0.42499999999999999,30646,41700,0.105,0.06,0.06,0.05,1,0.8,"A+",9.6000000000000002E-2,"A-","Baa1",34000,"Y",5.8500000000000003E-2,5.8099999999999999E-2]
[]
[]
[]
["(a)","The Value Line Investment Survey, Summary & Index (Oct. 2, 2020).",null,null,null,null,null,null,"Algonquin (Oct. 9, 2020)."]
["(b)","The Value Line Investment Survey (Jul. 24, Aug. 14 and Sep. 11, 2020).",null,null,null,null,null,null,"Emera (Sep. 18, 2020).",null,null,"Algonquin market cap ($US) retrieved from www.nasdaq.com (Oct. 5, 2020)."]
["(c)","Issuer credit rating from www.standardandpoors.com (retrieved Oct. 5, 2020)."]
["(d)","Long-term rating from www.moodys.com (retrieved Oct. 5, 2020)."]
["(e)","www.finance.yahoo.com (retreived Oct. 5, 2020)."]
["(f)","www.zacks.com (retrieved Oct. 5, 2020)."]
["(g)","Intentionally Blank"]
["(h)","Intentionally Blank"]
["(i)","Intentionally Blank"]

{"sheet":"CS Data","index":39,"n_rows":53,"n_cols":11,"rows_kept":53,"cut":false,"hidden":false,"merged":[[5,5,5,8]]}
["CAPITAL STRUCTURE DATA"]
[]
["ELECTRIC UTILITY INDUSTRY"]
[]
[]
[null,null,null,null,null,"At Year-end 2019"]
[]
[null,null,null,"Current","Long-term",null,null,"Common"]
[null,null,"Company","Maturities","Debt","D+E","Preferred","Stock (b)","Total"]
[1,"AQN","Algonquin Pwr & Util",225.01300000000001,3706.855,{"$f":"SUM(D10,E10)","v":3931.8679999999999},184.29900000000001,4222.2960000000003,{"$f":"SUM(F10:H10)","v":8338.4629999999997}]
[{"$f":"A10+1","v":2},"ALE","ALLETE",212.9,1400.9,{"$f":"SUM(D11,E11)","v":1613.8000000000002},0,2335.6,{"$f":"SUM(F11:H11)","v":3949.4}]
[3,"LNT","Alliant Energy",657.2,5533,{"$f":"SUM(D12,E12)","v":6190.2},200,5205.1000000000004,{"$f":"SUM(F12:H12)","v":11595.3}]
[4,"AEE","Ameren Corp.",442,8915,{"$f":"SUM(D13,E13)","v":9357},0,8201,17558]
[5,"AEP","American Elec Pwr",1598.7,25126.799999999999,26725.5,0,19913.2,46638.7]
[6,"AGR","Avangrid, Inc.",730,6716,7446,0,15586,23032]
[7,"AVA","Avista Corp.",52,1843.768,1895.768,0,1939.2840000000001,3835.0520000000001]
[8,"BKH","Black Hills Corp.",5.7430000000000003,3140.096,3145.8389999999999,0,2464.069,5609.9079999999994]
[9,"CNP","CenterPoint Energy",849,14244,15093,0,8359,23452]
[10,"CMS","CMS Energy Corp.",1130,12027,13157,0,5055,18212]
[11,"ED","Consolidated Edison",1446,18527,19973,0,18213,38186]
[12,"D","Dominion Energy",3162,33824,36986,0,34033,71019]
[13,"DTE","DTE Energy Co.",687,15935,16622,0,11836,28458]
[14,"DUK","Duke Energy Corp.",3141,54985,58126,0,47951,106077]
[15,"EIX","Edison International",479,17864,18343,0,15496,33839]
[16,"EMA","Emera Inc.",1119,14292,15411,1004,7354,23769,null,"*This is $CAD"]
[17,"ETR","Entergy Corp.",795.01199999999994,17078.643,17873.654999999999,219.41,10258.674999999999,28351.739999999998]
[18,"EVRG","Evergy Inc.",251.1,8746.7000000000007,8997.8000000000011,0,8545.2999999999993,17543.099999999999]
[19,"ES","Eversource Energy",370.62099999999998,14310.949999999999,14681.570999999998,0,12785.564,27467.134999999998]
[20,"EXC","Exelon Corp.",4710,31719,36429,0,34573,71002]
[21,"FE","FirstEnergy Corp.",380,19618,19998,0,6975,26973]
[22,"FTS","Fortis Inc.",714,21914,22628,1623,18490,42741]
[23,"HE","Hawaiian Elec.",0,2079.4749999999999,2079.4749999999999,34.292999999999999,2280.2600000000002,4394.0280000000002]
[24,"IDA","IDACORP, Inc.",100,1736.6590000000001,1836.6590000000001,0,2470.5530000000003,4307.2120000000004]
[25,"MGEE","MGE Energy",19.658999999999999,523.74099999999999,543.4,0,855.67600000000004,1399.076]
[26,"NEE","NextEra Energy, Inc.",2124,37543,39667,0,41360,81027]
[27,"NWE","NorthWestern Corp.",2.476,2250.7199999999998,2253.1959999999999,0,2039.0940000000001,4292.29]
[28,"OGE","OGE Energy Corp.",0,3195.2,3195.2,0,4139.5,7334.7]
[29,"OTTR","Otter Tail Corp.",0.183,689.58100000000002,689.76400000000001,0,781.48199999999997,1471.2460000000001]
[30,"PNW","Pinnacle West Capital",800,4832.558,5632.558,0,5553.1880000000001,11185.745999999999]
[31,"PNM","PNM Resources",490.26799999999997,2517.4490000000001,3007.7170000000001,11.529,1741.75,4760.9960000000001]
[32,"POR","Portland General Elec.",16,2732,2748,0,2591,5339]
[33,"PPL","PPL Corp.",1172,20721,21893,0,12991,34884]
[34,"PEG","Pub Sv Enterprise Grp.",1365,13743,15108,0,15089,30197]
[35,"SRE","Sempra Energy",1526,20785,22311,20,21785,44116]
[36,"SO","Southern Company",2989,41798,44787,291,31468,76546]
[37,"WEC","WEC Energy Group",693.2,11211,11904.2,30.4,10224.199999999999,22158.799999999999]
[38,"XEL","Xcel Energy Inc.",702,17407,18109,0,13239,31348]
[]
[]
["Source:  Form 10-K Reports available at http://www.sec.gov/edgar/searchedgar/companysearch.html."]
[]
["(a)","Including current maturities of long-term debt."]
["(b)","Including noncontrolling interest."]

{"sheet":"Capital Structure - Op. Cos.","index":40,"n_rows":80,"n_cols":16,"rows_kept":80,"cut":false,"hidden":false,"merged":[[6,2,8,2],[7,15,8,15],[6,14,8,14],[7,5,8,5],[7,4,8,4],[7,3,8,3],[7,13,8,13]]}
[]
[]
[]
[]
[]
[]
[null,null,"Current Maturities-LTD",null,null,null,null,null,null,null,null,null,null,null,"Wtd Preferred Stock"]
[null,null,null,"Long-term Debt (a)","Preferred Stock","Common Equity",null,null,"Source:",null,null,null,null,"Wtd Debt",null,"Wtd. Equity"]
[null,"Operating Company",null,null,null,null,"Total",null,"10-K unless otherwise noted","Weight","Debt","Preferred Stock","Equity"]
[1,"ALGONQUIN PWR. & UTIL."]
[null,"Empire District Electric Co.",null,779.56806200000005,0,914.87190599999997,{"$f":"SUM(C11:F11)","v":1694.4399680000001},null,"FERC Form 1 (2019)",{"$f":"G11/$G$76","v":6.4377253490400322E-3},{"$f":"SUM(C11:D11)/$G11","v":0.46007417006348611},{"$f":"SUM(E11)/$G11","v":0},{"$f":"SUM(F11:F11)/$G11","v":0.53992582993651383},{"$f":"$J11*K11","v":2.9618311470562594E-3},0,3.4758942019837724E-3]
[null,"Liberty Utilities (Granite State Elec.)",null,31.966525000000001,0,107.322593,{"$f":"SUM(C12:F12)","v":139.289118},null,"FERC Form 1 (2019)",{"$f":"G12/$G$76","v":5.2920439952348203E-4},{"$f":"SUM(C12:D12)/$G12","v":0.22949764819388116},{"$f":"SUM(E12)/$G12","v":0},{"$f":"SUM(F12:F12)/$G12","v":0.77050235180611881},{"$f":"$J12*K12","v":1.214511651044942E-4},{"$f":"$J12*L12","v":0},{"$f":"$J12*M12","v":4.0775323441898781E-4}]
[2,"ALLETE"]
[null,"ALLETE, Inc. (Minnesota Power)",null,1513.4051689999999,0,2231.6449680000001,{"$f":"SUM(C14:F14)","v":3745.0501370000002},null,"FERC Form 1 (2019)",{"$f":"G14/$G$76","v":1.4228656462139557E-2},0.40410811968790467,0,0.59589188031209528,5.7499156086003702E-3,0,8.4787408535391857E-3]
[3,"AMEREN CORP."]
[null,"Ameren Illinois Co.",null,3575,62,4070,{"$f":"SUM(C16:F16)","v":7707},null,0,{"$f":"G16/$G$76","v":2.9281385119600486E-2},0.46386401972233032,8.0446347476320224E-3,0.52809134553003767,1.3582581004615509E-2,2.3555804819193332E-4,1.5463246066793043E-2]
[null,"Union Electric Co.",null,4190,80,4269,{"$f":"SUM(C17:F17)","v":8539},null,0,{"$f":"G17/$G$76","v":3.2442422153401915E-2},0.49068977632041222,9.3687785454971313E-3,0.49994144513409067,1.5919164869745171E-2,3.0394586863475269E-4,1.6219311415021993E-2]
[4,"AVANGRID"]
[null,"Central Maine Pwr",null,1190,0.57130000000000003,1983.18245,{"$f":"SUM(C19:F19)","v":3173.7537499999999},null,"FERC Form 1 (2019)",{"$f":"G19/$G$76","v":1.2058116754706921E-2},0.3749503249897696,1.8000766442576084E-4,0.62486966734580462,4.5211947959419461E-3,2.1705534343879278E-6,7.5347514053305869E-3]
[null,"NY State E&G",null,1535.4839979999999,0,1471.5043390000001,{"$f":"SUM(C20:F20)","v":3006.9883369999998},null,"FERC Form 1 (2019)",{"$f":"G20/$G$76","v":1.1424521025800442E-2},0.51063849470461053,0,0.48936150529538958,5.8338002193359106E-3,0,5.5907208064645327E-3]
[null,"Rochester G&E",null,1051.9404079999999,0,1104.3462730000001,{"$f":"SUM(C21:F21)","v":2156.286681},null,"FERC Form 1 (2019)",{"$f":"G21/$G$76","v":8.1924303535261603E-3},0.4878481220837258,0,0.51215187791627415,3.9966617632694514E-3,0,4.1957685902567089E-3]
[null,"United Illuminating",null,866.96,0,1179.0427179999999,{"$f":"SUM(C22:F22)","v":2046.002718},null,"FERC Form 1 (2019)",{"$f":"G22/$G$76","v":7.7734259168946865E-3},0.42373355243998267,0,0.57626644756001733,3.293861378394815E-3,0,4.4795645384998715E-3]
[5,"BLACK HILLS CORP."]
[null,"Black Hills Power",null,342.77289000000002,0,451.03680200000002,{"$f":"SUM(C24:F24)","v":793.80969200000004},null,"FERC Form 1 (2019)",{"$f":"G24/$G$76","v":3.0159397045703188E-3},0.43180738841369554,0,0.56819261158630452,1.3023050474436817E-3,0,1.7136346571266371E-3]
[null,"Cheyenne Light Fuel & Power",null,202,0,188.83557300000001,390.83557300000001,null,"FERC Form 1 (2019)",{"$f":"G25/$G$76","v":1.4849107216105787E-3},0.51684138792555612,0,0.48315861207444394,7.6746331830275061E-4,0,7.1744740330782818E-4]
[null,"Black Hills/Colorado Electric Utility Co",null,150,0,405.240928,555.24092799999994,null,"FERC Form 1 (2019)",{"$f":"G26/$G$76","v":2.109539827031577E-3},0.27015299563795847,0,0.72984700436204164,5.698985036901613E-4,0,1.5396413233414159E-3]
[6,"CENTERPOINT ENERGY"]
[null,"CenterPoint Energy Houston Elect.",null,4950,0,3251,8201,null,0,{"$f":"G28/$G$76","v":3.1158250858420083E-2},0.60358492866723568,0,0.39641507133276432,1.880665062177532E-2,0,1.2351600236644762E-2]
[7,"CMS ENERGY"]
[null,"Consumers Energy Co.",null,7345,37,7700,15082,null,0,{"$f":"G30/$G$76","v":5.7301394884366745E-2},0.48700437607744329,2.4532555364010079E-3,0.51054236838615563,2.7906030064028229E-2,1.4057496424357312E-4,2.9254789856094941E-2]
[9,"DTE ENERGY CO."]
[null,"DTE Electric Co.",null,7188,0,7195,{"$f":"SUM(C32:F32)","v":14383},null,0,{"$f":"G32/$G$76","v":5.4645667857170593E-2},0.49975665716470835,0,0.5002433428352917,2.7309536296832526E-2,0,2.7336131560338071E-2]
[10,"EDISON INTERNATIONAL"]
[null,"Southern California Edison Co.",null,15211,2245,15582,{"$f":"SUM(C34:F34)","v":33038},null,0,{"$f":"G34/$G$76","v":0.12552204509943699},0.46040922574005688,6.7952055209153095E-2,0.47163871905079002,5.7791507597540287E-2,8.5294809385627474E-3,5.9201056563333958E-2]
[11,"EMERA INC."]
[null,"Emera Maine",null,398.53803299999998,0.3654,531.55704100000003,{"$f":"SUM(C36:F36)","v":930.46047399999998},null,"FERC Form 1 (2019)",{"$f":"G36/$G$76","v":3.5351202125029212E-3},0.42832344214118651,3.9270878259789466E-4,0.57128384907621566,1.5141748578021339E-3,1.3882727549892328E-6,2.0195570819457982E-3]
[null,"Tampa Electric Co.",null,2557.7042620000002,0,3163.7517499999999,{"$f":"SUM(C37:F37)","v":5721.4560120000006},null,"FERC Form 1 (2019)",{"$f":"G37/$G$76","v":2.173766146778585E-2},0.44703730250403961,0,0.55296269749596039,9.717545545304988E-3,0,1.2020115922480862E-2]
[12,"ENTERGY CORP."]
[null,"Entergy Arkansas Inc.",null,3517.2080000000001,0,3125.9369999999999,{"$f":"SUM(C39:F39)","v":6643.1450000000004},null,0,{"$f":"G39/$G$76","v":2.5239455968645175E-2},0.52944922924307691,0,0.47055077075692309,1.3363010509113765E-2,0,1.1876445459531411E-2]
[null,"Entergy Louisiana LLC",null,7303.6690000000008,0,6397.1180000000004,{"$f":"SUM(C40:F40)","v":13700.787},null,0,{"$f":"G40/$G$76","v":5.2053720071184091E-2},0.53308390240648229,0,0.46691609759351782,2.7749000230321449E-2,0,2.4304719840862649E-2]
[null,"Entergy Mississippi Inc.",null,1614.1289999999999,0,1542.1510000000001,{"$f":"SUM(C41:F41)","v":3156.2799999999997},null,0,{"$f":"G41/$G$76","v":1.1991728328181213E-2},0.51140234706680021,0,0.4885976529331999,6.132598012419309E-3,0,5.8591303157619059E-3]
[null,"Entergy New Orleans Inc.",null,559.06799999999998,0,497.57900000000001,{"$f":"SUM(C42:F42)","v":1056.6469999999999},null,0,{"$f":"G42/$G$76","v":4.0145436281913182E-3},0.52909628286457067,0,0.47090371713542939,2.1240801110736737E-3,0,1.8904635171176449E-3]
[null,"Entergy Texas Inc.",null,1922.9559999999999,35,1764.4069999999999,{"$f":"SUM(C43:F43)","v":3722.3629999999998},null,0,{"$f":"G43/$G$76","v":1.4142460692610798E-2},0.51659550667143428,9.4026294587604697E-3,0.47400186386980531,7.3059316470801185E-3,1.3297631752770428E-4,6.7035527280029754E-3]
[13,"EXELON CORP."]
[null,"Delmarva Power and Light",null,1567,0,1580,3147,null,0,{"$f":"G45/$G$76","v":1.1956470607419584E-2},0.49793454083253891,0,0.50206545916746104,5.9535397018832181E-3,0,6.0029309055363647E-3]
[null,"Baltimore Gas & Electric Co.",null,3270,0,3683,6953,null,0,2.6416695307717942E-2,0.47030058967352223,0,0.52969941032647783,1.2423787380445516E-2,0,1.3992907927272428E-2]
[null,"Commonweath Edison Co.",null,8696,0,10677,19373,null,0,7.3604291413263287E-2,0.44887214164042738,0,0.55112785835957256,3.3038915920597614E-2,0,4.0565375492665673E-2]
[null,"PECO Energy Co.",null,3589,0,4178,7767,null,0,2.950934452107655E-2,0.46208317239603452,0,0.53791682760396553,1.3635771531626593E-2,0,1.5873572989449958E-2]
[null,"Potomac Electric Power Co.",null,2864,0,2907,5771,null,0,2.1925895098639469E-2,0.49627447582741291,0,0.50372552417258709,1.0881262097124145E-2,0,1.1044633001515324E-2]
[null,"Atlantic City Electric Co.",null,1327,0,1276,{"$f":"SUM(C50:F50)","v":2603},null,0,9.8896387007032655E-3,0.50979638878217437,0,0.49020361121782557,5.0417020959789595E-3,0,4.8479366047243051E-3]
[14,"FIRSTENERGY CORP."]
[null,"Cleve. Elec. Illum./Ohio Ed./Toledo Ed.",null,2215.2873959999997,0,3295.9942780000001,5511.2816739999998,null,"FERC Form 1 (2019)",{"$f":"G52/$G$76","v":2.0939141196184046E-2},0.40195503097779062,0,0.59804496902220938,8.4165931481604891E-3,0,1.2522548048023557E-2]
[null,"Jersey Central Power & Light Co.",null,1650.8118039999999,0,3562.3237319999998,5213.1355359999998,null,"FERC Form 1 (2019)",1.980638761000271E-2,0.31666389500140557,0,0.68333610499859443,6.2719678464910385E-3,0,1.3534419763511671E-2]
[null,"Metropolitan Edison Co.",null,1048.977539,0,968.10457599999995,2017.0821149999999,null,"FERC Form 1 (2019)",7.6635471943912381E-3,0.52004701801641828,0,0.47995298198358177,3.985404865871252E-3,0,3.6781423285199865E-3]
[null,"Monongahela Power Co.",null,1522.368469,0,1315.5579519999999,2837.9264210000001,null,"FERC Form 1 (2019)",1.0782200139404497E-2,0.53643690609271089,0,0.46356309390728911,5.7839700836545445E-3,0,4.9982300557499526E-3]
[null,"Pennsylvania Electric Co.",null,1298.4911179999999,0,1318.0979159999999,2616.5890339999996,null,"FERC Form 1 (2019)",9.9412678349912291E-3,0.49625336693205757,0,0.50374663306794254,4.9333876346877642E-3,0,5.0078802003034658E-3]
[null,"The Potomac Edison Co.",null,500,0,594.25016900000003,1094.2501689999999,null,"FERC Form 1 (2019)",4.1574102265053738E-3,0.45693390247034088,0,0.54306609752965918,1.8996616789672043E-3,0,2.2577485475381697E-3]
[null,"West Penn Power Co.",null,975,0,888.78666599999997,1863.786666,null,"FERC Form 1 (2019)",7.0811282143404958E-3,0.52312854136493758,0,0.47687145863506247,3.7043402739860487E-3,0,3.3767879403544475E-3]
[null,"Pennsylvania Power",null,200,0,190.57248999999999,390.57249000000002,null,"FERC Form 1 (2019)",1.4839111842236033E-3,0.51206883516040769,0,0.4879311648395922,7.5986467158688166E-4,0,7.2404651263672148E-4]
[15,"HAWAIIAN ELEC."]
[null,"Hawaiian Electric Co.",null,1497.6669999999999,34.292999999999999,2047.3520000000001,{"$f":"SUM(C61:F61)","v":3579.3119999999999},null,0,{"$f":"G61/$G$76","v":1.3598963686934923E-2},0.41842314947677095,9.5808915232871578E-3,0.57199595899994193,5.6901212155075513E-3,1.3029019591364468E-4,7.7785522755137275E-3]
[16,"IDACORP"]
[null,"Idaho Power Co.",null,1836.6590000000001,0,2275.5590000000002,{"$f":"SUM(C63:F63)","v":4112.2180000000008},null,0,{"$f":"G63/$G$76","v":1.562364590031832E-2},0.44663463853326835,0,0.55336536146673154,6.9780614392604525E-3,0,8.6455844610578651E-3]
[17,"NORTHWESTERN CORP."]
[null,"NorthWestern Corporation",null,2245.6369,0,2039.092609,{"$f":"SUM(C65:F65)","v":4284.7295089999998},null,"FERC Form 1 (2019)",{"$f":"G65/$G$76","v":1.6279072905974527E-2},0.52410237222281564,0,0.47589762777718442,8.5319007276094139E-3,0,7.7471721783651136E-3]
[18,"OGE ENERGY CORP."]
[null,"Oklahoma G&E",null,3219.403953,0,3958.2331880000002,{"$f":"SUM(C67:F67)","v":7177.6371410000002},null,"FERC Form 1 (2019)",{"$f":"G67/$G$76","v":2.7270164444578845E-2},0.44853255880130316,0,0.55146744119869684,1.2231556637259267E-2,0,1.5038607807319578E-2]
[19,"OTTER TAIL CORP."]
[null,"Otter Tail Power Co.",null,612,0,640.16631700000005,{"$f":"SUM(C69:F69)","v":1252.1663170000002},null,"FERC Form 1 (2019)",{"$f":"G69/$G$76","v":4.7573847361968014E-3},0.48875296491464393,0,0.51124703508535596,2.325185895055858E-3,0,2.4321988411409429E-3]
[20,"PNM RESOURCES"]
[null,"Public Service Company of New Mexico",null,1748.02,11.529,1512.431,{"$f":"SUM(C71:F71)","v":3271.98},null,0,{"$f":"G71/$G$76","v":1.2431310040694225E-2},{"$f":"SUM(C71:D71)/$G71","v":0.53423920684111759},{"$f":"SUM(E71)/$G71","v":3.5235545449544313E-3},{"$f":"SUM(F71:F71)/$G71","v":0.46223723861392796},{"$f":"$J71*K71","v":6.641293216136504E-3},{"$f":"$J71*L71","v":4.3802398993625796E-5},{"$f":"$J71*M71","v":5.7462144255640947E-3}]
[null,"Texas-New Mexico Power Co.",null,670.69100000000003,0,754.62699999999995,{"$f":"SUM(C72:F72)","v":1425.318},null,0,{"$f":"G72/$G$76","v":5.4152439698843553E-3},0.47055534273755051,0,0.52944465726244949,2.5481719822563866E-3,0,2.8670719876279687E-3]
[21,"SEMPRA ENERGY"]
[null,"San Diego Gas & Electric",null,6362,0,7100,{"$f":"SUM(C74:F74)","v":13462},null,0,{"$f":"G74/$G$76","v":5.1146491044513007E-2},0.4725895112167583,0,0.5274104887832417,2.4171295203178709E-2,0,2.6975195841334298E-2]
[null,"Oncor Electric Delivery",null,7760.5447020000001,0,10137.396789,{"$f":"SUM(C75:F75)","v":17897.941491000001},null,"FERC Form 1 (2019)",{"$f":"G75/$G$76","v":6.8000067165699701E-2},0.43359984755243491,0,0.56640015244756503,2.9484818756602724E-2,0,3.8515248409096974E-2]
[null,null,null,null,null,null,{"$f":"SUM(G11:G75)","v":263204.76195100002},null,null,{"$f":"SUM(J11:J75)","v":0.99999999999999989},null,null,null,{"$f":"SUM(N11:N75)","v":0.47367276831872046},{"$f":"SUM(O11:O75)","v":9.5201875582573564E-3},{"$f":"SUM(P11:P75)","v":0.51680704412302214}]
[]
[null,null,null,null,null,null,null,null,null,null,null,null,null,{"$f":"SUM(N76:P76)","v":1}]
[]
[null,"(a) Includes current maturities."]