{"text_format":"1","workbook":"xlsx","n_sheets":17,"sheets":["Pres & Prop Rev","Rate Design","Exh1","Exh2","Exh3","Exh4","Exh5","ROR","BFG","Rate Spread","Bill Impact","Bill Determ","Block Usage","Big Schedules","12MEDEC18","121 to 111","Sch 111 Rate Design"],"not_rendered":{"charts":0,"images":0,"macros":1,"external_links":0,"defined_names":22,"comments":8,"pivot_tables":0},"unopened":[],"bounds":{"document_bytes":16777216,"sheet_cells":100000,"rows_first":2000,"rows_last":500,"rows_between":2000,"halvings":0,"cell_chars":16384,"cell_head_chars":4096},"cells_cut":0,"cells_raw":0,"read":"whole","date_system":"1900"}

{"sheet":"Pres & Prop Rev","index":0,"n_rows":275,"n_cols":17,"rows_kept":275,"cut":false,"hidden":false,"merged":[[5,16,10,18]]}
[]
[]
[null,null,null,null,null,null,null,null,null,"TRANSPORT"]
["WORK PAPER",null," ","GEN SERVICE","LRG GEN SVC","EX LRG GEN SVC","INTERRUPTIBLE","TRANSPORT","TRANSPORT","SCH 148 - WSU"]
["REFERENCE",null,"TOTAL","SCH. 101 & 102","SCH. 111,112&116","SCH. 121,122&126","SCH. 131&132","SCHEDULE 146","SCHEDULE 148","ANN. MINIMUM",null,null,null,null,null,null,"Print Header for all printed pages on this worksheet:"]
[null,"PRESENT BILL DETERMINANTS",null,null,null,null,null,null,null,null,null,null,"Calculate all revenue exhibits using  ____ rates:",null,null,null,{"$f":"\"AVISTA UTILITIES\nWASHINGTON NATURAL GAS\nPRO FORMA REVENUE UNDER PRESENT AND PROPOSED \"&O9&\" RATES\n12 MONTHS ENDED DECEMBER 31, 2018\"","v":"AVISTA UTILITIES\nWASHINGTON NATURAL GAS\nPRO FORMA REVENUE UNDER PRESENT AND PROPOSED BASE TARIFF RATES\n12 MONTHS ENDED DECEMBER 31, 2018"}]
[null,"THERMS",null,null,null,null,null,null,null,null,null,"1)","BASE TARIFF"]
["JDM-G-8","BLOCK 1",null,{"$f":"'Bill Determ'!E7","v":78130536.427342966},{"$f":"'Bill Determ'!B12","v":6375094.2101864293},{"$f":"'Bill Determ'!B29","v":17999.891669999983},{"$f":"'Bill Determ'!B36","v":240000},{"$f":"'Bill Determ'!B40","v":8493795},{"$f":"'Bill Determ'!B46","v":24532118},{"$f":"'Bill Determ'!B52","v":10599458},null,null,"or",null,1]
{"$rows_left_out":268}
{"sheet":"Rate Design","index":1,"n_rows":122,"n_cols":22,"rows_kept":122,"cut":false,"hidden":false,"merged":[]}
["PRESENT RATES",null,null,1,2,3,4,5,null,null,null,"Tiers - used for bill comparisons"]
[null,null,"TOTAL","SCH. 101","SCH. 111,112,116","SCH. 121,122,126","SCH. 132","SCH. 146",null,"Range Name",null,"SCH. 101","SCH. 111,112","SCH. 121,122","SCH. 131,132","SCH. 146"]
[null,"Base Tariff Rates"]
[1,"BASIC CHARGE",null,9.5,null,null,null,550]
[2,"MONTHLY MINIMUM",null,null,97.25,240.44]
[3,"BLOCK 1 PER THERM",null,36.722999999999999,0,0,24.655000000000001,9.69,null,null,null,9999999,200,500,10000,20000]
[4,"BLOCK 2 PER THERM",null,47.728999999999999,33.353999999999999,34.85,19.792000000000002,8.6210000000000004,{"$f":"H7/H6-1","v":-0.11031991744066039},null,null,9999999,1000,1000,25000,50000]
[5,"BLOCK 3 PER THERM",null,null,25.423999999999999,26.766999999999999,18.597999999999999,7.774,{"$f":"H8/H7-1","v":-9.8248463055330082E-2},"Rates_Base_Present",null,9999999,9999999,10000,50000,300000]
{"$rows_left_out":115}
{"sheet":"Exh1","index":2,"n_rows":44,"n_cols":22,"rows_kept":44,"cut":false,"hidden":false,"merged":[[0,13,2,14],[24,0,25,7]]}
["AVISTA UTILITIES",null,null,null,null,null,null,null,null,null,null,null,null,"This worksheet pulls data from 'Pres & Prop Rev' tab."]
["WASHINGTON NATURAL GAS"]
["PROPOSED INCREASE BY SERVICE SCHEDULE"]
["12 MONTHS ENDED DECEMBER 31, 2018"]
["(000s of Dollars)"]
[]
[]
[null,null,null,"Base Tariff",null,"Base Tariff","Base","Total Billed",null,null,"Percent "]
{"$rows_left_out":37}
{"sheet":"Exh2","index":3,"n_rows":20,"n_cols":12,"rows_kept":20,"cut":false,"hidden":false,"merged":[]}
["AVISTA UTILITIES",null,null,null,null,null,null,null,null,null,null,"This worksheet pulls data from 'ROR' tab."]
["WASHINGTON NATURAL GAS"]
["PRESENT & PROPOSED RATES OF RETURN BY RATE SCHEDULE"]
["12 MONTHS ENDED DECEMBER 31, 2018"]
[]
[]
[]
[]
{"$rows_left_out":13}
{"sheet":"Exh3","index":4,"n_rows":64,"n_cols":26,"rows_kept":64,"cut":false,"hidden":false,"merged":[[9,0,9,2],[14,21,14,22]]}
["AVISTA UTILITIES",null,null,null,null,null,null,null,null,null,null,null,null,null,null,"This worksheet uses Base & Billing rates from 'Rate Design' tab."]
["WASHINGTON NATURAL GAS"]
["PRESENT AND PROPOSED RATE COMPONENTS BY SCHEDULE"]
[]
[]
[]
[null,null,null,null,null,null,null,null,"Proposed"]
[null,null,null,"Present Base","Present",null,"General ","Proposed ","Base "]
{"$rows_left_out":57}
{"sheet":"Exh4","index":5,"n_rows":56,"n_cols":9,"rows_kept":56,"cut":false,"hidden":false,"merged":[]}
[]
[]
[]
[]
["AVISTA UTILITIES"]
["WASHINGTON NATURAL GAS"]
["PROPOSED INCREASE BY SERVICE SCHEDULE"]
["12 MONTHS ENDED DECEMBER 31, 2018"]
{"$rows_left_out":49}
{"sheet":"Exh5","index":6,"n_rows":51,"n_cols":8,"rows_kept":51,"cut":false,"hidden":false,"merged":[[45,0,46,6],[1,0,1,7],[2,0,2,7],[3,0,3,7],[4,0,4,7],[5,0,5,7],[23,0,24,6]]}
[]
["AVISTA UTILITIES"]
["WASHINGTON NATURAL GAS"]
["PROPOSED RATE PLAN (SCHEDULE 196) INCREASE"]
["12 MONTHS ENDED DECEMBER 31, 2018"]
["(000s of Dollars)"]
[]
["April 1, 2021 Increase"]
{"$rows_left_out":44}
{"sheet":"ROR","index":7,"n_rows":94,"n_cols":17,"rows_kept":94,"cut":false,"hidden":false,"merged":[]}
[null,"AVISTA UTILITIES"]
[null,"WASHINGTON GAS"]
[null,"PRESENT & PROPOSED RATE OF RETURN BY RATE SCHEDULE"]
[null,"12 MONTHS ENDED DECEMBER 31, 2016"]
[]
[]
[null,null,"Total","Sch 101","Sch 111","Sch 121","Sch 131","Sch 146"]
[null,"Total Rate Base",{"$f":"SUM(D8:H8)","v":398990999.99999994},321257220.73903728,59244238.429565534,0.22082633472281846,769069.01637623529,17720471.594194558,"from COS","\"Summary\" Line 467",null,null,{"$f":"D8/$C$8","v":0.80517410352373198},{"$f":"E8/$C$8","v":0.14848514986444691},5.5346194456220437E-10,1.9275347473407555E-3,4.4413211311018441E-2]
{"$rows_left_out":87}
{"sheet":"BFG","index":8,"n_rows":24,"n_cols":6,"rows_kept":24,"cut":false,"hidden":true,"merged":[]}
["AVISTA UTILITIES"]
["GAS ANNUAL MINIMUM DEFICIENCY FOR B.F. GOODRICH"]
["STATE OF WASHINGTON"]
["BASED ON 2007 ANNUAL MINIMUM"]
[]
[null,null,null,null,null,"Gas"]
["Annual Minimum Usage Requirement(1)",null,null,null,null,10500000]
["Less: Jan 09 - Dec 09 Usage(2)",null,null,null,null,{"$f":"SUMIF('Big Schedules'!$B$4:$B$48,\"BF Goodrich\",'Big Schedules'!$O$4:$O$48)","v":0}]
{"$rows_left_out":17}
{"sheet":"Rate Spread","index":9,"n_rows":23,"n_cols":10,"rows_kept":23,"cut":false,"hidden":false,"merged":[]}
[]
["Avista"]
["Natural Gas"]
["Rate Spread"]
[]
[]
[null,null,null,"Base Tariff",null,"Base",null,"Base Tariff","Total Billed","Percent "]
[null,null,null,"Distribution Revenue","Percentage ","Tariff","Proposed","Distribution Revenue","Revenue","Increase"]
{"$rows_left_out":16}
{"sheet":"Bill Impact","index":10,"n_rows":102,"n_cols":18,"rows_kept":102,"cut":false,"hidden":false,"merged":[]}
[]
["Schedule 101 Bill Impact"]
[]
[]
[]
["Schedule 101 Present",null,null,null,null,null,"Schedule 101 Proposed",null,null,null,null,null,null,null,null,"Yr 2"]
[null,"Basic Charge","Block 1","Block 2","Total Bill",null,"Basic Charge","Block 1","Block 2","Total Bill",null,"Bill Impact","% Change",null,null,"Bill Impact","Total Bill","% Change"]
[null,{"$f":"'Rate Design'!D4","v":9.5},{"$f":"'Rate Design'!D16/100","v":0.55907000000000007},{"$f":"'Rate Design'!D17/100","v":0.66913000000000011},null,null,{"$f":"'Rate Design'!D26","v":9.5},{"$f":"'Rate Design'!D38/100","v":0.62878999999999996},{"$f":"'Rate Design'!D39/100","v":0.75974000000000008}]
{"$rows_left_out":95}
{"sheet":"Bill Determ","index":11,"n_rows":57,"n_cols":8,"rows_kept":57,"cut":false,"hidden":false,"merged":[]}
["AVISTA UTILITIES"]
["WASHINGTON GAS"]
["USAGE & BILLINGS BY RATE SCHEDULE"]
["12 MONTHS ENDED DECEMBER 31, 2018"]
[]
["Schedule 101/102","Total therms","Total Billings",null,"0-70",">70","Total Therms"]
["therms per Revenue Run(1)(2)",{"$f":"'12MEDEC18'!P162","v":123968342.09020998},{"$f":"'12MEDEC18'!O26","v":1941495},null,{"$f":"'Block Usage'!O17","v":78130536.427342966},{"$f":"'Block Usage'!O18","v":45837805.662867025},{"$f":"SUM(D7:F7)","v":123968342.09020999}]
[null,null,null,null,null,null,{"$f":"'12MEDEC18'!P162","v":123968342.09020998}]
{"$rows_left_out":50}
{"sheet":"Block Usage","index":12,"n_rows":66,"n_cols":16,"rows_kept":66,"cut":false,"hidden":false,"merged":[]}
["WASHINGTON NATURAL GAS SYSTEM"]
[null,null,"January","February","March","April","May","June","July","August","September","October","November","December","Annual Total"]
["Rate Design Program Monthly Results"]
[null,"Schedule 101/102"]
[null,"Block 1",{"$f":"'12MEDEC18'!D54+'12MEDEC18'!D67","v":10524232.489080001},{"$f":"'12MEDEC18'!E54+'12MEDEC18'!E67","v":10061691.79439},{"$f":"'12MEDEC18'!F54+'12MEDEC18'!F67","v":10255778.751489999},{"$f":"'12MEDEC18'!G54+'12MEDEC18'!G67","v":9188098.1626500003},{"$f":"'12MEDEC18'!H54+'12MEDEC18'!H67","v":5512458.6299000001},{"$f":"'12MEDEC18'!I54+'12MEDEC18'!I67","v":2696906.7928200001},{"$f":"'12MEDEC18'!J54+'12MEDEC18'!J67","v":2255273.3151000002},{"$f":"'12MEDEC18'!K54+'12MEDEC18'!K67","v":1950475.62555},{"$f":"'12MEDEC18'!L54+'12MEDEC18'!L67","v":2251412.6811800003},{"$f":"'12MEDEC18'!M54+'12MEDEC18'!M67","v":4822544.1305600004},{"$f":"'12MEDEC18'!N54+'12MEDEC18'!N67","v":8249954.4405199997},{"$f":"'12MEDEC18'!O54+'12MEDEC18'!O67","v":10362255.78516},{"$f":"SUM(C5:N5)","v":78131082.598400012}]
[null,"Block 2",{"$f":"'12MEDEC18'!D55+'12MEDEC18'!D68","v":13383248.916239999},{"$f":"'12MEDEC18'!E55+'12MEDEC18'!E68","v":7346777.0500400001},{"$f":"'12MEDEC18'!F55+'12MEDEC18'!F68","v":8516900.2042899989},{"$f":"'12MEDEC18'!G55+'12MEDEC18'!G68","v":3625933.13277},{"$f":"'12MEDEC18'!H55+'12MEDEC18'!H68","v":608786.27544999996},{"$f":"'12MEDEC18'!I55+'12MEDEC18'!I68","v":191811.35051000002},{"$f":"'12MEDEC18'!J55+'12MEDEC18'!J68","v":188458.89171},{"$f":"'12MEDEC18'!K55+'12MEDEC18'!K68","v":135332.40104999999},{"$f":"'12MEDEC18'!L55+'12MEDEC18'!L68","v":190755.15787000002},{"$f":"'12MEDEC18'!M55+'12MEDEC18'!M68","v":472854.81367},{"$f":"'12MEDEC18'!N55+'12MEDEC18'!N68","v":2592797.0348300003},{"$f":"'12MEDEC18'!O55+'12MEDEC18'!O68","v":8584533.2633800004},{"$f":"SUM(C6:N6)","v":45838188.491810001}]
["Therms","Total",{"$f":"SUM(C5:C6)","v":23907481.40532},17408468.84443,18772678.955779999,12814031.29542,6121244.9053499997,2888718.1433300003,2443732.2068100004,2085808.0266,2442167.8390500005,5295398.9442300005,10842751.47535,18946789.04854,123969271.09021002]
[null,"Billed Customers",{"$f":"'12MEDEC18'!C26","v":160611},{"$f":"'12MEDEC18'!D26","v":160378},{"$f":"'12MEDEC18'!E26","v":161228},{"$f":"'12MEDEC18'!F26","v":160935},{"$f":"'12MEDEC18'!G26","v":161371},{"$f":"'12MEDEC18'!H26","v":161247},{"$f":"'12MEDEC18'!I26","v":161588},{"$f":"'12MEDEC18'!J26","v":161900},{"$f":"'12MEDEC18'!K26","v":160395},{"$f":"'12MEDEC18'!L26","v":164606},{"$f":"'12MEDEC18'!M26","v":163386},{"$f":"'12MEDEC18'!N26","v":163850},{"$f":"SUM(C8:N8)","v":1941495}]
{"$rows_left_out":59}
{"sheet":"Big Schedules","index":13,"n_rows":138,"n_cols":46,"rows_kept":138,"cut":false,"hidden":false,"merged":[]}
[null,"Washington Gas Billing Determinants by Customer"]
[null,null,null,null,null,null,null,null,null,null,null,null,null,null,null,null,"1st",{"$f":"Q3","v":20000},{"$f":"R3","v":50000},{"$f":"S3","v":300000},{"$f":"T3","v":500000},null,"Present","Proposed"]
[null,"ANNUAL USAGE, Sch 146",null,null,null,null,null,null,null,null,null,null,null,null,"12-mo ended",null,20000,50000,300000,500000,99999999,null,"Annual","Annual","Present Base","Proposed Base"]
[null,"Washington","2018-01-01","2018-02-01","2018-03-01","2018-04-01","2018-05-01","2018-06-01","2018-07-01","2018-08-01","2018-09-01","2018-10-01","2018-11-01","2018-12-01","Total",null,"thms/mo","thms/mo","thms/mo","thms/mo","thms/mo",null,"Minimum","Minimum","Revenue","Revenue"]
[1,null,415785,355464,355300,281721,204574,43693,30183,15503,18744,47441,187342,322385,{"$f":"SUM(C5:N5)","v":2278135},null,{"$f":"Q$3*12-SUMPRODUCT(--($C5:$N5<=Q$3),Q$3-$C5:$N5)","v":234247},{"$f":"R$3*12-SUM($Q5:Q5)-SUMPRODUCT(--($C5:$N5<=R$3),R$3-$C5:$N5)","v":271317},{"$f":"S$3*12-SUM($Q5:R5)-SUMPRODUCT(--($C5:$N5<=S$3),S$3-$C5:$N5)","v":1523637},{"$f":"T$3*12-SUM($Q5:S5)-SUMPRODUCT(--($C5:$N5<=T$3),T$3-$C5:$N5)","v":248934},{"$f":"U$3*12-SUM($Q5:T5)-SUMPRODUCT(--($C5:$N5<=U$3),U$3-$C5:$N5)","v":0},null,{"$f":"IF(O5<250000,(250000-O5)*'Exh3'!$E$56,0)","v":0},{"$f":"IF(O5<250000,(250000-O5)*'Exh3'!$I$56,0)","v":0},{"$f":"Q5*'Exh3'!$D$51+'Big Schedules'!R5*'Exh3'!$D$52+'Big Schedules'!S5*'Exh3'!$D$53+'Big Schedules'!T5*'Exh3'!$D$54+'Big Schedules'!U5*'Exh3'!$D$55+'Exh3'!$D$49*12+W5","v":189032.17851},{"$f":"Q5*'Exh3'!$I$51+'Big Schedules'!R5*'Exh3'!$I$52+'Big Schedules'!S5*'Exh3'!$I$53+'Big Schedules'!T5*'Exh3'!$I$54+'Big Schedules'!U5*'Exh3'!$I$55+'Exh3'!$I$49*12+X5","v":215722.65670999998},{"$f":"Z5/Y5-1","v":0.14119542191377765}]
[2,null,20735,20923,19103,20016,20036,19746,18315,18397,20766,18408,22562,20603,{"$f":"SUM(C6:N6)","v":239610},null,233969,{"$f":"R$3*12-SUM($Q6:Q6)-SUMPRODUCT(--($C6:$N6<=R$3),R$3-$C6:$N6)","v":5641},{"$f":"S$3*12-SUM($Q6:R6)-SUMPRODUCT(--($C6:$N6<=S$3),S$3-$C6:$N6)","v":0},{"$f":"T$3*12-SUM($Q6:S6)-SUMPRODUCT(--($C6:$N6<=T$3),T$3-$C6:$N6)","v":0},{"$f":"U$3*12-SUM($Q6:T6)-SUMPRODUCT(--($C6:$N6<=U$3),U$3-$C6:$N6)","v":0},null,{"$f":"IF(O6<250000,(250000-O6)*'Exh3'!$E$56,0)","v":925.22950000000003},{"$f":"IF(O6<250000,(250000-O6)*'Exh3'!$I$56,0)","v":1022.376},{"$f":"Q6*'Exh3'!$D$51+'Big Schedules'!R6*'Exh3'!$D$52+'Big Schedules'!S6*'Exh3'!$D$53+'Big Schedules'!T6*'Exh3'!$D$54+'Big Schedules'!U6*'Exh3'!$D$55+'Exh3'!$D$49*12+W6","v":30683.136210000001},{"$f":"Q6*'Exh3'!$I$51+'Big Schedules'!R6*'Exh3'!$I$52+'Big Schedules'!S6*'Exh3'!$I$53+'Big Schedules'!T6*'Exh3'!$I$54+'Big Schedules'!U6*'Exh3'!$I$55+'Exh3'!$I$49*12+X6","v":34954.421800000004},{"$f":"Z6/Y6-1","v":0.13920629106381699}]
[3,null,54601,38234,38819,43480,42408,38631,35552,39785,39786,42220,39343,50945,503804,null,240000,{"$f":"R$3*12-SUM($Q7:Q7)-SUMPRODUCT(--($C7:$N7<=R$3),R$3-$C7:$N7)","v":258258},{"$f":"S$3*12-SUM($Q7:R7)-SUMPRODUCT(--($C7:$N7<=S$3),S$3-$C7:$N7)","v":5546},{"$f":"T$3*12-SUM($Q7:S7)-SUMPRODUCT(--($C7:$N7<=T$3),T$3-$C7:$N7)","v":0},{"$f":"U$3*12-SUM($Q7:T7)-SUMPRODUCT(--($C7:$N7<=U$3),U$3-$C7:$N7)","v":0},null,{"$f":"IF(O7<250000,(250000-O7)*'Exh3'!$E$56,0)","v":0},{"$f":"IF(O7<250000,(250000-O7)*'Exh3'!$I$56,0)","v":0},{"$f":"Q7*'Exh3'!$D$51+'Big Schedules'!R7*'Exh3'!$D$52+'Big Schedules'!S7*'Exh3'!$D$53+'Big Schedules'!T7*'Exh3'!$D$54+'Big Schedules'!U7*'Exh3'!$D$55+'Exh3'!$D$49*12+W7","v":52551.568220000001},{"$f":"Q7*'Exh3'!$I$51+'Big Schedules'!R7*'Exh3'!$I$52+'Big Schedules'!S7*'Exh3'!$I$53+'Big Schedules'!T7*'Exh3'!$I$54+'Big Schedules'!U7*'Exh3'!$I$55+'Exh3'!$I$49*12+X7","v":59948.683779999999},0.14075917828052198]
[4,null,81743,80049,295451,72830,70934,58560,57728,12876,1,57429,46472,52903,886976,null,212877,{"$f":"R$3*12-SUM($Q8:Q8)-SUMPRODUCT(--($C8:$N8<=R$3),R$3-$C8:$N8)","v":296472},{"$f":"S$3*12-SUM($Q8:R8)-SUMPRODUCT(--($C8:$N8<=S$3),S$3-$C8:$N8)","v":377627},{"$f":"T$3*12-SUM($Q8:S8)-SUMPRODUCT(--($C8:$N8<=T$3),T$3-$C8:$N8)","v":0},{"$f":"U$3*12-SUM($Q8:T8)-SUMPRODUCT(--($C8:$N8<=U$3),U$3-$C8:$N8)","v":0},null,{"$f":"IF(O8<250000,(250000-O8)*'Exh3'!$E$56,0)","v":0},{"$f":"IF(O8<250000,(250000-O8)*'Exh3'!$I$56,0)","v":0},{"$f":"Q8*'Exh3'!$D$51+'Big Schedules'!R8*'Exh3'!$D$52+'Big Schedules'!S8*'Exh3'!$D$53+'Big Schedules'!T8*'Exh3'!$D$54+'Big Schedules'!U8*'Exh3'!$D$55+'Exh3'!$D$49*12+W8","v":82143.3554},{"$f":"Q8*'Exh3'!$I$51+'Big Schedules'!R8*'Exh3'!$I$52+'Big Schedules'!S8*'Exh3'!$I$53+'Big Schedules'!T8*'Exh3'!$I$54+'Big Schedules'!U8*'Exh3'!$I$55+'Exh3'!$I$49*12+X8","v":93723.884709999984},0.14097950167251128]
{"$rows_left_out":131}
{"sheet":"12MEDEC18","index":14,"n_rows":214,"n_cols":18,"rows_kept":214,"cut":false,"hidden":false,"merged":[]}
[]
[]
["Gas Revenue Meters Report by Location  Twelve Months Ended  for Report Date : '12/31/2018'"]
[]
["State Cde:WA"]
[]
[null,null,"Meters"]
[null,"Period",201801,201802,201803,201804,201805,201806,201807,201808,201809,201810,201811,201812,"12 Month Average","12 Month Total"]
{"$rows_left_out":207}
{"sheet":"121 to 111","index":15,"n_rows":91,"n_cols":24,"rows_kept":91,"cut":false,"hidden":false,"merged":[]}
["Determine 2018 Pro Forma Schedule 121 and Restated 111 customers and volumes.",null,null,null,null,null,null,null,null,null,null,null,null,null,null,null,null,"1st",{"$f":"R2","v":200},{"$f":"S2","v":1000}]
[null,null,null,null,null,null,null,null,null,null,null,null,null,null,null,null,null,200,1000,99999999]
[]
["Name","Account ID","Current Schedule","2018-01-01","2018-02-01","2018-03-01","2018-04-01","2018-05-01","2018-06-01","2018-07-01","2018-08-01","2018-09-01","2018-10-01","2018-11-01","2018-12-01","2018 Total","Sch 121/111 Cancel/ Rebill usage","Block 1\n1st 200 therms","Block 2\n201 - 1,000 therms","Block 3\nover 1,000 therms"]
[null,null,111,9991.32,7030.9859999999999,8563.6919999999991,6801.2749999999996,6657.7079999999996,4715.1840000000002,4646.9390000000003,4295.991,5872.3680000000004,5495.1229999999996,6966.19,9796.0265999999992,{"$f":"SUM(D5:O5)","v":80832.802599999995},null,{"$f":"R$2*12-SUMPRODUCT(--($D5:$O5<=R$2),R$2-$D5:$O5)","v":2400},{"$f":"S$2*12-SUM(R5:$R5)-SUMPRODUCT(--($D5:$O5<=S$2),S$2-$D5:$O5)","v":9600},{"$f":"T$2*12-SUM($R5:S5)-SUMPRODUCT(--($D5:$O5<=T$2),T$2-$D5:$O5)","v":68832.802599906921}]
[null,null,111,18246.376,19070.896000000001,15059.19,13986.58,12128.208000000001,12812.796,12194.04,13033.456,12317.214,14687.68,20223.955999999998,null,{"$f":"SUM(D6:O6)","v":163760.39200000002},null,{"$f":"R$2*12-SUMPRODUCT(--($D6:$O6<=R$2),R$2-$D6:$O6)","v":2200},{"$f":"S$2*12-SUM(R6:$R6)-SUMPRODUCT(--($D6:$O6<=S$2),S$2-$D6:$O6)","v":8800},{"$f":"T$2*12-SUM($R6:S6)-SUMPRODUCT(--($D6:$O6<=T$2),T$2-$D6:$O6)","v":152760.39199995995}]
[null,null,111,18303.52,18039.72,13178.463,9973.4470000000001,879.07899999999995,715.10400000000004,716.87599999999998,644.274,841.02700000000004,4820.5200000000004,11862.956,null,79974.986000000004,null,2200,{"$f":"S$2*12-SUM(R7:$R7)-SUMPRODUCT(--($D7:$O7<=S$2),S$2-$D7:$O7)","v":7596.3600000000006},{"$f":"T$2*12-SUM($R7:S7)-SUMPRODUCT(--($D7:$O7<=T$2),T$2-$D7:$O7)","v":70178.626000165939}]
[null,null,111,14356.423000000001,10786.315000000001,11185.253000000001,10637.2,9214.59,7238.4,7529.7560000000003,6631.84,6789.64,8104.32,8760.4940000000006,11741.630999999999,112975.86199999999,null,2400,{"$f":"S$2*12-SUM(R8:$R8)-SUMPRODUCT(--($D8:$O8<=S$2),S$2-$D8:$O8)","v":9600},{"$f":"T$2*12-SUM($R8:S8)-SUMPRODUCT(--($D8:$O8<=T$2),T$2-$D8:$O8)","v":100975.86199998856}]
{"$rows_left_out":84}
{"sheet":"Sch 111 Rate Design","index":16,"n_rows":73,"n_cols":24,"rows_kept":73,"cut":false,"hidden":false,"merged":[]}
[]
[null,null,null,null,null,null,null,null,null,null,null,null,null,null,null,null,200,1000,99999999]
[]
[null,null,null,null,null,null,null,null,null,null,null,null,null,null,"Annual Usage",null,500,1000,10000,25000,99999999]
["Schedule 121/122",null,"January","February","March","April","May","June","July","August","September","October","November","December"]
[null,null,null,null,null,null,null,null,null,null,null,null,null,null,null,null,"Block 1\n1st 500 therms","Block 2\n501 - 1,000 therms","Block 3\n1,001 - 10,000 therms","Block 4\n10,001 - 25,000 therms","Block 5\nover 25,000 therms"]
["Customer 1",121,97094.085000000006,80333.945999999996,69364.269,57291.588000000003,31598.7,28892.99,28870.634999999998,25322.026000000002,35158.072,39392.639999999999,60010.084000000003,83606.648000000001,{"$f":"SUM(C7:N7)","v":636935.68300000008},"Commercial",{"$f":"Q$4*12-SUMPRODUCT(--($C7:$N7<=Q$4),Q$4-$C7:$N7)","v":6000},{"$f":"R$4*12-SUM(Q7:$Q7)-SUMPRODUCT(--($C7:$N7<=R$4),R$4-$C7:$N7)","v":6000},{"$f":"S$4*12-SUM($Q7:R7)-SUMPRODUCT(--($C7:$N7<=S$4),S$4-$C7:$N7)","v":108000},{"$f":"T$4*12-SUM($Q7:S7)-SUMPRODUCT(--($C7:$N7<=T$4),T$4-$C7:$N7)","v":180000},{"$f":"U$4*12-SUM($Q7:T7)-SUMPRODUCT(--($C7:$N7<=U$4),U$4-$C7:$N7)","v":336935.68300008774}]
["Customer 2",121,47471.8,37653.046000000002,45223.936000000002,40774.095999999998,24492,45362.82,40939.879000000001,47349.154999999999,50581.8,47921.61,62403.12,50334.514999999999,540507.77699999989,"Industrial",{"$f":"Q$4*12-SUMPRODUCT(--($C8:$N8<=Q$4),Q$4-$C8:$N8)","v":6000},{"$f":"R$4*12-SUM(Q8:$Q8)-SUMPRODUCT(--($C8:$N8<=R$4),R$4-$C8:$N8)","v":6000},{"$f":"S$4*12-SUM($Q8:R8)-SUMPRODUCT(--($C8:$N8<=S$4),S$4-$C8:$N8)","v":108000},{"$f":"T$4*12-SUM($Q8:S8)-SUMPRODUCT(--($C8:$N8<=T$4),T$4-$C8:$N8)","v":179492},{"$f":"U$4*12-SUM($Q8:T8)-SUMPRODUCT(--($C8:$N8<=U$4),U$4-$C8:$N8)","v":241015.77699995041}]
{"$rows_left_out":65}