{"text_format":"1","workbook":"xlsx","n_sheets":23,"sheets":["Pres & Prop Rev","To Do","Rate Design","Exh 1","Exh 2","Exh 3","Exh 4","Exh 5","ROR","Rate Spread GRC","Bill Determ","Sch 93 PCRA","ERM Rebate Yr 1-3","Sch 25 - Billing Rate","Bill Impact","WA Sch 25","Lighting summary","St Lts","Area Lts","Capital Recovery Factor Calc","TIB","Block Data","REVRUNS 12ME1218"],"not_rendered":{"charts":0,"images":0,"macros":1,"external_links":1,"defined_names":49,"comments":8,"pivot_tables":0},"unopened":[],"bounds":{"document_bytes":16777216,"sheet_cells":100000,"rows_first":2000,"rows_last":500,"rows_between":2000,"halvings":0,"cell_chars":16384,"cell_head_chars":4096},"cells_cut":0,"cells_raw":0,"read":"whole","date_system":"1900"}

{"sheet":"Pres & Prop Rev","index":0,"n_rows":305,"n_cols":16,"rows_kept":305,"cut":false,"hidden":false,"merged":[[5,15,10,17],[94,1,95,7]]}
[]
[null,{"$f":"IF(Base1_Billing2=2,\"BILLED\",\"\")","v":""}]
[]
["WORK PAPER",null," ","RESIDENTIAL","GENERAL SVC. ","LG. GEN. SVC.","EX LG GEN SVC","PUMPING","ST & AREA LTG"]
["REFERENCE",null,"TOTAL","SCHEDULE 1,2","SCH. 11,12","SCH. 21,22","SCHEDULE 25","SCH. 30, 31, 32","SCH. 41-48",null,null,null,null,null,null,"Print Header for all printed pages on this worksheet:"]
[null,"PRESENT BILL DETERMINANTS",null,null,null,null,null,null,null,null,null,"Calculate all revenue exhibits using  ____ rates:",null,null,null,{"$f":"\"AVISTA UTILITIES\nWASHINGTON ELECTRIC\nPRO FORMA REVENUE UNDER PRESENT AND PROPOSED \"&N9&\" RATES\n12 MONTHS ENDED DECEMBER 31, 2018\"","v":"AVISTA UTILITIES\nWASHINGTON ELECTRIC\nPRO FORMA REVENUE UNDER PRESENT AND PROPOSED BASE TARIFF RATES\n12 MONTHS ENDED DECEMBER 31, 2018"}]
{"$rows_left_out":300}
{"sheet":"To Do","index":1,"n_rows":23,"n_cols":6,"rows_kept":23,"cut":false,"hidden":false,"merged":[]}
[]
[]
[]
[]
["Goodrich South Load",null,"25 or 21?","proform minimum if 25"]
[]
{"$rows_left_out":18}
{"sheet":"Rate Design","index":2,"n_rows":127,"n_cols":23,"rows_kept":127,"cut":false,"hidden":false,"merged":[]}
["PRESENT RATES",null,null,1,2,3,4,5,6,null,null,null,null,"Tiers - used for bill comparisons"]
[null,null,"TOTAL","SCH. 1,2","SCH. 11,12","SCH. 21,22","SCH. 25","SCH. 30, 31, 32",null,null,null,"Range Name",null,"SCHEDULE 1,2","SCH. 11,12","SCH. 21,22","SCHEDULE 25","SCH. 30, 31, 32"]
[null,"Base Tariff Rates"]
[1,"BASIC CHARGE",null,9,20,0,0,20]
[2,"BLOCK 1 PER KWH",null,7.5330000000000004,11.349,7.1890000000000001,5.5049999999999999,9.7119999999999997,null,null,null,null,null,800,3650,250000,500000]
[3,"BLOCK 2 PER KWH",null,8.7650000000000006,8.3409999999999993,6.43,4.9530000000000003,6.9359999999999999,null,null,null,null,null,1500,9999999,9999999,9999999]
{"$rows_left_out":122}
{"sheet":"Exh 1","index":3,"n_rows":65,"n_cols":27,"rows_kept":65,"cut":false,"hidden":false,"merged":[[4,0,4,17],[0,20,2,21],[0,0,0,17],[1,0,1,17],[2,0,2,17],[3,0,3,17]]}
["AVISTA UTILITIES",null,null,null,null,null,null,null,null,null,null,null,null,null,null,null,null,null,null,null,"This worksheet pulls data from 'Pres & Prop Rev' tab."]
["WASHINGTON ELECTRIC"]
["PROPOSED INCREASE BY SERVICE SCHEDULE"]
["12 MONTHS ENDED DECEMBER 31, 2018"]
["(000s of Dollars)"]
[]
{"$rows_left_out":60}
{"sheet":"Exh 2","index":4,"n_rows":20,"n_cols":12,"rows_kept":20,"cut":false,"hidden":false,"merged":[]}
["AVISTA UTILITIES",null,null,null,null,null,null,null,null,null,null,"This worksheet pulls data from 'ROR' tab."]
["WASHINGTON ELECTRIC"]
["PRESENT & PROPOSED RATES OF RETURN BY RATE SCHEDULE"]
["12 MONTHS ENDED DECEMBER 31, 2018"]
[]
[]
{"$rows_left_out":15}
{"sheet":"Exh 3","index":5,"n_rows":64,"n_cols":23,"rows_kept":64,"cut":false,"hidden":false,"merged":[[10,0,10,2]]}
["AVISTA UTILITIES",null,null,null,null,null,null,null,null,null,null,null,null,null,null,null,null,null,"This worksheet uses Base & Billing rates from 'Rate Design' tab."]
["WASHINGTON ELECTRIC"]
["PRESENT AND PROPOSED RATE COMPONENTS BY SCHEDULE"]
[]
[]
[]
{"$rows_left_out":59}
{"sheet":"Exh 4","index":6,"n_rows":64,"n_cols":18,"rows_kept":64,"cut":false,"hidden":false,"merged":[[60,0,61,7],[57,0,59,7],[0,0,0,7],[1,0,1,7],[2,0,2,7],[3,0,3,7],[4,0,4,7]]}
["AVISTA UTILITIES"]
["WASHINGTON ELECTRIC"]
["PROPOSED INCREASE BY SERVICE SCHEDULE"]
["12 MONTHS ENDED DECEMBER 31, 2018"]
["(000s of Dollars)"]
[]
{"$rows_left_out":59}
{"sheet":"Exh 5","index":7,"n_rows":60,"n_cols":8,"rows_kept":60,"cut":false,"hidden":false,"merged":[[2,0,2,7],[3,0,3,7],[30,0,31,6],[59,0,60,6],[0,0,0,7],[1,0,1,7]]}
["AVISTA UTILITIES"]
["WASHINGTON ELECTRIC"]
["PROPOSED RATE PLAN (SCHEDULE 96) INCREASE"]
["12 MONTHS ENDED DECEMBER 31, 2018"]
[]
[]
{"$rows_left_out":55}
{"sheet":"ROR","index":8,"n_rows":83,"n_cols":11,"rows_kept":83,"cut":false,"hidden":false,"merged":[]}
[null,"AVISTA UTILITIES"]
[null,"WASHINGTON ELECTRIC"]
[null,"PRESENT & PROPOSED RATE OF RETURN BY RATE SCHEDULE"]
[null,"12 MONTHS ENDED DECEMBER 31, 2016"]
[]
[]
{"$rows_left_out":78}
{"sheet":"Rate Spread GRC","index":9,"n_rows":31,"n_cols":12,"rows_kept":31,"cut":false,"hidden":false,"merged":[]}
[]
[]
["Avista"]
["Electric"]
["Rate Spread"]
[]
{"$rows_left_out":26}
{"sheet":"Bill Determ","index":10,"n_rows":86,"n_cols":7,"rows_kept":86,"cut":false,"hidden":false,"merged":[]}
["AVISTA UTILITIES"]
["WASHINGTON ELECTRIC"]
["ACTUAL / PRO FORMA BILLING DETERMINANTS BY RATE SCHEDULE"]
["12 MONTHS ENDED DECEMBER 31, 2016"]
[]
[]
{"$rows_left_out":81}
{"sheet":"Sch 93 PCRA","index":11,"n_rows":32,"n_cols":7,"rows_kept":32,"cut":false,"hidden":false,"merged":[]}
[]
[]
["Schedule 93"]
["Power Cost Rate Adjustment"]
[]
[]
{"$rows_left_out":27}
{"sheet":"ERM Rebate Yr 1-3","index":12,"n_rows":84,"n_cols":22,"rows_kept":84,"cut":false,"hidden":false,"merged":[]}
[]
[]
["Schedule 93"]
["Energy Recovery Mechanism Adjustment"]
[]
[]
{"$rows_left_out":79}
{"sheet":"Sch 25 - Billing Rate","index":13,"n_rows":60,"n_cols":28,"rows_kept":60,"cut":false,"hidden":false,"merged":[]}
["WA 2017 GRC",null,null,"Billing Rates",null,null,null,null,null,{"$f":"D1","v":"Billing Rates"}]
[null,null,null,null,null,null,null,null,null,"PRESENT RATES",null,"Block1","Block2","Block3"]
["PRESENT",null,null,null,null,null,null,null,null,"Base-->",{"$f":"'Rate Design'!G9","v":24000},{"$f":"'Rate Design'!G5/100","v":5.5050000000000002E-2},{"$f":"'Rate Design'!G6/100","v":4.9530000000000005E-2},{"$f":"'Rate Design'!G7/100","v":4.2350000000000006E-2},{"$f":"'Rate Design'!G10","v":6.5},-0.2,-1.1000000000000001,-1.4]
[null,null,"Kwh usage",null,null,"kva usage","KVA usage",null,null,"Billing-->",{"$f":"'Rate Design'!G19","v":24000},{"$f":"'Rate Design'!G15/100","v":5.7499999999999989E-2},{"$f":"'Rate Design'!G16/100","v":5.1979999999999998E-2},{"$f":"'Rate Design'!G17/100","v":4.4039999999999996E-2},{"$f":"'Rate Design'!G20","v":6.5},-0.2,-1.1000000000000001,-1.4]
[null,null,"Block1","Block2","Block3","> 3000",">= 11 kv",">= 60 kv",">= 115 kv",null,"Cust Chg","Energy",null,null,"Demand","PV Discount",null,null,"Total"]
[1,{"$f":"'WA Sch 25'!B4","v":"Goodrich - North 2311008572"},{"$f":"'WA Sch 25'!Q4","v":6000000},{"$f":"'WA Sch 25'!R4","v":61924320},{"$f":"'WA Sch 25'!S4","v":781606.79999995232},{"$f":"'WA Sch 25'!P68","v":95148.953999999998},{"$f":"'WA Sch 25'!P41","v":131148.954},null,null,null,{"$f":"$K$4*12","v":288000},{"$f":"C6*$L$4","v":344999.99999999994},{"$f":"D6*$M$4","v":3218826.1535999998},{"$f":"E6*$N$4","v":34421.9634719979},{"$f":"F6*$O$4","v":618468.201},{"$f":"G6*$P$4","v":-26229.790800000002},{"$f":"H6*$Q$4","v":0},{"$f":"I6*$R$4","v":0},{"$f":"SUM(K6:R6)","v":4478486.5272719981}]
{"$rows_left_out":55}
{"sheet":"Bill Impact","index":14,"n_rows":29,"n_cols":18,"rows_kept":29,"cut":false,"hidden":false,"merged":[]}
[]
[]
["Schedule 001 Bill Impact"]
[]
[]
[]
{"$rows_left_out":24}
{"sheet":"WA Sch 25","index":15,"n_rows":170,"n_cols":21,"rows_kept":170,"cut":false,"hidden":false,"merged":[]}
["Washington Schedule 25 Billing Determinants",null,null,null,null,null,null,null,null,null,null,null,null,null,null,null,"1st",{"$f":"Q2","v":500000},{"$f":"R2","v":6000000}]
[null,null,null,null,null,null,null,null,null,null,null,null,null,null,null,"12-mo Ended",500000,6000000,99999999]
["KWHs",null,"Acct No.","2018-01-01","2018-02-01","2018-03-01","2018-04-01","2018-05-01","2018-06-01","2018-07-01","2018-08-01","2018-09-01","2018-10-01","2018-11-01","2018-12-01","Total","kwhs/mo","kwhs/mo","kwhs/mo"]
[1,"Goodrich - North 2311008572","2311008572",5417357.4000000004,5209482.5999999996,5598083.4000000004,5938930.2000000002,6179069.4000000004,5771215.7999999998,6205584,6286131.5999999996,5214997.2,6027205.7999999998,4774253.4000000004,6083616,{"$f":"SUM(D4:O4)","v":68705926.799999997},{"$f":"Q$2*12-SUMPRODUCT(--($D4:$O4<=Q$2),Q$2-$D4:$O4)","v":6000000},{"$f":"R$2*12-SUM($Q4:Q4)-SUMPRODUCT(--($D4:$O4<=R$2),R$2-$D4:$O4)","v":61924320},{"$f":"S$2*12-SUM($Q4:R4)-SUMPRODUCT(--($D4:$O4<=S$2),S$2-$D4:$O4)","v":781606.79999995232}]
[22,"Goodrich - South 2311155858 (No PVD)",2311155858,606597,661977.19999999995,727160,697581,691017.6,762333.6,723049.6,817499.2,511733.6,638428,649174.4,720994.4,{"$f":"SUM(D5:O5)","v":8207545.6000000006},{"$f":"Q$2*12-SUMPRODUCT(--($D5:$O5<=Q$2),Q$2-$D5:$O5)","v":6000000},{"$f":"R$2*12-SUM($Q5:Q5)-SUMPRODUCT(--($D5:$O5<=R$2),R$2-$D5:$O5)","v":2207545.6000000015},{"$f":"S$2*12-SUM($Q5:R5)-SUMPRODUCT(--($D5:$O5<=S$2),S$2-$D5:$O5)","v":0}]
[23,"Boise Cascade LLC Inland Region",7600951015,979473.6,895377,951957.3,876397.2,896023.8,891303,781783.8,831364.8,779045.4,873927.6,836098.2,812217,{"$f":"SUM(D6:O6)","v":10404968.699999999},{"$f":"Q$2*12-SUMPRODUCT(--($D6:$O6<=Q$2),Q$2-$D6:$O6)","v":6000000},{"$f":"R$2*12-SUM($Q6:Q6)-SUMPRODUCT(--($D6:$O6<=R$2),R$2-$D6:$O6)","v":4404968.6999999955},{"$f":"S$2*12-SUM($Q6:R6)-SUMPRODUCT(--($D6:$O6<=S$2),S$2-$D6:$O6)","v":0}]
{"$rows_left_out":165}
{"sheet":"Lighting summary","index":16,"n_rows":55,"n_cols":16,"rows_kept":55,"cut":false,"hidden":false,"merged":[[6,2,6,3],[6,5,6,6]]}
[null,"AVISTA UTILITIES"]
[null,"WASHINGTON ELECTRIC"]
[null,"STREET & AREA LIGHT REVENUE UNDER PRESENT & PROPOSED RATES"]
[null,"12 MONTHS ENDED DECEMBER 31, 2018"]
[]
[]
{"$rows_left_out":50}
{"sheet":"St Lts","index":17,"n_rows":139,"n_cols":74,"rows_kept":139,"cut":false,"hidden":false,"merged":[]}
["Street Light Summary",null,null,null,null,null,null,null,"WASHINGTON Street Lights",null,null,null,null,null,null,null,null,null,null,null,null,null,null,null,null,null,null,null,null,null,null,null,null,null,null,"% rate increase -->",{"$f":"'Lighting summary'!L11","v":0},{"$f":"'Lighting summary'!L12","v":0},{"$f":"'Lighting summary'!L13","v":0},{"$f":"'Lighting summary'!L14","v":0},{"$f":"'Lighting summary'!L15","v":0},null,null,null,null,null,null,null,null,null,null,null,null,null,null,{"$f":"-0.00475-0.00048","v":-5.2300000000000003E-3},"compare input Present Billing Rates to calculated Present Billing Rates",null,null,null,null,null,null,{"$f":"BE2","v":1.0142}]
["MDM-10069 Report as of 1/1/19",null,null,null,null,null,null,null,null,null,null,null,"Number of Lights(1)",null,null,null,null,null,"Present Rates",null,null,null,null,null,"Monthly Revenue at Present Rates",null,null,null,null,null,"Number of Lights",null,null,null,null,null,"Proposed Rates",null,null,null,null,null,"Monthly Revenue at Proposed Rates",null,null,null,null,null,null,"Present Billing Rates",null,null,null,null,null,2.017E-2,{"$f":"1+'Lighting summary'!I39","v":1.0142},"Sch 91 & 92",null,null,null,null,null,"New Billing Rates",null,null,null,null,null,"Increase"]
[null,null,null,null,null,null,null,null,"Fixture Type","Pole Facility","Size","Sched","041","042","044","045","046",null,"041","042","044","045","046",null,"041","042","044","045","046",null,"041","042","044","045","046",null,"041","042","044","045","046",null,"041","042","044","045","046",null,"kwh","041","042","044","045","046",null,"Sch 93/94","041","042","044","045","046",null,null,"041","042","044","045","046",null,"041","042","044","045","046"]
[null,null,null,null,null,null,null,null,"Single Mercury Vapor","Direct Burial",4000,214,{"$f":"SUMIF($G:$G,TEXT(M$3,\"000\")&TEXT($L4,\"000\"),$E:$E)","v":59},0,0,0,0,null,14.29,0,0,0,0,null,{"$f":"IF(AND(M4<>0,S4=0),#VALUE!,M4*S4)","v":843.1099999999999},{"$f":"IF(AND(N4<>0,T4=0),#VALUE!,N4*T4)","v":0},{"$f":"IF(AND(O4<>0,U4=0),#VALUE!,O4*U4)","v":0},{"$f":"IF(AND(P4<>0,V4=0),#VALUE!,P4*V4)","v":0},{"$f":"IF(AND(Q4<>0,W4=0),#VALUE!,Q4*W4)","v":0},null,{"$f":"M4","v":59},{"$f":"N4","v":0},{"$f":"O4","v":0},{"$f":"P4","v":0},{"$f":"Q4","v":0},null,{"$f":"ROUND(S4*(1+AK$1),2)","v":14.29},0,{"$f":"ROUND(U4*(1+AM$1),2)","v":0},{"$f":"ROUND(V4*(1+AN$1),2)","v":0},{"$f":"ROUND(W4*(1+AO$1),2)","v":0},null,{"$f":"IF(AND(AE4<>0,AK4=0),#VALUE!,AE4*AK4)","v":843.1099999999999},{"$f":"IF(AND(AF4<>0,AL4=0),#VALUE!,AF4*AL4)","v":0},{"$f":"IF(AND(AG4<>0,AM4=0),#VALUE!,AG4*AM4)","v":0},{"$f":"IF(AND(AH4<>0,AN4=0),#VALUE!,AH4*AN4)","v":0},{"$f":"IF(AND(AI4<>0,AO4=0),#VALUE!,AI4*AO4)","v":0},{"$f":"SUM(AQ4:AU4)-SUM(Y4:AC4)","v":0},42,15.12,null,null,null,null,null,{"$f":"ROUND(AW4*$BD$2,2)+ROUND(AW4*$BD$1,2)","v":0.63},{"$f":"ROUND((S4*$BE$2),2)+ROUND($BD4-AX4,2)","v":0},null,null,null,null,null,null,{"$f":"AK4*$BL$1","v":14.492918},{"$f":"AL4*$BL$1","v":0},{"$f":"AM4*$BL$1","v":0},{"$f":"AN4*$BL$1","v":0},{"$f":"AO4*$BL$1","v":0},null,{"$f":"BL4-AX4","v":-0.6270819999999997},{"$f":"BM4-AY4","v":0},{"$f":"BN4-AZ4","v":0},{"$f":"BO4-BA4","v":0},{"$f":"BP4-BB4","v":0}]
[null,"State","Sched","Rate Sub","# of Lights",null,null,null,"Single High-Pressure Sodium Vapor","Direct Burial","50W",234,0,108,0,0,0,null,0,13.42,0,0,0,null,{"$f":"IF(AND(M5<>0,S5=0),#VALUE!,M5*S5)","v":0},{"$f":"IF(AND(N5<>0,T5=0),#VALUE!,N5*T5)","v":1449.36},{"$f":"IF(AND(O5<>0,U5=0),#VALUE!,O5*U5)","v":0},{"$f":"IF(AND(P5<>0,V5=0),#VALUE!,P5*V5)","v":0},{"$f":"IF(AND(Q5<>0,W5=0),#VALUE!,Q5*W5)","v":0},null,{"$f":"M5","v":0},{"$f":"N5","v":108},0,0,0,null,0,13.42,0,0,0,null,0,1449.36,0,0,0,0,20,null,13.9,null,null,null,null,{"$f":"ROUND(AW5*$BD$2,2)+ROUND(AW5*$BD$1,2)","v":0.30000000000000004},null,{"$f":"ROUND((T5*$BE$2)+$BD5-AY5,2)","v":0.01},null,null,null,null,null,{"$f":"AK5*$BL$1","v":0},{"$f":"AL5*$BL$1","v":13.610564},{"$f":"AM5*$BL$1","v":0},0,0,null,{"$f":"BL5-AX5","v":0},{"$f":"BM5-AY5","v":-0.28943600000000025},{"$f":"BN5-AZ5","v":0},{"$f":"BO5-BA5","v":0},{"$f":"BP5-BB5","v":0}]
[null,null,null,null,null,null,null,null,"High-Pressure Sodium Vapor","Dusk to Dawn","70W",335,0,0,0,0,8,null,0,0,0,0,3.45,null,0,0,0,0,27.6,null,0,0,0,0,8,null,0,0,0,0,3.45,null,0,0,0,0,27.6,0,25,null,null,null,null,3.87,null,0.37,null,null,null,null,{"$f":"ROUND((W6*$BE$2)+$BD6-BB6,2)","v":0},null,null,0,0,0,0,3.49899,null,0,0,0,0,-0.37101000000000006]
{"$rows_left_out":134}
{"sheet":"Area Lts","index":18,"n_rows":91,"n_cols":49,"rows_kept":91,"cut":false,"hidden":false,"merged":[]}
["Area Light Summary",null,null,null,null,null,null,null,"WASHINGTON Area Lights",null,null,null,null,null,null,null,null,null,"Monthly Rev.",null,null,null,null,null,null,{"$f":"SL_RateIncr","v":0},null,null,"% rate increase -->",{"$f":"'Lighting summary'!L16","v":0},null,null,"Monthly Rev.",null,null,-5.1000000000000004E-4,8.6199999999999992E-3,{"$f":"-0.00037","v":-3.6999999999999999E-4},null,null,null,"compare input Present Billing Rates to calculated Present Billing Rates"]
[{"$f":"'St Lts'!A2","v":"MDM-10069 Report as of 1/1/19"},null,null,null,null,null,null,null,null,null,null,null,"# of Lights(1)",null,null,"Pres. Rates",null,null,"at Pres. Rates",null,null,"# of Lights(1)",null,null,null,null,"# of Lights",null,null,"Prop. Rates",null,null,"at Prop. Rates",null,null,null,"Pres. Billing Rates",null,null,null,null,{"$f":"'St Lts'!BE2","v":1.0142},{"$f":"'St Lts'!BF2","v":"Sch 91 & 92"},null,"New Billing Rates",null,{"$f":"'Lighting summary'!I39","v":1.4200000000000001E-2},"Increase"]
[null,null,null,null,null,null,null,null,"Fixture Type","Pole Facility","Size","Sched","047","048",null,"047","048",null,"047","048",null,"047","048",null,null,null,"047","048",null,"047","048",null,"047","048",null,"kwh","047","048","Sch 59","Sch 93","Sch 98","047","048",null,"047","048",null,"047","048"]
[null,null,null,null,null,null,null,null,"Sodium Vapor","Granville w/16' decorative pole","100W","HAG",{"$f":"SUMIF($G:$G,TEXT(M$3,\"000\")&TEXT($L4,\"000\"),$E:$E)","v":0},0,null,29.98,{"$f":"P4","v":29.98},null,{"$f":"IF(AND(M4<>0,P4=0),#VALUE!,M4*P4)","v":0},{"$f":"IF(AND(N4<>0,Q4=0),#VALUE!,N4*Q4)","v":0},null,{"$f":"SUMIF($G:$G,TEXT(V$3,\"000\")&TEXT($L4,\"000\"),$E:$E)","v":0},0,null,null,null,{"$f":"M4","v":0},{"$f":"N4","v":0},null,{"$f":"ROUND(P4*(1+AD$1),2)","v":29.98},{"$f":"AD4","v":29.98},null,{"$f":"IF(AND(AA4<>0,AD4=0),#VALUE!,AA4*AD4)","v":0},{"$f":"IF(AND(AB4<>0,AE4=0),#VALUE!,AB4*AE4)","v":0},null,40,30.04,30.02,{"$f":"ROUND($AJ$1*$AJ4,2)","v":-0.02},{"$f":"ROUND($AK$1*$AJ4,2)","v":0.34},{"$f":"ROUND($AL$1*$AJ4,2)","v":-0.01},{"$f":"ROUND(P4*$AP$2-AK4+AN4+AO4,2)","v":0.7},{"$f":"ROUND(Q4*$AP$2-AL4+AM4+AN4+AO4,2)","v":0.7},null,{"$f":"AD4*$AU$2","v":0.42571600000000004},{"$f":"AE4*$AU$2+AM4","v":0.40571600000000002},null,{"$f":"AS4-AK4","v":-29.614283999999998},{"$f":"AT4-AL4","v":-29.614283999999998}]
[null,"State","Sched","Rate Sub","# of Lights",null,null,null,"Sodium Vapor","Floodlight on existing standard","250W","HAH",104,4,null,22.18,{"$f":"P5","v":22.18},null,{"$f":"IF(AND(M5<>0,P5=0),#VALUE!,M5*P5)","v":2306.7199999999998},88.72,null,104,4,null,null,null,{"$f":"M5","v":104},4,null,22.18,{"$f":"AD5","v":22.18},null,2306.7199999999998,88.72,null,107,22.86,22.81,{"$f":"ROUND($AJ$1*$AJ5,2)","v":-0.05},{"$f":"ROUND($AK$1*$AJ5,2)","v":0.92},{"$f":"ROUND($AL$1*$AJ5,2)","v":-0.04},{"$f":"ROUND(P5*$AP$2-AK5+AN5+AO5,2)","v":0.51},{"$f":"ROUND(Q5*$AP$2-AL5+AM5+AN5+AO5,2)","v":0.51},null,{"$f":"AD5*$AU$2","v":0.31495600000000001},{"$f":"AE5*$AU$2+AM5","v":0.26495600000000002},null,{"$f":"AS5-AK5","v":-22.545044000000001},{"$f":"AT5-AL5","v":-22.545043999999997}]
[null,null,null,null,null,null,null,null,"Sodium Vapor","Kim light w/25' fiberglass pole","100W","HAI",17,2,null,28.96,28.96,null,492.32,57.92,null,17,2,null,null,null,17,2,null,28.96,{"$f":"AD6","v":28.96},null,492.32,57.92,null,40,29.02,29,-0.02,0.34,-0.01,0.68,0.68,null,{"$f":"AD6*$AU$2","v":0.41123200000000004},0.39123200000000002,null,-28.608767999999998,-28.608768000000001]
{"$rows_left_out":86}
{"sheet":"Capital Recovery Factor Calc","index":19,"n_rows":40,"n_cols":16,"rows_kept":40,"cut":false,"hidden":false,"merged":[]}
[]
[]
[]
[]
["Avista",null,null,null,null,"Avista",null,null,null,null,null,"Avista"]
["Capital Recovery Factor Calculation",null,null,null,null,"Capital Recovery Factor Calculation",null,null,null,null,null,"Capital Recovery Factor Calculation"]
{"$rows_left_out":35}
{"sheet":"TIB","index":20,"n_rows":22,"n_cols":6,"rows_kept":22,"cut":false,"hidden":false,"merged":[]}
[]
["Avista"]
["TIB Rate Calculation"]
["Schedule 42"]
[]
[null,"Engineering Estimate","Capital Cost  ","Annual Capital ","Monthly Capital "]
{"$rows_left_out":17}
{"sheet":"Block Data","index":21,"n_rows":101,"n_cols":19,"rows_kept":101,"cut":false,"hidden":false,"merged":[]}
[]
[]
["WASHINGTON ELECTRIC SYSTEM"]
[null,null,"January","February","March","April","May","June","July","August","September","October","November","December","Annual Total"]
["Rate Design Program Monthly Results"]
[null,"Schedule 001/002"]
{"$rows_left_out":96}
{"sheet":"REVRUNS 12ME1218","index":22,"n_rows":578,"n_cols":16,"rows_kept":578,"cut":false,"hidden":false,"merged":[]}
[]
[]
["Electric Revenue Meters Report by Location  Twelve Months Ended  for Report Date : '12/31/2018'"]
[]
["State Cde:WA"]
[]
{"$rows_left_out":572}